{"text_format":"1","workbook":"xlsx","n_sheets":80,"sheets":["Accueil","Elite Nationale Bastide Médical","Nationale_1","Nationale_2_poule_A","Nationale_2_poule_B","Nationale_3_poule_A","Nationale_3_poule_B","Nationale_3_poule_C","Nationale_3_poule_D","Nationale_3_poule_E","Liste équipes","ENT CHALON DIJON BF","HURRICANE 92","HYERES","LANNION","LE CANNET","LE PUY","MARSEILLE","MEAUX","TOULOUSE","BORDEAUX","CAPSAAA","CAUSSADE","ENT CHALON DIJON BF 2","DOUAI","FEURS","LILLE","MEAUX 2","MEYLAN","STRASBOURG","ENT BELFORT BESANCON 1","CAPPELLE LA GRANDE","CORBEIL","GRAVELINES","LE PUY 2","LYON","VANDOEUVRE","AMIENS","AULNOYE","BLANQUEFORT","CAMBRAI","BASKET FAUTEUIL FEMININ","LANNION 2","SAINT HERBLAIN","BERCK","CAPSAAA 2","SUD OISE SPORTS ET HANDICAPS","CERGY PONTOISE","ENT-HURRICANE-PBF","LILLE 2","ORLEANS","SAINT OUEN","VALENCIENNES","AUXERRE","ENT BELFORT BESANCON 2","ENT CHALON DIJON 3","JARNY","MULHOUSE","STRASBOURG 2","THIONVILLE","TROYES","VANDOEUVRE 2","CHAMBRAY","EQUEURDREVILLE","ENT LAVAL-RENNES","QUIMPER","SAINT HERBLAIN 2","SAINT POL DE LEON","YFFINIAC","ANGLET","ASMTH","PAVIE","LA ROCHELLE","POLE NATIONAL","TOULOUSE 2","LE CANNET 2","GUILHERAND","HYERES 2","MARSEILLE 2","MONTPELLIER"],"not_rendered":{"charts":0,"images":34,"macros":1,"external_links":2,"defined_names":97,"comments":0,"pivot_tables":0},"unopened":[],"bounds":{"document_bytes":16777216,"sheet_cells":100000,"rows_first":2000,"rows_last":500,"rows_between":2000,"halvings":0,"cell_chars":16384,"cell_head_chars":4096},"cells_cut":0,"cells_raw":0,"read":"whole","date_system":"1900"}

{"sheet":"Accueil","index":0,"n_rows":0,"n_cols":0,"rows_kept":0,"cut":false,"hidden":false,"merged":[]}

{"sheet":"Elite Nationale Bastide Médical","index":1,"n_rows":39,"n_cols":41,"rows_kept":39,"cut":false,"hidden":false,"merged":[[24,7,24,8],[26,11,27,11],[24,10,25,10],[24,30,25,30],[24,11,25,11],[26,10,27,10],[29,3,30,11],[8,25,8,26],[5,3,5,11],[5,23,5,31],[6,3,6,11],[6,23,6,31],[29,23,30,31],[27,3,27,8],[27,23,27,28],[24,31,25,31],[26,30,27,30],[26,31,27,31],[25,3,25,8],[26,3,26,8],[25,23,25,28],[26,23,26,28]]}
[]
[]
[]
[]
[]
[null,null,null,"Equipe A",null,null,null,null,null,null,null,null,null,null,null,null,null,null,null,null,null,null,null,"Equipe B"]
[null,null,null,"MARSEILLE",null,null,null,null,null,null,null,null,null,null,null,null,null,null,null,null,null,null,null,"LE CANNET"]
[]
[{"$f":"IF('Liste équipes'!A3=\"\",\"\",'Liste équipes'!A3)","v":"ENT CHALON DIJON BF"},null,null,"Carte","Pts","   Noms         /          Prénoms",null,"N°","Valeur","entrée en jeu","Sans Abattement","Bonus",null,"J","JF","F-FET","S-SF",null,"Valide","ET",null,null,null,"Carte","Pts","   Noms         /          Prénoms",null,"N°","Valeur","entrée en jeu","Sans Abattement","Bonus",null,"J","JF","F-FET","S-SF",null,"Valide","ET"]
[{"$f":"IF('Liste équipes'!A4=\"\",\"\",'Liste équipes'!A4)","v":"HURRICANE 92"}]
[{"$f":"IF('Liste équipes'!A5=\"\",\"\",'Liste équipes'!A5)","v":"HYERES"},null,null,null,null,null,null,null,{"$f":"IF(D11=\"n\",E11,IF(D11=\"JISA\",E11,IF(D11=\"J\",E11,IF(D11=\"JF\",E11,IF(D11=\"F\",E11,IF(D11=\"fet\",E11,IF(D11=\"ET\",E11,IF(D11=\"FID\",E11,IF(D11=\"\",\"\")))))))))","v":""},null,{"$f":"IF(AND(J11=\"X\",E11>0),I11,\"\")","v":""},{"$f":"IF(AND(J11=\"X\",D11=\"J\",E11<5),1,IF(AND(J11=\"X\",D11=\"JF\",E11<5),2,IF(AND(J11=\"X\",D11=\"F\",E11<5),1.5,IF(AND(J11=\"X\",D11=\"FET\",E11<5),1.5,\"\"))))","v":""},null,{"$f":"IF(AND(J11=\"X\",D11=\"J\"),1,\"\")","v":""},{"$f":"IF(AND(J11=\"X\",D11=\"JF\"),1,IF(AND(J11=\"X\",D11=\"SF\"),1,\"\"))","v":""},{"$f":"IF(AND(J11=\"X\",D11=\"F\"),1,IF(AND(J11=\"X\",D11=\"FET\"),1,\"\"))","v":""},{"$f":"IF(AND(J11=\"X\",D11=\"S\"),1,\"\")","v":""},{"$f":"IF(AND(J11=\"X\",E11>0),1,\"\")","v":""},{"$f":"IF(E11=5,1,\"\")","v":""},{"$f":"IF(AND(J11=\"X\",D11=\"ET\"),1,\"\")","v":""},{"$f":"IF(AND(J11=\"X\",D11=\"ET\"),1,\"\")","v":""},null,null,null,null,null,null,null,{"$f":"IF(X11=\"n\",Y11,IF(X11=\"JISA\",Y11,IF(X11=\"J\",Y11,IF(X11=\"JF\",Y11,IF(X11=\"F\",Y11,IF(X11=\"fet\",Y11,IF(X11=\"ET\",Y11,IF(X11=\"FID\",Y11,IF(X11=\"\",\"\")))))))))","v":""},null,{"$f":"IF(AND(AD11=\"X\",Y11>0),AC11,\"\")","v":""},{"$f":"IF(AND(AD11=\"X\",X11=\"J\",Y11<5),1,IF(AND(AD11=\"X\",X11=\"JF\",Y11<5),2,IF(AND(AD11=\"X\",X11=\"F\",Y11<5),1.5,IF(AND(AD11=\"X\",X11=\"FET\",Y11<5),1.5,\"\"))))","v":""},null,{"$f":"IF(AND(AD11=\"X\",X11=\"J\"),1,\"\")","v":""},{"$f":"IF(AND(AD11=\"X\",X11=\"JF\"),1,IF(AND(AD11=\"X\",X11=\"SF\"),1,\"\"))","v":""},{"$f":"IF(AND(AD11=\"X\",X11=\"F\"),1,IF(AND(AD11=\"X\",X11=\"FET\"),1,\"\"))","v":""},{"$f":"IF(AND(AD11=\"X\",X11=\"S\"),1,\"\")","v":""},{"$f":"IF(AND(AD11=\"X\",Y11>0),1,\"\")","v":""},{"$f":"IF(Y11=5,1,\"\")","v":""},{"$f":"IF(AND(AD11=\"X\",X11=\"ET\"),1,\"\")","v":""},{"$f":"IF(AND(AD11=\"X\",X11=\"ET\"),1,\"\")","v":""}]
[{"$f":"IF('Liste équipes'!A6=\"\",\"\",'Liste équipes'!A6)","v":"LANNION"},null,null,null,null,null,null,null,"",null,{"$f":"IF(AND(J12=\"X\",E12>0),I12,\"\")","v":""},{"$f":"IF(AND(J12=\"X\",D12=\"J\",E12<5),1,IF(AND(J12=\"X\",D12=\"JF\",E12<5),2,IF(AND(J12=\"X\",D12=\"F\",E12<5),1.5,IF(AND(J12=\"X\",D12=\"FET\",E12<5),1.5,\"\"))))","v":""},null,{"$f":"IF(AND(J12=\"X\",D12=\"J\"),1,\"\")","v":""},{"$f":"IF(AND(J12=\"X\",D12=\"JF\"),1,\"\")","v":""},{"$f":"IF(AND(J12=\"X\",D12=\"F\"),1,IF(AND(J12=\"X\",D12=\"FET\"),1,\"\"))","v":""},{"$f":"IF(AND(J12=\"X\",D12=\"S\"),1,\"\")","v":""},{"$f":"IF(AND(J12=\"X\",E12>0),1,\"\")","v":""},{"$f":"IF(E12=5,1,\"\")","v":""},{"$f":"IF(AND(J12=\"X\",D12=\"ET\"),1,\"\")","v":""},{"$f":"IF(AND(J12=\"X\",D12=\"ET\"),1,\"\")","v":""},null,null,null,null,null,null,null,{"$f":"IF(X12=\"n\",Y12,IF(X12=\"JISA\",Y12,IF(X12=\"J\",Y12,IF(X12=\"JF\",Y12,IF(X12=\"F\",Y12,IF(X12=\"fet\",Y12,IF(X12=\"ET\",Y12,IF(X12=\"FID\",Y12,IF(X12=\"\",\"\")))))))))","v":""},null,{"$f":"IF(AND(AD12=\"X\",Y12>0),AC12,\"\")","v":""},{"$f":"IF(AND(AD12=\"X\",X12=\"J\",Y12<5),1,IF(AND(AD12=\"X\",X12=\"JF\",Y12<5),2,IF(AND(AD12=\"X\",X12=\"F\",Y12<5),1.5,IF(AND(AD12=\"X\",X12=\"FET\",Y12<5),1.5,\"\"))))","v":""},null,{"$f":"IF(AND(AD12=\"X\",X12=\"J\"),1,\"\")","v":""},{"$f":"IF(AND(AD12=\"X\",X12=\"JF\"),1,\"\")","v":""},{"$f":"IF(AND(AD12=\"X\",X12=\"F\"),1,IF(AND(AD12=\"X\",X12=\"FET\"),1,\"\"))","v":""},{"$f":"IF(AND(AD12=\"X\",X12=\"S\"),1,\"\")","v":""},{"$f":"IF(AND(AD12=\"X\",Y12>0),1,\"\")","v":""},{"$f":"IF(Y12=5,1,\"\")","v":""},{"$f":"IF(AND(AD12=\"X\",X12=\"ET\"),1,\"\")","v":""},{"$f":"IF(AND(AD12=\"X\",X12=\"ET\"),1,\"\")","v":""}]
[{"$f":"IF('Liste équipes'!A7=\"\",\"\",'Liste équipes'!A7)","v":"LE CANNET"},null,null,null,null,null,null,null,"",null,"","",null,"","","","","","","","",null,null,null,null,null,null,null,"",null,"","",null,"","","","","","","",""]
[{"$f":"IF('Liste équipes'!A8=\"\",\"\",'Liste équipes'!A8)","v":"LE PUY"},null,null,null,null,null,null,null,"",null,"","",null,"","","","","","","","",null,null,null,null,null,null,null,"",null,"","",null,"","","","","","","",""]
[{"$f":"IF('Liste équipes'!A9=\"\",\"\",'Liste équipes'!A9)","v":"MARSEILLE"},null,null,null,null,null,null,null,"",null,"","",null,"","","","","","","","",null,null,null,null,null,null,null,{"$f":"IF(X15=\"n\",Y15,IF(X15=\"JISA\",Y15,IF(X15=\"J\",Y15,IF(X15=\"JF\",Y15,IF(X15=\"F\",Y15,IF(X15=\"fet\",Y15,IF(X15=\"ET\",Y15,IF(X15=\"FID\",Y15,IF(X15=\"\",\"\")))))))))","v":""},null,"","",null,"","","","","","","",""]
[{"$f":"IF('Liste équipes'!A10=\"\",\"\",'Liste équipes'!A10)","v":"MEAUX"},null,null,null,null,null,null,null,"",null,"","",null,"","","","","","","","",null,null,null,null,null,null,null,"",null,"","",null,"","","","","","","",""]
[{"$f":"IF('Liste équipes'!A11=\"\",\"\",'Liste équipes'!A11)","v":"TOULOUSE"},null,null,null,null,null,null,null,"",null,"","",null,"","","","","","","","",null,null,null,null,null,null,null,"",null,"","",null,"","","","","","","",""]
[null,null,null,null,null,null,null,null,"",null,"","",null,"","","","","","","","",null,null,null,null,null,null,null,"",null,"","",null,"","","","","","","",""]
[{"$f":"IF('Liste équipes'!A13=\"\",\"\",'Liste équipes'!A13)","v":""},null,null,null,null,null,null,null,"",null,"","",null,"","","","","","","","",null,null,null,null,null,null,null,"",null,"","",null,"","","","","","","",""]
[{"$f":"IF('Liste équipes'!A14=\"\",\"\",'Liste équipes'!A14)","v":""},null,null,null,null,null,null,null,"",null,"","",null,"","","","","","","","",null,null,null,null,null,null,null,"",null,"","",null,"","","","","","","",""]
[{"$f":"IF('Liste équipes'!A15=\"\",\"\",'Liste équipes'!A15)","v":""},null,null,null,null,null,null,null,"",null,"","",null,"","","","","","","","",null,null,null,null,null,null,null,"",null,"","",null,"","","","","","","",""]
[{"$f":"IF('Liste équipes'!A16=\"\",\"\",'Liste équipes'!A16)","v":""},null,null,null,null,null,null,null,"",null,"","",null,"","","","","","","","",null,null,null,null,null,null,null,"",null,"","",null,"","","","","","","",""]
[null,null,null,null,null,null,null,null,{"$f":"IF(D23=\"n\",E23,IF(D23=\"JISA\",E23,IF(D23=\"J\",E23,IF(D23=\"JF\",E23,IF(D23=\"F\",E23,IF(D23=\"fet\",E23,IF(D23=\"ET\",E23,IF(D23=\"FID\",E23,IF(D23=\"\",\"\")))))))))","v":""},null,"","",null,"","","","","","","","",null,null,null,null,null,null,null,"",null,"","",null,"","","","","","","",""]
[null,null,null,null,null,null,null,null,"",null,"","",null,"","","","","","","","",null,null,null,null,null,null,null,"",null,"","",null,"","","","","","","",""]
[null,null,null,"  Nombre joueurs sur le terrain",null,null,{"$f":"IF(J25>5,\"\",\"OK\")","v":""},{"$f":"IF(R25>5,\"PAS OK\",\"\")","v":""},null,{"$f":"IF(L27=\"\",\"\",R25)","v":""},"Points en jeu","Points autorisés",null,{"$f":"SUM(N11:N24)","v":0},0,0,0,0,{"$f":"SUM(S11:S24)","v":0},{"$f":"SUM(T11:T24)","v":0},{"$f":"SUM(U11:U24)","v":0},null,null,"  Nombre joueurs sur le terrain",null,null,{"$f":"IF(AD25>5,\"\",\"OK\")","v":""},{"$f":"IF(AL25>5,\"Pas OK >5\",\"\")","v":""},null,{"$f":"IF(AF27=\"\",\"\",AL25)","v":""},"Points en jeu","Points autorisés",null,{"$f":"SUM(AH11:AH24)","v":0},0,0,0,0,{"$f":"SUM(AM11:AM24)","v":0},{"$f":"SUM(AN11:AN24)","v":0},{"$f":"SUM(AO11:AO24)","v":0}]
[null,null,null,null,null,null,null,null,null,null,null,null,null,{"$f":"IF(N25=0,\"\",IF(N25=1,17,IF(N25=2,18.5,IF(N25=3,19,IF(N25>3,19,IF(N25>4,19,IF(N25>5,19,\"\")))))))","v":""},{"$f":"IF(O25=0,\"\",IF(O25=1,18,IF(O25=2,19,IF(O25=3,19,IF(O25=4,19,IF(O25=4,19,\"\"))))))","v":""},{"$f":"IF(P25=0,\"\",IF(P25=1,17,IF(P25=2,18.5,IF(P25=3,19,IF(P25=4,19,IF(P25=5,17.5,\"\"))))))","v":""},{"$f":"IF(Q25=0,\"\",IF(Q25=1,16,IF(Q25=2,16.5,IF(Q25=3,17,IF(Q25=4,17.5,IF(Q25=5,18,IF(Q25=6,18.5,IF(Q25=7,19,IF(Q25=8,19,IF(Q25=9,19,IF(Q25=10,19,IF(Q25=11,19,IF(Q25=12,19,\"\")))))))))))))","v":""},{"$f":"IF(AND(O26=16.5,P26=16),17.5,IF(AND(N26=15.5,P26=16),17,IF(AND(N26=15.5,O26=16.5),17.5,IF(AND(N26=16.5,P26=16),17.5,IF(AND(N25=2,O26=16.5),17.5,\"\")))))","v":""},null,null,null,null,null,null,null,null,null,null,null,null,null,null,null,{"$f":"IF(AH25=0,\"\",IF(AH25=1,17,IF(AH25=2,18.5,IF(AH25=3,19,IF(AH25>3,19,IF(AH25>4,19,IF(AH25>5,19,\"\")))))))","v":""},{"$f":"IF(AI25=0,\"\",IF(AI25=1,18,IF(AI25=2,19,IF(AI25=3,19,IF(AI25=4,19,IF(AI25=4,19,\"\"))))))","v":""},{"$f":"IF(AJ25=0,\"\",IF(AJ25=1,17,IF(AJ25=2,18.5,IF(AJ25=3,19,IF(AJ25=4,19,IF(AJ25=5,17.5,\"\"))))))","v":""},{"$f":"IF(AK25=0,\"\",IF(AK25=1,16,IF(AK25=2,16.5,IF(AK25=3,17,IF(AK25=4,17.5,IF(AK25=5,18,IF(AK25=6,18.5,IF(AK25=7,19,IF(AK25=8,19,IF(AK25=9,19,IF(AK25=10,19,IF(AK25=11,19,IF(AK25=12,19,\"\")))))))))))))","v":""},{"$f":"IF(AND(AI26=16.5,AJ26=16),17.5,IF(AND(AH26=15.5,AJ26=16),17,IF(AND(AH26=15.5,AI26=16.5),17.5,IF(AND(AH26=16.5,AJ26=16),17.5,IF(AND(AH25=2,AI26=16.5),17.5,\"\")))))","v":""}]
[null,null," ",{"$f":"IF(K27>L27,\"Trop de points en jeu\",\"\")","v":""},null,null,null,null,null,null,{"$f":"IF(O28>0,O28,\"\")","v":""},{"$f":"IF(O28=0,\"\",Q28)","v":""},null,{"$f":"SUM(N26)","v":0},0,0,0,0,null,null,null,null," ",{"$f":"IF(AE27>AF27,\"Trop de points en jeu\",\"\")","v":""},null,null,null,null,null,null,{"$f":"IF(AI28>0,AI28,\"\")","v":""},{"$f":"IF(AI28=0,\"\",AK28)","v":""},null,{"$f":"SUM(AH26)","v":0},0,0,0,0]
[null,null,null,{"$f":"IF(S25>1,\"Trop de joueurs  valides inscrits sur la feuille\",\"\")","v":""},null,null,null,null,null,null,null,null,null,{"$f":"SUM(L11:L24)","v":0},{"$f":"SUM(K11:K24)","v":0},{"$f":"SUM(N28+14.5)","v":14.5},{"$f":"IF(P28>17.5,17.5,P28)","v":14.5},{"$f":"SUM(R25)","v":0},null,null,null,null,null,{"$f":"IF(AM25>1,\"Trop de joueurs  valides inscrits sur la feuille\",\"\")","v":""},null,null,null,null,null,null,null,null,null,{"$f":"SUM(AF11:AF24)","v":0},{"$f":"SUM(AE11:AE24)","v":0},{"$f":"SUM(AH28+14.5)","v":14.5},{"$f":"IF(AJ28>17.5,17.5,AJ28)","v":14.5}]
[]
[]
[]
[]
[]
[]
[]
[]
[]
[]
[null,null,null,null,null,null,null,null,null,","]

{"sheet":"Nationale_1","index":2,"n_rows":31,"n_cols":41,"rows_kept":31,"cut":false,"hidden":false,"merged":[[29,23,30,31],[29,3,30,11],[24,31,25,31],[26,30,27,30],[24,10,25,10],[24,30,25,30],[26,11,27,11],[25,3,25,8],[26,3,26,8],[25,23,25,28],[24,11,25,11],[27,23,27,28],[27,3,27,8],[26,10,27,10],[26,23,26,28],[26,31,27,31],[24,7,24,8],[5,23,5,31],[5,3,5,11],[6,3,6,11],[6,23,6,31],[8,25,8,26]]}
[]
[]
[]
[]
[]
[null,null,null,"Equipe A",null,null,null,null,null,null,null,null,null,null,null,null,null,null,null,null,null,null,null,"Equipe B"]
[null,null,null,"CAUSSADE",null,null,null,null,null,null,null,null,null,null,null,null,null,null,null,null,null,null,null,"MEAUX 2"]
[]
[null,null,null,"Carte","Pts","   Noms         /          Prénoms",null,"N°","Valeur","entrée en jeu","Sans Abattement","Bonus",null,"J","JF","F-FET","S-SF",null,"Valide","ET",null,null,null,"Carte","Pts","   Noms         /          Prénoms",null,"N°","Valeur","entrée en jeu","Sans Abattement","Bonus",null,"J","JF","F-FET","S-SF",null,"Valide","ET"]
[{"$f":"IF('Liste équipes'!B2=\"\",\"\",'Liste équipes'!B2)","v":""}]
[{"$f":"IF('Liste équipes'!B3=\"\",\"\",'Liste équipes'!B3)","v":"BORDEAUX"},null,null,null,null,null,null,null,{"$f":"IF(D11=\"n\",E11,IF(D11=\"JISA\",E11,IF(D11=\"j\",E11,IF(D11=\"jf\",E11,IF(D11=\"f\",E11,IF(D11=\"fet\",E11,IF(D11=\"et\",E11,IF(D11=\"fid\",E11,IF(D11=\"\",\"\")))))))))","v":""},null,{"$f":"IF(AND(J11=\"X\",E11>0),I11,\"\")","v":""},{"$f":"IF(AND(J11=\"X\",D11=\"J\",E11<5),1.5,IF(AND(J11=\"X\",D11=\"JF\",E11<5),2.5,IF(AND(J11=\"X\",D11=\"F\",E11<5),1.5,IF(AND(J11=\"X\",D11=\"FET\",E11<5),1.5,\"\"))))","v":""},null,{"$f":"IF(AND(J11=\"X\",D11=\"J\"),1,\"\")","v":""},{"$f":"IF(AND(J11=\"X\",D11=\"JF\"),1,IF(AND(J11=\"X\",D11=\"SF\"),1,\"\"))","v":""},{"$f":"IF(AND(J11=\"X\",D11=\"F\"),1,IF(AND(J11=\"X\",D11=\"FET\"),1,\"\"))","v":""},{"$f":"IF(AND(J11=\"X\",D11=\"S\"),1,\"\")","v":""},{"$f":"IF(AND(J11=\"X\",E11>0),1,\"\")","v":""},{"$f":"IF(E11=5,1,\"\")","v":""},{"$f":"IF(AND(D11=\"ET\",J11=\"X\"),1,\"\")","v":""},{"$f":"IF(AND(J11=\"X\",D11=\"ET\"),1,\"\")","v":""},null,null,null,null,null,null,null,{"$f":"IF(X11=\"n\",Y11,IF(X11=\"JISA\",Y11,IF(X11=\"j\",Y11,IF(X11=\"jf\",Y11,IF(X11=\"f\",Y11,IF(X11=\"fet\",Y11,IF(X11=\"et\",Y11,IF(X11=\"fid\",Y11,IF(X11=\"\",\"\")))))))))","v":""},null,{"$f":"IF(AND(AD11=\"X\",Y11>0),AC11,\"\")","v":""},{"$f":"IF(AND(AD11=\"X\",X11=\"J\",Y11<5),1.5,IF(AND(AD11=\"X\",X11=\"JF\",Y11<5),2.5,IF(AND(AD11=\"X\",X11=\"F\",Y11<5),1.5,IF(AND(AD11=\"X\",X11=\"FET\",Y11<5),1.5,\"\"))))","v":""},null,{"$f":"IF(AND(AD11=\"X\",X11=\"J\"),1,\"\")","v":""},{"$f":"IF(AND(AD11=\"X\",X11=\"JF\"),1,IF(AND(AD11=\"X\",X11=\"SF\"),1,\"\"))","v":""},{"$f":"IF(AND(AD11=\"X\",X11=\"F\"),1,IF(AND(AD11=\"X\",X11=\"FET\"),1,\"\"))","v":""},{"$f":"IF(AND(AD11=\"X\",X11=\"S\"),1,\"\")","v":""},{"$f":"IF(AND(AD11=\"X\",Y11>0),1,\"\")","v":""},{"$f":"IF(Y11=5,1,\"\")","v":""},{"$f":"IF(AND(X11=\"ET\",AD11=\"X\"),1,\"\")","v":""},{"$f":"IF(AND(AD11=\"X\",X11=\"ET\"),1,\"\")","v":""}]
[{"$f":"IF('Liste équipes'!B4=\"\",\"\",'Liste équipes'!B4)","v":"CAPSAAA"},null,null,null,null,null,null,null,{"$f":"IF(D12=\"n\",E12,IF(D12=\"JISA\",E12,IF(D12=\"j\",E12,IF(D12=\"jf\",E12,IF(D12=\"f\",E12,IF(D12=\"fet\",E12,IF(D12=\"et\",E12,IF(D12=\"fid\",E12,IF(D12=\"\",\"\")))))))))","v":""},null,{"$f":"IF(AND(J12=\"X\",E12>0),I12,\"\")","v":""},{"$f":"IF(AND(J12=\"X\",D12=\"J\",E12<5),1.5,IF(AND(J12=\"X\",D12=\"JF\",E12<5),2.5,IF(AND(J12=\"X\",D12=\"F\",E12<5),1.5,IF(AND(J12=\"X\",D12=\"FET\",E12<5),1.5,\"\"))))","v":""},null,{"$f":"IF(AND(J12=\"X\",D12=\"J\"),1,\"\")","v":""},{"$f":"IF(AND(J12=\"X\",D12=\"JF\"),1,\"\")","v":""},{"$f":"IF(AND(J12=\"X\",D12=\"F\"),1,IF(AND(J12=\"X\",D12=\"FET\"),1,\"\"))","v":""},{"$f":"IF(AND(J12=\"X\",D12=\"S\"),1,\"\")","v":""},{"$f":"IF(AND(J12=\"X\",E12>0),1,\"\")","v":""},{"$f":"IF(E12=5,1,\"\")","v":""},{"$f":"IF(AND(D12=\"ET\",J12=\"X\"),1,\"\")","v":""},{"$f":"IF(AND(J12=\"X\",D12=\"ET\"),1,\"\")","v":""},null,null,null,null,null,null,null,{"$f":"IF(X12=\"n\",Y12,IF(X12=\"JISA\",Y12,IF(X12=\"j\",Y12,IF(X12=\"jf\",Y12,IF(X12=\"f\",Y12,IF(X12=\"fet\",Y12,IF(X12=\"et\",Y12,IF(X12=\"fid\",Y12,IF(X12=\"\",\"\")))))))))","v":""},null,{"$f":"IF(AND(AD12=\"X\",Y12>0),AC12,\"\")","v":""},{"$f":"IF(AND(AD12=\"X\",X12=\"J\",Y12<5),1.5,IF(AND(AD12=\"X\",X12=\"JF\",Y12<5),2.5,IF(AND(AD12=\"X\",X12=\"F\",Y12<5),1.5,IF(AND(AD12=\"X\",X12=\"FET\",Y12<5),1.5,\"\"))))","v":""},null,{"$f":"IF(AND(AD12=\"X\",X12=\"J\"),1,\"\")","v":""},{"$f":"IF(AND(AD12=\"X\",X12=\"JF\"),1,\"\")","v":""},{"$f":"IF(AND(AD12=\"X\",X12=\"F\"),1,IF(AND(AD12=\"X\",X12=\"FET\"),1,\"\"))","v":""},{"$f":"IF(AND(AD12=\"X\",X12=\"S\"),1,\"\")","v":""},{"$f":"IF(AND(AD12=\"X\",Y12>0),1,\"\")","v":""},{"$f":"IF(Y12=5,1,\"\")","v":""},{"$f":"IF(AND(X12=\"ET\",AD12=\"X\"),1,\"\")","v":""},{"$f":"IF(AND(AD12=\"X\",X12=\"ET\"),1,\"\")","v":""}]
[{"$f":"IF('Liste équipes'!B5=\"\",\"\",'Liste équipes'!B5)","v":"CAUSSADE"},null,null,null,null,null,null,null,"",null,"","",null,"","","","","","","","",null,null,null,null,null,null,null,"",null,"","",null,"","","","","","","",""]
[{"$f":"IF('Liste équipes'!B6=\"\",\"\",'Liste équipes'!B6)","v":"ENT CHALON DIJON BF 2"},null,null,null,null,null,null,null,"",null,"","",null,"","","","","","","","",null,null,null,null,null,null,null,"",null,"","",null,"","","","","","","",""]
[{"$f":"IF('Liste équipes'!B7=\"\",\"\",'Liste équipes'!B7)","v":"DOUAI"},null,null,null,null,null,null,null,"",null,"","",null,"","","","","","","","",null,null,null,null,null,null,null,"",null,"","",null,"","","","","","","",""]
[{"$f":"IF('Liste équipes'!B8=\"\",\"\",'Liste équipes'!B8)","v":"FEURS"},null,null,null,null,null,null,null,"",null,"","",null,"","","","","","","","",null,null,null,null,null,null,null,"",null,"","",null,"","","","","","","",""]
[{"$f":"IF('Liste équipes'!B9=\"\",\"\",'Liste équipes'!B9)","v":"LILLE"},null,null,null,null,null,null,null,"",null,"","",null,"","","","","","","","",null,null,null,null,null,null,null,"",null,"","",null,"","","","","","","",""]
[{"$f":"IF('Liste équipes'!B10=\"\",\"\",'Liste équipes'!B10)","v":"MEAUX 2"},null,null,null,null,null,null,null,"",null,"","",null,"","","","","","","","",null,null,null,null,null,null,null,"",null,"","",null,"","","","","","","",""]
[{"$f":"IF('Liste équipes'!B11=\"\",\"\",'Liste équipes'!B11)","v":"MEYLAN"},null,null,null,null,null,null,null,"",null,"","",null,"","","","","","","","",null,null,null,null,null,null,null,"",null,"","",null,"","","","","","","",""]
[{"$f":"IF('Liste équipes'!B12=\"\",\"\",'Liste équipes'!B12)","v":"STRASBOURG"},null,null,null,null,null,null,null,"",null,"","",null,"","","","","","","","",null,null,null,null,null,null,null,"",null,"","",null,"","","","","","","",""]
[{"$f":"IF('Liste équipes'!B13=\"\",\"\",'Liste équipes'!B13)","v":""},null,null,null,null,null,null,null,"",null,"","",null,"","","","","","","","",null,null,null,null,null,null,null,"",null,"","",null,"","","","","","","",""]
[null,null,null,null,null,null,null,null,"",null,"","",null,"","","","","","","","",null,null,null,null,null,null,null,"",null,"","",null,"","","","","","","",""]
[null,null,null,null,null,null,null,null,"",null,"","",null,"","","","","","","","",null,null,null,null,null,null,null,"",null,"","",null,"","","","","","","",""]
[null,null,null,null,null,null,null,null,"",null,"","",null,"","","","","","","","",null,null,null,null,null,null,null,"",null,"","",null,"","","","","","","",""]
[null,null,null,"  Nombre joueurs sur le terrain",null,null,{"$f":"IF(J25>5,\"\",\"OK\")","v":""},{"$f":"IF(R25>5,\"PAS OK\",\"\")","v":""},null,{"$f":"IF(L27=\"\",\"\",R25)","v":""},"Points en jeu","Avec Bonus maxi 17 pts",null,{"$f":"SUM(N11:N24)","v":0},0,0,0,0,{"$f":"SUM(S11:S24)","v":0},{"$f":"SUM(T11:T24)","v":0},{"$f":"SUM(U11:U24)","v":0},null,null,"  Nombre joueurs sur le terrain",null,null,{"$f":"IF(AD25>5,\"\",\"OK\")","v":""},{"$f":"IF(AL25>5,\"Pas OK >5\",\"\")","v":""},null,{"$f":"IF(AF27=\"\",\"\",AL25)","v":""},"Points en jeu","Avec Bonus maxi 17 pts",null,{"$f":"SUM(AH11:AH24)","v":0},0,0,0,0,{"$f":"SUM(AM11:AM24)","v":0},{"$f":"SUM(AN11:AN24)","v":0},{"$f":"SUM(AO11:AO24)","v":0}]
[null,null,null,null,null,null,null,null,null,null,null,null,null,{"$f":"IF(N25=0,\"\",IF(N25=1,17,IF(N25=2,18.5,IF(N25=3,19,IF(N25>3,19,IF(N25>4,19,IF(N25>5,19,\"\")))))))","v":""},{"$f":"IF(O25=0,\"\",IF(O25=1,18,IF(O25=2,19,IF(O25=3,19,IF(O25=4,19,IF(O25=4,19,\"\"))))))","v":""},{"$f":"IF(P25=0,\"\",IF(P25=1,17,IF(P25=2,18.5,IF(P25=3,19,IF(P25=4,19,IF(P25=5,17.5,\"\"))))))","v":""},{"$f":"IF(Q25=0,\"\",IF(Q25=1,16,IF(Q25=2,16.5,IF(Q25=3,17,IF(Q25=4,17.5,IF(Q25=5,18,IF(Q25=6,18.5,IF(Q25=7,19,IF(Q25=8,19,IF(Q25=9,19,IF(Q25=10,19,IF(Q25=11,19,IF(Q25=12,19,\"\")))))))))))))","v":""},{"$f":"IF(AND(O26=16.5,P26=16),17.5,IF(AND(N26=15.5,P26=16),17,IF(AND(N26=15.5,O26=16.5),17.5,IF(AND(N26=16.5,P26=16),17.5,IF(AND(N25=2,O26=16.5),17.5,\"\")))))","v":""},null,null,null,null,null,null,null,null,null,null,null,null,null,null,null,{"$f":"IF(AH25=0,\"\",IF(AH25=1,17,IF(AH25=2,18.5,IF(AH25=3,19,IF(AH25>3,19,IF(AH25>4,19,IF(AH25>5,19,\"\")))))))","v":""},{"$f":"IF(AI25=0,\"\",IF(AI25=1,18,IF(AI25=2,19,IF(AI25=3,19,IF(AI25=4,19,IF(AI25=4,19,\"\"))))))","v":""},{"$f":"IF(AJ25=0,\"\",IF(AJ25=1,17,IF(AJ25=2,18.5,IF(AJ25=3,19,IF(AJ25=4,19,IF(AJ25=5,17.5,\"\"))))))","v":""},{"$f":"IF(AK25=0,\"\",IF(AK25=1,16,IF(AK25=2,16.5,IF(AK25=3,17,IF(AK25=4,17.5,IF(AK25=5,18,IF(AK25=6,18.5,IF(AK25=7,19,IF(AK25=8,19,IF(AK25=9,19,IF(AK25=10,19,IF(AK25=11,19,IF(AK25=12,19,\"\")))))))))))))","v":""},{"$f":"IF(AND(AI26=16.5,AJ26=16),17.5,IF(AND(AH26=15.5,AJ26=16),17,IF(AND(AH26=15.5,AI26=16.5),17.5,IF(AND(AH26=16.5,AJ26=16),17.5,IF(AND(AH25=2,AI26=16.5),17.5,\"\")))))","v":""}]
[null,null," ",{"$f":"IF(K27>L27,\"Trop de points en jeu\",\"\")","v":""},null,null,null,null,null,null,{"$f":"IF(O28>0,O28,\"\")","v":""},{"$f":"IF(O28=0,\"\",Q28)","v":""},null,{"$f":"SUM(N26)","v":0},0,0,0,0,null,null,null,null," ",{"$f":"IF(AE27>AF27,\"Trop de points en jeu\",\"\")","v":""},null,null,null,null,null,null,{"$f":"IF(AI28>0,AI28,\"\")","v":""},{"$f":"IF(AI28=0,\"\",AK28)","v":""},null,{"$f":"SUM(AH26)","v":0},0,0,0,0]
[null,null,null,{"$f":"IF(S25>1,\"Trop de joueurs  valides inscrits sur la feuille\",\"\")","v":""},null,null,null,null,null,null,null,null,null,{"$f":"SUM(L11:L24)","v":0},{"$f":"SUM(K11:K24)","v":0},{"$f":"SUM(N28+14.5)","v":14.5},{"$f":"IF(P28>17.5,17.5,P28)","v":14.5},{"$f":"SUM(R25)","v":0},null,{"$f":"SUM(T30:T31)","v":0},null,null,null,{"$f":"IF(AM25>1,\"Trop de joueurs  valides inscrits sur la feuille\",\"\")","v":""},null,null,null,null,null,null,null,null,null,{"$f":"SUM(AF11:AF24)","v":0},{"$f":"SUM(AE11:AE24)","v":0},{"$f":"SUM(AH28+14.5)","v":14.5},{"$f":"IF(AJ28>17.5,17.5,AJ28)","v":14.5},null,null,{"$f":"SUM(AN30:AN31)","v":0}]
[]
[null,null,null,{"$f":"IF(T28>5,\"Pas OK. Trop de joueurs étrangers sur la feuille (ET), vérifier la liste.\",IF(T25>4,\"Pas OK. Trop de joueurs étrangers en jeu (ET), vérifier la liste.\",\"\"))","v":""},null,null,null,null,null,null,null,null,null,{"$f":"IF(D11=\"ET\",1,\"\")","v":""},{"$f":"IF(D12=\"ET\",1,\"\")","v":""},{"$f":"IF(D13=\"ET\",1,\"\")","v":""},{"$f":"IF(D14=\"ET\",1,\"\")","v":""},{"$f":"IF(D15=\"ET\",1,\"\")","v":""},{"$f":"IF(D16=\"ET\",1,\"\")","v":""},{"$f":"SUM(N30:S30)","v":0},null,null,null,{"$f":"IF(AN28>5,\"Pas OK. Trop de joueurs étrangers sur la feuille (ET), vérifier la liste.\",IF(AN25>4,\"Pas OK. Trop de joueurs étrangers en jeu (ET), vérifier la liste.\",\"\"))","v":""},null,null,null,null,null,null,null,null,null,{"$f":"IF(X11=\"ET\",1,\"\")","v":""},{"$f":"IF(X12=\"ET\",1,\"\")","v":""},{"$f":"IF(X13=\"ET\",1,\"\")","v":""},{"$f":"IF(X14=\"ET\",1,\"\")","v":""},{"$f":"IF(X15=\"ET\",1,\"\")","v":""},{"$f":"IF(X16=\"ET\",1,\"\")","v":""},{"$f":"SUM(AH30:AM30)","v":0}]
[null,null,null,null,null,null,null,null,null,null,null,null,null,{"$f":"IF(D17=\"ET\",1,\"\")","v":""},{"$f":"IF(D18=\"ET\",1,\"\")","v":""},{"$f":"IF(D19=\"ET\",1,\"\")","v":""},{"$f":"IF(D20=\"ET\",1,\"\")","v":""},{"$f":"IF(D21=\"ET\",1,\"\")","v":""},{"$f":"IF(D22=\"ET\",1,\"\")","v":""},{"$f":"SUM(N31:S31)","v":0},null,null,null,null,null,null,null,null,null,null,null,null,null,{"$f":"IF(X17=\"ET\",1,\"\")","v":""},{"$f":"IF(X18=\"ET\",1,\"\")","v":""},{"$f":"IF(X19=\"ET\",1,\"\")","v":""},{"$f":"IF(X20=\"ET\",1,\"\")","v":""},{"$f":"IF(X21=\"ET\",1,\"\")","v":""},{"$f":"IF(X22=\"ET\",1,\"\")","v":""},{"$f":"SUM(AH31:AM31)","v":0}]

{"sheet":"Nationale_2_poule_A","index":3,"n_rows":31,"n_cols":42,"rows_kept":31,"cut":false,"hidden":false,"merged":[[34,23,40,23],[5,23,5,31],[26,3,26,8],[26,11,27,11],[25,23,25,28],[26,23,26,28],[26,31,27,31],[25,3,25,8],[6,3,6,11],[6,23,6,31],[5,3,5,11],[8,25,8,26],[24,10,25,10],[24,7,24,8],[24,11,25,11],[26,10,27,10],[29,3,30,11],[24,31,25,31],[26,30,27,30],[24,27,24,28],[24,30,25,30],[29,23,30,31],[27,23,27,28],[27,3,27,8]]}
[]
[]
[]
[]
[]
[null,null,null,"Equipe A",null,null,null,null,null,null,null,null,null,null,null,null,null,null,null,null,null,null,null,"Equipe B"]
[null,null,null,"LE PUY 2",null,null,null,null,null,null,null,null,null,null,null,null,null,null,null,null,null,null,null,"LYON"]
[]
[null,null,null,"Carte","Pts","   Noms         /          Prénoms",null,"N°","Valeur","entrée en jeu","Sans Abattement","Bonus",null,"J","JF","F-FET","S-SF",null,"Valide","ET",null,null,null,"Carte","Pts","   Noms         /          Prénoms",null,"N°","Valeur","entrée en jeu","Sans Abattement","Bonus",null,"J","JF","F-FET","S-SF",null,"Valide","ET"]
[]
[null,null,null,null,null,null,null,null,{"$f":"IF(D11=\"N\",E11,IF(D11=\"J\",E11,IF(D11=\"JF\",E11,IF(D11=\"F\",E11,IF(D11=\"FET\",E11,IF(D11=\"ET\",E11,IF(D11=\"FID\",E11,IF(D11=\"S\",E11,IF(D11=\"FS\",E11,IF(D11=\"JS\",E11,IF(D11=\"JFS\",E11,IF(D11=\"\",\"\"))))))))))))","v":""},null,{"$f":"IF(AND(J11=\"X\",E11>0),I11,\"\")","v":""},{"$f":"IF(AND(J11=\"X\",D11=\"J\"),1.5,IF(AND(J11=\"X\",D11=\"JF\"),2.5,IF(AND(J11=\"X\",D11=\"JS\"),2,IF(AND(J11=\"X\",D11=\"JFS\"),3,IF(AND(J11=\"X\",D11=\"F\",E11<5),1.5,IF(AND(J11=\"X\",D11=\"FET\",E11<5),1.5,IF(AND(J11=\"X\",D11=\"FS\",E11<5),2,IF(AND(J11=\"X\",D11=\"S\",E11<5),0.5,\"\"))))))))","v":""},null,{"$f":"IF(AND(J11=\"X\",D11=\"J\"),1,\"\")","v":""},{"$f":"IF(AND(J11=\"X\",D11=\"JF\"),1,IF(AND(J11=\"X\",D11=\"SF\"),1,\"\"))","v":""},{"$f":"IF(AND(J11=\"X\",D11=\"F\"),1,IF(AND(J11=\"X\",D11=\"FET\"),1,\"\"))","v":""},{"$f":"IF(AND(J11=\"X\",D11=\"S\"),1,\"\")","v":""},{"$f":"IF(AND(J11=\"X\",E11>0),1,\"\")","v":""},{"$f":"IF(E11=5,1,\"\")","v":""},{"$f":"IF(AND(D11=\"ET\",J11=\"X\"),1,\"\")","v":""},{"$f":"IF(AND(J11=\"X\",D11=\"ET\"),1,\"\")","v":""},null,null,null,null,null,null,null,{"$f":"IF(X11=\"n\",Y11,IF(X11=\"j\",Y11,IF(X11=\"jf\",Y11,IF(X11=\"f\",Y11,IF(X11=\"fet\",Y11,IF(X11=\"et\",Y11,IF(X11=\"fid\",Y11,IF(X11=\"s\",Y11,IF(X11=\"FS\",Y11,IF(X11=\"JS\",Y11,IF(X11=\"JFS\",Y11,IF(X11=\"\",\"\"))))))))))))","v":""},null,{"$f":"IF(AND(AD11=\"X\",Y11>0),AC11,\"\")","v":""},{"$f":"IF(AND(AD11=\"X\",X11=\"J\"),1.5,IF(AND(AD11=\"X\",X11=\"JF\"),2.5,IF(AND(AD11=\"X\",X11=\"JS\"),2,IF(AND(AD11=\"X\",X11=\"JFS\"),3,IF(AND(AD11=\"X\",X11=\"F\",Y11<5),1.5,IF(AND(AD11=\"X\",X11=\"FET\",Y11<5),1.5,IF(AND(AD11=\"X\",X11=\"FS\",Y11<5),2,IF(AND(AD11=\"X\",X11=\"S\",Y11<5),0.5,\"\"))))))))","v":""},null,{"$f":"IF(AND(AD11=\"X\",X11=\"J\"),1,\"\")","v":""},{"$f":"IF(AND(AD11=\"X\",X11=\"JF\"),1,IF(AND(AD11=\"X\",X11=\"SF\"),1,\"\"))","v":""},{"$f":"IF(AND(AD11=\"X\",X11=\"F\"),1,IF(AND(AD11=\"X\",X11=\"FET\"),1,\"\"))","v":""},{"$f":"IF(AND(AD11=\"X\",X11=\"S\"),1,\"\")","v":""},{"$f":"IF(AND(AD11=\"X\",Y11>0),1,\"\")","v":""},{"$f":"IF(Y11=5,1,\"\")","v":""},{"$f":"IF(AND(X11=\"ET\",AD11=\"X\"),1,\"\")","v":""},{"$f":"IF(AND(AD11=\"X\",X11=\"ET\"),1,\"\")","v":""},{"$f":"IF(AND(AD11=\"X\",X11=\"ET\"),1,\"\")","v":""}]
[null,null,null,null,null,null,null,null,{"$f":"IF(D12=\"n\",E12,IF(D12=\"j\",E12,IF(D12=\"jf\",E12,IF(D12=\"f\",E12,IF(D12=\"fet\",E12,IF(D12=\"et\",E12,IF(D12=\"fid\",E12,IF(D12=\"s\",E12,IF(D12=\"FS\",E12,IF(D12=\"JS\",E12,IF(D12=\"JFS\",E12,IF(D12=\"\",\"\"))))))))))))","v":""},null,{"$f":"IF(AND(J12=\"X\",E12>0),I12,\"\")","v":""},{"$f":"IF(AND(J12=\"X\",D12=\"J\"),1.5,IF(AND(J12=\"X\",D12=\"JF\"),2.5,IF(AND(J12=\"X\",D12=\"JS\"),2,IF(AND(J12=\"X\",D12=\"JFS\"),3,IF(AND(J12=\"X\",D12=\"F\",E12<5),1.5,IF(AND(J12=\"X\",D12=\"FET\",E12<5),1.5,IF(AND(J12=\"X\",D12=\"FS\",E12<5),2,IF(AND(J12=\"X\",D12=\"S\",E12<5),0.5,\"\"))))))))","v":""},null,{"$f":"IF(AND(J12=\"X\",D12=\"J\"),1,\"\")","v":""},{"$f":"IF(AND(J12=\"X\",D12=\"JF\"),1,\"\")","v":""},{"$f":"IF(AND(J12=\"X\",D12=\"F\"),1,IF(AND(J12=\"X\",D12=\"FET\"),1,\"\"))","v":""},{"$f":"IF(AND(J12=\"X\",D12=\"S\"),1,\"\")","v":""},{"$f":"IF(AND(J12=\"X\",E12>0),1,\"\")","v":""},{"$f":"IF(E12=5,1,\"\")","v":""},{"$f":"IF(AND(D12=\"ET\",J12=\"X\"),1,\"\")","v":""},{"$f":"IF(AND(J12=\"X\",D12=\"ET\"),1,\"\")","v":""},null,null,null,null,null,null,null,{"$f":"IF(X12=\"n\",Y12,IF(X12=\"j\",Y12,IF(X12=\"jf\",Y12,IF(X12=\"f\",Y12,IF(X12=\"fet\",Y12,IF(X12=\"et\",Y12,IF(X12=\"fid\",Y12,IF(X12=\"s\",Y12,IF(X12=\"FS\",Y12,IF(X12=\"JS\",Y12,IF(X12=\"JFS\",Y12,IF(X12=\"\",\"\"))))))))))))","v":""},null,{"$f":"IF(AND(AD12=\"X\",Y12>0),AC12,\"\")","v":""},{"$f":"IF(AND(AD12=\"X\",X12=\"J\"),1.5,IF(AND(AD12=\"X\",X12=\"JF\"),2.5,IF(AND(AD12=\"X\",X12=\"JS\"),2,IF(AND(AD12=\"X\",X12=\"JFS\"),3,IF(AND(AD12=\"X\",X12=\"F\",Y12<5),1.5,IF(AND(AD12=\"X\",X12=\"FET\",Y12<5),1.5,IF(AND(AD12=\"X\",X12=\"FS\",Y12<5),2,IF(AND(AD12=\"X\",X12=\"S\",Y12<5),0.5,\"\"))))))))","v":""},null,{"$f":"IF(AND(AD12=\"X\",X12=\"J\"),1,\"\")","v":""},{"$f":"IF(AND(AD12=\"X\",X12=\"JF\"),1,\"\")","v":""},{"$f":"IF(AND(AD12=\"X\",X12=\"F\"),1,IF(AND(AD12=\"X\",X12=\"FET\"),1,\"\"))","v":""},{"$f":"IF(AND(AD12=\"X\",X12=\"S\"),1,\"\")","v":""},{"$f":"IF(AND(AD12=\"X\",Y12>0),1,\"\")","v":""},{"$f":"IF(Y12=5,1,\"\")","v":""},{"$f":"IF(AND(X12=\"ET\",AD12=\"X\"),1,\"\")","v":""},{"$f":"IF(AND(AD12=\"X\",X12=\"ET\"),1,\"\")","v":""},{"$f":"IF(AND(AD12=\"X\",X12=\"ET\"),1,\"\")","v":""}]
[{"$f":"IF('Liste équipes'!C3=\"\",\"\",'Liste équipes'!C3)","v":"ENT BELFORT BESANCON 1"},null,null,null,null,null,null,null,"",null,"","",null,"","","","","","","","",null,null,null,null,null,null,null,"",null,"","",null,"","","","","","","","",""]
[{"$f":"IF('Liste équipes'!C4=\"\",\"\",'Liste équipes'!C4)","v":"CAPPELLE LA GRANDE"},null,null,null,null,null,null,null,"",null,"","",null,"","","","","","","","",null,null,null,null,null,null,null,"",null,"","",null,"","","","","","","","",""]
[{"$f":"IF('Liste équipes'!C5=\"\",\"\",'Liste équipes'!C5)","v":"CORBEIL"},null,null,null,null,null,null,null,"",null,"","",null,"","","","","","","","",null,null,null,null,null,null,null,"",null,"","",null,"","","","","","","","",""]
[{"$f":"IF('Liste équipes'!C6=\"\",\"\",'Liste équipes'!C6)","v":"GRAVELINES"},null,null,null,null,null,null,null,"",null,"","",null,"","","","","","","","",null,null,null,null,null,null,null,"",null,"","",null,"","","","","","","","",""]
[{"$f":"IF('Liste équipes'!C7=\"\",\"\",'Liste équipes'!C7)","v":"LE PUY 2"},null,null,null,null,null,null,null,"",null,"","",null,"","","","","","","","",null,null,null,null,null,null,null,"",null,"","",null,"","","","","","","","",""]
[{"$f":"IF('Liste équipes'!C8=\"\",\"\",'Liste équipes'!C8)","v":"LYON"},null,null,null,null,null,null,null,"",null,"","",null,"","","","","","","","",null,null,null,null,null,null,null,"",null,"","",null,"","","","","","","","",""]
[{"$f":"IF('Liste équipes'!C9=\"\",\"\",'Liste équipes'!C9)","v":"VANDOEUVRE"},null,null,null,null,null,null,null,"",null,"","",null,"","","","","","","","",null,null,null,null,null,null,null,"",null,"","",null,"","","","","","","","",""]
[{"$f":"IF('Liste équipes'!C10=\"\",\"\",'Liste équipes'!C10)","v":""},null,null,null,null,null,null,null,"",null,"","",null,"","","","","","","","",null,null,null,null,null,null,null,"",null,"","",null,"","","","","","","","",""]
[{"$f":"IF('Liste équipes'!C11=\"\",\"\",'Liste équipes'!C11)","v":""},null,null,null,null,null,null,null,"",null,"","",null,"","","","","","","","",null,null,null,null,null,null,null,"",null,"","",null,"","","","","","","","",""]
[{"$f":"IF('Liste équipes'!C14=\"\",\"\",'Liste équipes'!C14)","v":""},null,null,null,null,null,null,null,"",null,"","",null,"","","","","","","","",null,null,null,null,null,null,null,"",null,"","",null,"","","","","","","","",""]
[null,null,null,null,null,null,null,null,null,null,"","",null,"","","","","","","","",null,null,null,null,null,null,null,{"$f":"IF(X23=\"n\",Y23,IF(X23=\"j\",Y23,IF(X23=\"jf\",Y23,IF(X23=\"f\",Y23,IF(X23=\"fet\",Y23,IF(X23=\"et\",Y23,IF(X23=\"fid\",Y23,IF(X23=\"s\",Y23,IF(X23=\"FS\",Y23,IF(X23=\"Js\",Y23,IF(X23=\"Jfs\",Y23,IF(X23=\"\",\"\"))))))))))))","v":""},null,"","",null,"","","","","","","","",""]
[null,null,null,null,null,null,null,null,null,null,"","",null,"","","","","","","","",null,null,null,null,null,null,null,"",null,"","",null,"","","","","","","","",""]
[null,null,null,"  Nombre joueurs sur le terrain",null,null,{"$f":"IF(J25>5,\"\",\"OK\")","v":""},{"$f":"IF(R25>5,\"PAS OK\",\"\")","v":""},null,{"$f":"IF(L27=\"\",\"\",R25)","v":""},"Points en jeu","Avec Bonus maxi 19 pts",null,{"$f":"SUM(N11:N24)","v":0},0,0,0,0,{"$f":"SUM(S11:S24)","v":0},{"$f":"SUM(T11:T24)","v":0},{"$f":"SUM(U11:U24)","v":0},null,null,"  Nombre joueurs sur le terrain",null,null,{"$f":"IF(AD25>5,\"\",\"OK\")","v":""},{"$f":"IF(AL25>5,\"PAS OK\",\"\")","v":""},null,{"$f":"IF(AF27=\"\",\"\",AL25)","v":""},"Points en jeu","Avec Bonus maxi 19 pts",null,{"$f":"SUM(AH11:AH24)","v":0},0,0,0,0,{"$f":"SUM(AM11:AM24)","v":0},{"$f":"SUM(AN11:AN24)","v":0},{"$f":"SUM(AO11:AO24)","v":0},{"$f":"SUM(AP11:AP24)","v":0}]
[null,null,null,null,null,null,null,null,null,null,null,null,null,{"$f":"IF(N25=0,\"\",IF(N25=1,17,IF(N25=2,18.5,IF(N25=3,19,IF(N25>3,19,IF(N25>4,19,IF(N25>5,19,\"\")))))))","v":""},{"$f":"IF(O25=0,\"\",IF(O25=1,18,IF(O25=2,19,IF(O25=3,19,IF(O25=4,19,IF(O25=4,19,\"\"))))))","v":""},{"$f":"IF(P25=0,\"\",IF(P25=1,17,IF(P25=2,18.5,IF(P25=3,19,IF(P25=4,19,IF(P25=5,17.5,\"\"))))))","v":""},{"$f":"IF(Q25=0,\"\",IF(Q25=1,16,IF(Q25=2,16.5,IF(Q25=3,17,IF(Q25=4,17.5,IF(Q25=5,18,IF(Q25=6,18.5,IF(Q25=7,19,IF(Q25=8,19,IF(Q25=9,19,IF(Q25=10,19,IF(Q25=11,19,IF(Q25=12,19,\"\")))))))))))))","v":""},{"$f":"IF(AND(O26=16.5,P26=16),17.5,IF(AND(N26=15.5,P26=16),17,IF(AND(N26=15.5,O26=16.5),17.5,IF(AND(N26=16.5,P26=16),17.5,IF(AND(N25=2,O26=16.5),17.5,\"\")))))","v":""},null,null,null,null,null,null,null,null,null,null,null,null,null,null,null,{"$f":"IF(AH25=0,\"\",IF(AH25=1,17,IF(AH25=2,18.5,IF(AH25=3,19,IF(AH25>3,19,IF(AH25>4,19,IF(AH25>5,19,\"\")))))))","v":""},{"$f":"IF(AI25=0,\"\",IF(AI25=1,18,IF(AI25=2,19,IF(AI25=3,19,IF(AI25=4,19,IF(AI25=4,19,\"\"))))))","v":""},{"$f":"IF(AJ25=0,\"\",IF(AJ25=1,17,IF(AJ25=2,18.5,IF(AJ25=3,19,IF(AJ25=4,19,IF(AJ25=5,17.5,\"\"))))))","v":""},{"$f":"IF(AK25=0,\"\",IF(AK25=1,16,IF(AK25=2,16.5,IF(AK25=3,17,IF(AK25=4,17.5,IF(AK25=5,18,IF(AK25=6,18.5,IF(AK25=7,19,IF(AK25=8,19,IF(AK25=9,19,IF(AK25=10,19,IF(AK25=11,19,IF(AK25=12,19,\"\")))))))))))))","v":""},{"$f":"IF(AND(AI26=16.5,AJ26=16),17.5,IF(AND(AH26=15.5,AJ26=16),17,IF(AND(AH26=15.5,AI26=16.5),17.5,IF(AND(AH26=16.5,AJ26=16),17.5,IF(AND(AH25=2,AI26=16.5),17.5,\"\")))))","v":""}]
[null,null," ",{"$f":"IF(K27>L27,\"Trop de points en jeu\",\"\")","v":""},null,null,null,null,null,null,{"$f":"IF(O28>0,O28,\"\")","v":""},{"$f":"IF(O28=0,\"\",Q28)","v":""},null,{"$f":"SUM(N26)","v":0},0,0,0,0,null,null,null,null," ",{"$f":"IF(AE27>AF27,\"Trop de points en jeu\",\"\")","v":""},null,null,null,null,null,null,{"$f":"IF(AI28>0,AI28,\"\")","v":""},{"$f":"IF(AI28=0,\"\",AK28)","v":""},null,{"$f":"SUM(AH26)","v":0},0,0,0,0]
[null,null,null,{"$f":"IF(S25>2,\"Trop de joueurs  valides inscrits sur la feuille\",\"\")","v":""},null,null,null,null,null,null,null,null,null,{"$f":"SUM(L11:L24)","v":0},{"$f":"SUM(K11:K24)","v":0},{"$f":"SUM(N28+15)","v":15},{"$f":"IF(P28>19,19,P28)","v":15},null,null,{"$f":"SUM(T30:T31)","v":0},null,null,null,{"$f":"IF(AM25>2,\"Trop de joueurs  valides inscrits sur la feuille\",\"\")","v":""},null,null,null,null,null,null,null,null,null,{"$f":"SUM(AF11:AF24)","v":0},{"$f":"SUM(AE11:AE24)","v":0},{"$f":"SUM(AH28+15)","v":15},{"$f":"IF(AJ28>19,19,AJ28)","v":15},null,null,{"$f":"SUM(AN30:AN31)","v":0}]
[]
[null,null,null,{"$f":"IF(T28>5,\"Pas OK. Trop de joueurs étrangers sur la feuille (ET), vérifier la liste.\",IF(T25>4,\"Pas OK. Trop de joueurs étrangers en jeu (ET), vérifier la liste.\",\"\"))","v":""},null,null,null,null,null,null,null,null,null,{"$f":"IF(D11=\"ET\",1,\"\")","v":""},{"$f":"IF(D12=\"ET\",1,\"\")","v":""},{"$f":"IF(D13=\"ET\",1,\"\")","v":""},{"$f":"IF(D14=\"ET\",1,\"\")","v":""},{"$f":"IF(D15=\"ET\",1,\"\")","v":""},{"$f":"IF(D16=\"ET\",1,\"\")","v":""},{"$f":"SUM(N30:S30)","v":0},null,null,null,{"$f":"IF(AN28>5,\"Pas OK. Trop de joueurs étrangers sur la feuille (ET), vérifier la liste.\",IF(AN25>4,\"Pas OK. Trop de joueurs étrangers en jeu (ET), vérifier la liste.\",\"\"))","v":""},null,null,null,null,null,null,null,null,null,{"$f":"IF(X11=\"ET\",1,\"\")","v":""},{"$f":"IF(X12=\"ET\",1,\"\")","v":""},{"$f":"IF(X13=\"ET\",1,\"\")","v":""},{"$f":"IF(X14=\"ET\",1,\"\")","v":""},{"$f":"IF(X15=\"ET\",1,\"\")","v":""},{"$f":"IF(X16=\"ET\",1,\"\")","v":""},{"$f":"SUM(AH30:AM30)","v":0}]
[null,null,null,null,null,null,null,null,null,null,null,null,null,{"$f":"IF(D17=\"ET\",1,\"\")","v":""},{"$f":"IF(D18=\"ET\",1,\"\")","v":""},{"$f":"IF(D19=\"ET\",1,\"\")","v":""},{"$f":"IF(D20=\"ET\",1,\"\")","v":""},{"$f":"IF(D21=\"ET\",1,\"\")","v":""},{"$f":"IF(D22=\"ET\",1,\"\")","v":""},{"$f":"SUM(N31:S31)","v":0},null,null,null,null,null,null,null,null,null,null,null,null,null,{"$f":"IF(X17=\"ET\",1,\"\")","v":""},{"$f":"IF(X18=\"ET\",1,\"\")","v":""},{"$f":"IF(X19=\"ET\",1,\"\")","v":""},{"$f":"IF(X20=\"ET\",1,\"\")","v":""},{"$f":"IF(X21=\"ET\",1,\"\")","v":""},{"$f":"IF(X22=\"ET\",1,\"\")","v":""},{"$f":"SUM(AH31:AM31)","v":0}]

{"sheet":"Nationale_2_poule_B","index":4,"n_rows":31,"n_cols":41,"rows_kept":31,"cut":false,"hidden":false,"merged":[[34,23,40,23],[26,3,26,8],[26,11,27,11],[26,23,26,28],[26,31,27,31],[26,10,27,10],[26,30,27,30],[29,3,30,11],[29,23,30,31],[27,3,27,8],[27,23,27,28],[5,3,5,11],[5,23,5,31],[6,3,6,11],[6,23,6,31],[25,3,25,8],[25,23,25,28],[8,25,8,26],[24,10,25,10],[24,30,25,30],[24,7,24,8],[24,11,25,11],[24,27,24,28],[24,31,25,31]]}
["x"]
[]
[]
[]
[]
[null,null,null,"Equipe A",null,null,null,null,null,null,null,null,null,null,null,null,null,null,null,null,null,null,null,"Equipe B"]
[null,null,null,"AULNOYE",null,null,null,null,null,null,null,null,null,null,null,null,null,null,null,null,null,null,null,"AULNOYE"]
[]
[null,null,null,"Carte","Pts","   Noms         /          Prénoms",null,"N°","Valeur","entrée en jeu","Sans Abattement","Bonus",null,"J","JF","F-FET","S-SF",null,"Valide","ET",null,null,null,"Carte","Pts","   Noms         /          Prénoms",null,"N°","Valeur","entrée en jeu","Sans Abattement","Bonus",null,"J","JF","F-FET","S-SF",null,"Valide","ET"]
[]
[{"$f":"IF('Liste équipes'!D3=\"\",\"\",'Liste équipes'!D3)","v":"AMIENS"},null,null,null,null,null,null,null,{"$f":"IF(D11=\"N\",E11,IF(D11=\"J\",E11,IF(D11=\"JF\",E11,IF(D11=\"F\",E11,IF(D11=\"FET\",E11,IF(D11=\"ET\",E11,IF(D11=\"FID\",E11,IF(D11=\"S\",E11,IF(D11=\"FS\",E11,IF(D11=\"JS\",E11,IF(D11=\"JFS\",E11,IF(D11=\"\",\"\"))))))))))))","v":""},null,{"$f":"IF(AND(J11=\"X\",E11>0),I11,\"\")","v":""},{"$f":"IF(AND(J11=\"X\",D11=\"J\"),1.5,IF(AND(J11=\"X\",D11=\"JF\"),2.5,IF(AND(J11=\"X\",D11=\"JS\"),2,IF(AND(J11=\"X\",D11=\"JFS\"),3,IF(AND(J11=\"X\",D11=\"F\",E11<5),1.5,IF(AND(J11=\"X\",D11=\"FET\",E11<5),1.5,IF(AND(J11=\"X\",D11=\"FS\",E11<5),2,IF(AND(J11=\"X\",D11=\"S\",E11<5),0.5,\"\"))))))))","v":""},null,{"$f":"IF(AND(J11=\"X\",D11=\"J\"),1,\"\")","v":""},{"$f":"IF(AND(J11=\"X\",D11=\"JF\"),1,IF(AND(J11=\"X\",D11=\"SF\"),1,\"\"))","v":""},{"$f":"IF(AND(J11=\"X\",D11=\"F\"),1,IF(AND(J11=\"X\",D11=\"FET\"),1,\"\"))","v":""},{"$f":"IF(AND(J11=\"X\",D11=\"S\"),1,\"\")","v":""},{"$f":"IF(AND(J11=\"X\",E11>0),1,\"\")","v":""},{"$f":"IF(E11=5,1,\"\")","v":""},{"$f":"IF(AND(D11=\"ET\",J11=\"X\"),1,\"\")","v":""},{"$f":"IF(AND(J11=\"X\",D11=\"ET\"),1,\"\")","v":""},null,null,null,null,null,null,null,{"$f":"IF(X11=\"N\",Y11,IF(X11=\"J\",Y11,IF(X11=\"JF\",Y11,IF(X11=\"F\",Y11,IF(X11=\"FET\",Y11,IF(X11=\"ET\",Y11,IF(X11=\"FID\",Y11,IF(X11=\"S\",Y11,IF(X11=\"FS\",Y11,IF(X11=\"JS\",Y11,IF(X11=\"JFS\",Y11,IF(X11=\"\",\"\"))))))))))))","v":""},null,{"$f":"IF(AND(AD11=\"X\",Y11>0),AC11,\"\")","v":""},{"$f":"IF(AND(AD11=\"X\",X11=\"J\"),1.5,IF(AND(AD11=\"X\",X11=\"JF\"),2.5,IF(AND(AD11=\"X\",X11=\"JS\"),2,IF(AND(AD11=\"X\",X11=\"JFS\"),3,IF(AND(AD11=\"X\",X11=\"F\",Y11<5),1.5,IF(AND(AD11=\"X\",X11=\"FET\",Y11<5),1.5,IF(AND(AD11=\"X\",X11=\"FS\",Y11<5),2,IF(AND(AD11=\"X\",X11=\"S\",Y11<5),0.5,\"\"))))))))","v":""},null,{"$f":"IF(AND(AD11=\"X\",X11=\"J\"),1,\"\")","v":""},{"$f":"IF(AND(AD11=\"X\",X11=\"JF\"),1,IF(AND(AD11=\"X\",X11=\"SF\"),1,\"\"))","v":""},{"$f":"IF(AND(AD11=\"X\",X11=\"F\"),1,IF(AND(AD11=\"X\",X11=\"FET\"),1,\"\"))","v":""},{"$f":"IF(AND(AD11=\"X\",X11=\"S\"),1,\"\")","v":""},{"$f":"IF(AND(AD11=\"X\",Y11>0),1,\"\")","v":""},{"$f":"IF(Y11=5,1,\"\")","v":""},{"$f":"IF(AND(X11=\"ET\",AD11=\"X\"),1,\"\")","v":""},{"$f":"IF(AND(AD11=\"X\",X11=\"ET\"),1,\"\")","v":""}]
[{"$f":"IF('Liste équipes'!D4=\"\",\"\",'Liste équipes'!D4)","v":"AULNOYE"},null,null,null,null,null,null,null,{"$f":"IF(D12=\"n\",E12,IF(D12=\"j\",E12,IF(D12=\"jf\",E12,IF(D12=\"f\",E12,IF(D12=\"fet\",E12,IF(D12=\"et\",E12,IF(D12=\"fid\",E12,IF(D12=\"s\",E12,IF(D12=\"FS\",E12,IF(D12=\"JS\",E12,IF(D12=\"JFS\",E12,IF(D12=\"\",\"\"))))))))))))","v":""},null,{"$f":"IF(AND(J12=\"X\",E12>0),I12,\"\")","v":""},{"$f":"IF(AND(J12=\"X\",D12=\"J\"),1.5,IF(AND(J12=\"X\",D12=\"JF\"),2.5,IF(AND(J12=\"X\",D12=\"JS\"),2,IF(AND(J12=\"X\",D12=\"JFS\"),3,IF(AND(J12=\"X\",D12=\"F\",E12<5),1.5,IF(AND(J12=\"X\",D12=\"FET\",E12<5),1.5,IF(AND(J12=\"X\",D12=\"FS\",E12<5),2,IF(AND(J12=\"X\",D12=\"S\",E12<5),0.5,\"\"))))))))","v":""},null,{"$f":"IF(AND(J12=\"X\",D12=\"J\"),1,\"\")","v":""},{"$f":"IF(AND(J12=\"X\",D12=\"JF\"),1,\"\")","v":""},{"$f":"IF(AND(J12=\"X\",D12=\"F\"),1,IF(AND(J12=\"X\",D12=\"FET\"),1,\"\"))","v":""},{"$f":"IF(AND(J12=\"X\",D12=\"S\"),1,\"\")","v":""},{"$f":"IF(AND(J12=\"X\",E12>0),1,\"\")","v":""},{"$f":"IF(E12=5,1,\"\")","v":""},{"$f":"IF(AND(D12=\"ET\",J12=\"X\"),1,\"\")","v":""},{"$f":"IF(AND(J12=\"X\",D12=\"ET\"),1,\"\")","v":""},null,null,null,null,null,null,null,{"$f":"IF(X12=\"n\",Y12,IF(X12=\"j\",Y12,IF(X12=\"jf\",Y12,IF(X12=\"f\",Y12,IF(X12=\"fet\",Y12,IF(X12=\"et\",Y12,IF(X12=\"fid\",Y12,IF(X12=\"s\",Y12,IF(X12=\"FS\",Y12,IF(X12=\"JS\",Y12,IF(X12=\"JFS\",Y12,IF(X12=\"\",\"\"))))))))))))","v":""},null,{"$f":"IF(AND(AD12=\"X\",Y12>0),AC12,\"\")","v":""},{"$f":"IF(AND(AD12=\"X\",X12=\"J\"),1.5,IF(AND(AD12=\"X\",X12=\"JF\"),2.5,IF(AND(AD12=\"X\",X12=\"JS\"),2,IF(AND(AD12=\"X\",X12=\"JFS\"),3,IF(AND(AD12=\"X\",X12=\"F\",Y12<5),1.5,IF(AND(AD12=\"X\",X12=\"FET\",Y12<5),1.5,IF(AND(AD12=\"X\",X12=\"FS\",Y12<5),2,IF(AND(AD12=\"X\",X12=\"S\",Y12<5),0.5,\"\"))))))))","v":""},null,{"$f":"IF(AND(AD12=\"X\",X12=\"J\"),1,\"\")","v":""},{"$f":"IF(AND(AD12=\"X\",X12=\"JF\"),1,\"\")","v":""},{"$f":"IF(AND(AD12=\"X\",X12=\"F\"),1,IF(AND(AD12=\"X\",X12=\"FET\"),1,\"\"))","v":""},{"$f":"IF(AND(AD12=\"X\",X12=\"S\"),1,\"\")","v":""},{"$f":"IF(AND(AD12=\"X\",Y12>0),1,\"\")","v":""},{"$f":"IF(Y12=5,1,\"\")","v":""},{"$f":"IF(AND(X12=\"ET\",AD12=\"X\"),1,\"\")","v":""},{"$f":"IF(AND(AD12=\"X\",X12=\"ET\"),1,\"\")","v":""}]
[{"$f":"IF('Liste équipes'!D5=\"\",\"\",'Liste équipes'!D5)","v":"BLANQUEFORT"},null,null,null,null,null,null,null,"",null,"","",null,"","","","","","","","",null,null,null,null,null,null,null,"",null,"","",null,"","","","","","","",""]
[{"$f":"IF('Liste équipes'!D6=\"\",\"\",'Liste équipes'!D6)","v":"CAMBRAI"},null,null,null,null,null,null,null,"",null,"","",null,"","","","","","","","",null,null,null,null,null,null,null,"",null,"","",null,"","","","","","","",""]
[{"$f":"IF('Liste équipes'!D7=\"\",\"\",'Liste équipes'!D7)","v":"BASKET FAUTEUIL FEMININ"},null,null,null,null,null,null,null,"",null,"","",null,"","","","","","","","",null,null,null,null,null,null,null,"",null,"","",null,"","","","","","","",""]
[{"$f":"IF('Liste équipes'!D8=\"\",\"\",'Liste équipes'!D8)","v":"LANNION 2"},null,null,null,null,null,null,null,"",null,"","",null,"","","","","","","","",null,null,null,null,null,null,null,"",null,"","",null,"","","","","","","",""]
[{"$f":"IF('Liste équipes'!D9=\"\",\"\",'Liste équipes'!D9)","v":"SAINT HERBLAIN"},null,null,null,null,null,null,null,"",null,"","",null,"","","","","","","","",null,null,null,null,null,null,null,"",null,"","",null,"","","","","","","",""]
[{"$f":"IF('Liste équipes'!D10=\"\",\"\",'Liste équipes'!D10)","v":""},null,null,null,null,null,null,null,"",null,"","",null,"","","","","","","","",null,null,null,null,null,null,null,"",null,"","",null,"","","","","","","",""]
[{"$f":"IF('Liste équipes'!D11=\"\",\"\",'Liste équipes'!D11)","v":""},null,null,null,null,null,null,null,"",null,"","",null,"","","","","","","","",null,null,null,null,null,null,null,"",null,"","",null,"","","","","","","",""]
[{"$f":"IF('Liste équipes'!D12=\"\",\"\",'Liste équipes'!D12)","v":""},null,null,null,null,null,null,null,"",null,"","",null,"","","","","","","","",null,null,null,null,null,null,null,"",null,"","",null,"","","","","","","",""]
[{"$f":"IF('Liste équipes'!D13=\"\",\"\",'Liste équipes'!D13)","v":""},null,null,null,null,null,null,null,"",null,"","",null,"","","","","","","","",null,null,null,null,null,null,null,"",null,"","",null,"","","","","","","",""]
[{"$f":"IF('Liste équipes'!D14=\"\",\"\",'Liste équipes'!D14)","v":""},null,null,null,null,null,null,null,"",null,"","",null,"","","","","","","","",null,null,null,null,null,null,null,"",null,"","",null,"","","","","","","",""]
[null,null,null,null,null,null,null,null,null,null,"","",null,"","","","","","","","",null,null,null,null,null,null,null,null,null,"","",null,"","","","","","","",""]
[null,null,null,null,null,null,null,null,null,null,"","",null,"","","","","","","","",null,null,null,null,null,null,null,null,null,"","",null,"","","","","","","",""]
[null,null,null,"  Nombre joueurs sur le terrain",null,null,{"$f":"IF(J25>5,\"\",\"OK\")","v":""},{"$f":"IF(R25>5,\"PAS OK\",\"\")","v":""},null,{"$f":"IF(L27=\"\",\"\",R25)","v":""},"Points en jeu","Avec Bonus maxi 19 pts",null,{"$f":"SUM(N11:N24)","v":0},0,0,0,0,{"$f":"SUM(S11:S24)","v":0},{"$f":"SUM(T11:T24)","v":0},{"$f":"SUM(U11:U24)","v":0},null,null,"  Nombre joueurs sur le terrain",null,null,{"$f":"IF(AD25>5,\"\",\"OK\")","v":""},{"$f":"IF(AL25>5,\"PAS OK\",\"\")","v":""},null,{"$f":"IF(AF27=\"\",\"\",AL25)","v":""},"Points en jeu","Avec Bonus maxi 19 pts",null,{"$f":"SUM(AH11:AH24)","v":0},0,0,0,0,{"$f":"SUM(AM11:AM24)","v":0},{"$f":"SUM(AN11:AN24)","v":0},{"$f":"SUM(AO11:AO24)","v":0}]
[null,null,null,null,null,null,null,null,null,null,null,null,null,{"$f":"IF(N25=0,\"\",IF(N25=1,17,IF(N25=2,18.5,IF(N25=3,19,IF(N25>3,19,IF(N25>4,19,IF(N25>5,19,\"\")))))))","v":""},{"$f":"IF(O25=0,\"\",IF(O25=1,18,IF(O25=2,19,IF(O25=3,19,IF(O25=4,19,IF(O25=4,19,\"\"))))))","v":""},{"$f":"IF(P25=0,\"\",IF(P25=1,17,IF(P25=2,18.5,IF(P25=3,19,IF(P25=4,19,IF(P25=5,17.5,\"\"))))))","v":""},{"$f":"IF(Q25=0,\"\",IF(Q25=1,16,IF(Q25=2,16.5,IF(Q25=3,17,IF(Q25=4,17.5,IF(Q25=5,18,IF(Q25=6,18.5,IF(Q25=7,19,IF(Q25=8,19,IF(Q25=9,19,IF(Q25=10,19,IF(Q25=11,19,IF(Q25=12,19,\"\")))))))))))))","v":""},{"$f":"IF(AND(O26=16.5,P26=16),17.5,IF(AND(N26=15.5,P26=16),17,IF(AND(N26=15.5,O26=16.5),17.5,IF(AND(N26=16.5,P26=16),17.5,IF(AND(N25=2,O26=16.5),17.5,\"\")))))","v":""},null,null,null,null,null,null,null,null,null,null,null,null,null,null,null,{"$f":"IF(AH25=0,\"\",IF(AH25=1,17,IF(AH25=2,18.5,IF(AH25=3,19,IF(AH25>3,19,IF(AH25>4,19,IF(AH25>5,19,\"\")))))))","v":""},{"$f":"IF(AI25=0,\"\",IF(AI25=1,18,IF(AI25=2,19,IF(AI25=3,19,IF(AI25=4,19,IF(AI25=4,19,\"\"))))))","v":""},{"$f":"IF(AJ25=0,\"\",IF(AJ25=1,17,IF(AJ25=2,18.5,IF(AJ25=3,19,IF(AJ25=4,19,IF(AJ25=5,17.5,\"\"))))))","v":""},{"$f":"IF(AK25=0,\"\",IF(AK25=1,16,IF(AK25=2,16.5,IF(AK25=3,17,IF(AK25=4,17.5,IF(AK25=5,18,IF(AK25=6,18.5,IF(AK25=7,19,IF(AK25=8,19,IF(AK25=9,19,IF(AK25=10,19,IF(AK25=11,19,IF(AK25=12,19,\"\")))))))))))))","v":""},{"$f":"IF(AND(AI26=16.5,AJ26=16),17.5,IF(AND(AH26=15.5,AJ26=16),17,IF(AND(AH26=15.5,AI26=16.5),17.5,IF(AND(AH26=16.5,AJ26=16),17.5,IF(AND(AH25=2,AI26=16.5),17.5,\"\")))))","v":""}]
[null,null," ",{"$f":"IF(K27>L27,\"Trop de points en jeu\",\"\")","v":""},null,null,null,null,null,null,{"$f":"IF(O28>0,O28,\"\")","v":""},{"$f":"IF(O28=0,\"\",Q28)","v":""},null,{"$f":"SUM(N26)","v":0},0,0,0,0,null,null,null,null," ",{"$f":"IF(AE27>AF27,\"Trop de points en jeu\",\"\")","v":""},null,null,null,null,null,null,{"$f":"IF(AI28>0,AI28,\"\")","v":""},{"$f":"IF(AI28=0,\"\",AK28)","v":""},null,{"$f":"SUM(AH26)","v":0},0,0,0,0]
[null,null,null,{"$f":"IF(S25>2,\"Trop de joueurs  valides inscrits sur la feuille\",\"\")","v":""},null,null,null,null,null,null,null,null,null,{"$f":"SUM(L11:L24)","v":0},{"$f":"SUM(K11:K24)","v":0},{"$f":"SUM(N28+15)","v":15},{"$f":"IF(P28>19,19,P28)","v":15},null,null,{"$f":"SUM(T30:T31)","v":0},null,null,null,{"$f":"IF(AM25>2,\"Trop de joueurs  valides inscrits sur la feuille\",\"\")","v":""},null,null,null,null,null,null,null,null,null,{"$f":"SUM(AF11:AF24)","v":0},{"$f":"SUM(AE11:AE24)","v":0},{"$f":"SUM(AH28+15)","v":15},{"$f":"IF(AJ28>19,19,AJ28)","v":15},null,null,{"$f":"SUM(AN30:AN31)","v":0}]
[]
[null,null,null,{"$f":"IF(T28>5,\"Pas OK. Trop de joueurs étrangers sur la feuille (ET), vérifier la liste.\",IF(T25>4,\"Pas OK. Trop de joueurs étrangers en jeu (ET), vérifier la liste.\",\"\"))","v":""},null,null,null,null,null,null,null,null,null,{"$f":"IF(D11=\"ET\",1,\"\")","v":""},{"$f":"IF(D12=\"ET\",1,\"\")","v":""},{"$f":"IF(D13=\"ET\",1,\"\")","v":""},{"$f":"IF(D14=\"ET\",1,\"\")","v":""},{"$f":"IF(D15=\"ET\",1,\"\")","v":""},{"$f":"IF(D16=\"ET\",1,\"\")","v":""},{"$f":"SUM(N30:S30)","v":0},null,null,null,{"$f":"IF(AN28>5,\"Pas OK. Trop de joueurs étrangers sur la feuille (ET), vérifier la liste.\",IF(AN25>4,\"Pas OK. Trop de joueurs étrangers en jeu (ET), vérifier la liste.\",\"\"))","v":""},null,null,null,null,null,null,null,null,null,{"$f":"IF(X11=\"ET\",1,\"\")","v":""},{"$f":"IF(X12=\"ET\",1,\"\")","v":""},{"$f":"IF(X13=\"ET\",1,\"\")","v":""},{"$f":"IF(X14=\"ET\",1,\"\")","v":""},{"$f":"IF(X15=\"ET\",1,\"\")","v":""},{"$f":"IF(X16=\"ET\",1,\"\")","v":""},{"$f":"SUM(AH30:AM30)","v":0}]
[null,null,null,null,null,null,null,null,null,null,null,null,null,{"$f":"IF(D17=\"ET\",1,\"\")","v":""},{"$f":"IF(D18=\"ET\",1,\"\")","v":""},{"$f":"IF(D19=\"ET\",1,\"\")","v":""},{"$f":"IF(D20=\"ET\",1,\"\")","v":""},{"$f":"IF(D21=\"ET\",1,\"\")","v":""},{"$f":"IF(D22=\"ET\",1,\"\")","v":""},{"$f":"SUM(N31:S31)","v":0},null,null,null,null,null,null,null,null,null,null,null,null,null,{"$f":"IF(X17=\"ET\",1,\"\")","v":""},{"$f":"IF(X18=\"ET\",1,\"\")","v":""},{"$f":"IF(X19=\"ET\",1,\"\")","v":""},{"$f":"IF(X20=\"ET\",1,\"\")","v":""},{"$f":"IF(X21=\"ET\",1,\"\")","v":""},{"$f":"IF(X22=\"ET\",1,\"\")","v":""},{"$f":"SUM(AH31:AM31)","v":0}]

{"sheet":"Nationale_3_poule_A","index":5,"n_rows":31,"n_cols":41,"rows_kept":31,"cut":false,"hidden":false,"merged":[[5,3,5,11],[5,23,5,31],[6,3,6,11],[6,23,6,31],[25,3,25,8],[25,23,25,28],[8,25,8,26],[24,10,25,10],[24,30,25,30],[24,11,25,11],[24,31,25,31],[24,7,24,8],[24,27,24,28],[34,23,40,23],[26,3,26,8],[26,11,27,11],[26,23,26,28],[26,31,27,31],[26,10,27,10],[26,30,27,30],[29,3,30,11],[29,23,30,31],[27,3,27,8],[27,23,27,28]]}
[]
[]
[]
[]
[]
[null,null,null,"Equipe A",null,null,null,null,null,null,null,null,null,null,null,null,null,null,null,null,null,null,null,"Equipe B"]
[null,null,null,"BERCK",null,null,null,null,null,null,null,null,null,null,null,null,null,null,null,null,null,null,null,"BERCK"]
[]
[null,null,null,"Carte","Pts","   Noms         /          Prénoms",null,"N°","Valeur","entrée en jeu","Sans Abattement","Bonus",null,"J","JF","F-FET","S-SF",null,"Valide","ET",null,null,null,"Carte","Pts","   Noms         /          Prénoms",null,"N°","Valeur","entrée en jeu","Sans Abattement","Bonus",null,"J","JF","F-FET","S-SF",null,"Valide","ET"]
[]
["BERCK",null,null,null,null,null,null,null,{"$f":"IF(D11=\"sf\",E11,IF(D11=\"n\",E11,IF(D11=\"j\",E11,IF(D11=\"jf\",E11,IF(D11=\"f\",E11,IF(D11=\"fet\",E11,IF(D11=\"et\",E11,IF(D11=\"fid\",E11,IF(D11=\"s\",E11,IF(D11=\"FS\",E11,IF(D11=\"Js\",E11,IF(D11=\"Jfs\",E11,IF(D11=\"\",\"\")))))))))))))","v":""},null,{"$f":"IF(AND(J11=\"X\",E11>0),I11,\"\")","v":""},{"$f":"IF(AND(J11=\"X\",D11=\"J\"),1.5,IF(AND(J11=\"X\",D11=\"JF\"),2.5,IF(AND(J11=\"X\",D11=\"JS\"),2,IF(AND(J11=\"X\",D11=\"JFS\"),3,IF(AND(J11=\"X\",D11=\"F\",E11<5),1.5,IF(AND(J11=\"X\",D11=\"FET\",E11<5),1.5,IF(AND(J11=\"X\",D11=\"FS\",E11<5),2,IF(AND(J11=\"X\",D11=\"S\",E11<5),0.5,IF(AND(J11=\"X\",D11=\"SF\"),0.5,\"\")))))))))","v":""},null,{"$f":"IF(AND(J11=\"X\",D11=\"J\"),1,\"\")","v":""},{"$f":"IF(AND(J11=\"X\",D11=\"JF\"),1,IF(AND(J11=\"X\",D11=\"SF\"),1,\"\"))","v":""},{"$f":"IF(AND(J11=\"X\",D11=\"F\"),1,IF(AND(J11=\"X\",D11=\"FET\"),1,\"\"))","v":""},{"$f":"IF(AND(J11=\"X\",D11=\"S\"),1,\"\")","v":""},{"$f":"IF(AND(J11=\"X\",E11>0),1,\"\")","v":""},{"$f":"IF(E11=5,1,\"\")","v":""},{"$f":"IF(D11=\"ET\",1,\"\")","v":""},{"$f":"IF(AND(J11=\"X\",D11=\"ET\"),1,\"\")","v":""},null,null,null,null,null,null,null,{"$f":"IF(X11=\"sf\",Y11,IF(X11=\"n\",Y11,IF(X11=\"j\",Y11,IF(X11=\"jf\",Y11,IF(X11=\"f\",Y11,IF(X11=\"fet\",Y11,IF(X11=\"et\",Y11,IF(X11=\"fid\",Y11,IF(X11=\"s\",Y11,IF(X11=\"FS\",Y11,IF(X11=\"Js\",Y11,IF(X11=\"Jfs\",Y11,IF(X11=\"\",\"\")))))))))))))","v":""},null,{"$f":"IF(AND(AD11=\"X\",Y11>0),AC11,\"\")","v":""},{"$f":"IF(AND(AD11=\"X\",X11=\"J\"),1.5,IF(AND(AD11=\"X\",X11=\"JF\"),2.5,IF(AND(AD11=\"X\",X11=\"JS\"),2,IF(AND(AD11=\"X\",X11=\"JFS\"),3,IF(AND(AD11=\"X\",X11=\"F\",Y11<5),1.5,IF(AND(AD11=\"X\",X11=\"FET\",Y11<5),1.5,IF(AND(AD11=\"X\",X11=\"FS\",Y11<5),2,IF(AND(AD11=\"X\",X11=\"S\",Y11<5),0.5,IF(AND(AD11=\"x\",X11=\"SF\"),0.5,\"\")))))))))","v":""},null,{"$f":"IF(AND(AD11=\"X\",X11=\"J\"),1,\"\")","v":""},{"$f":"IF(AND(AD11=\"X\",X11=\"JF\"),1,IF(AND(AD11=\"X\",X11=\"SF\"),1,\"\"))","v":""},{"$f":"IF(AND(AD11=\"X\",X11=\"F\"),1,IF(AND(AD11=\"X\",X11=\"FET\"),1,\"\"))","v":""},{"$f":"IF(AND(AD11=\"X\",X11=\"S\"),1,\"\")","v":""},{"$f":"IF(AND(AD11=\"X\",Y11>0),1,\"\")","v":""},{"$f":"IF(Y11=5,1,\"\")","v":""},{"$f":"IF(X11=\"ET\",1,\"\")","v":""},{"$f":"IF(AND(AD11=\"X\",X11=\"ET\"),1,\"\")","v":""}]
["CAPSAAA 2",null,null,null,null,null,null,null,{"$f":"IF(D12=\"sf\",E12,IF(D12=\"n\",E12,IF(D12=\"j\",E12,IF(D12=\"jf\",E12,IF(D12=\"f\",E12,IF(D12=\"fet\",E12,IF(D12=\"et\",E12,IF(D12=\"fid\",E12,IF(D12=\"s\",E12,IF(D12=\"FS\",E12,IF(D12=\"Js\",E12,IF(D12=\"Jfs\",E12,IF(D12=\"\",\"\")))))))))))))","v":""},null,"",{"$f":"IF(AND(J12=\"X\",D12=\"J\"),1.5,IF(AND(J12=\"X\",D12=\"JF\"),2.5,IF(AND(J12=\"X\",D12=\"JS\"),2,IF(AND(J12=\"X\",D12=\"JFS\"),3,IF(AND(J12=\"X\",D12=\"F\",E12<5),1.5,IF(AND(J12=\"X\",D12=\"FET\",E12<5),1.5,IF(AND(J12=\"X\",D12=\"FS\",E12<5),2,IF(AND(J12=\"X\",D12=\"S\",E12<5),0.5,IF(AND(J12=\"X\",D12=\"SF\"),0.5,\"\")))))))))","v":""},null,"",{"$f":"IF(AND(J12=\"X\",D12=\"JF\"),1,\"\")","v":""},"","","","","",{"$f":"IF(AND(J12=\"X\",D12=\"ET\"),1,\"\")","v":""},null,null,null,null,null,null,null,{"$f":"IF(X12=\"sf\",Y12,IF(X12=\"n\",Y12,IF(X12=\"j\",Y12,IF(X12=\"jf\",Y12,IF(X12=\"f\",Y12,IF(X12=\"fet\",Y12,IF(X12=\"et\",Y12,IF(X12=\"fid\",Y12,IF(X12=\"s\",Y12,IF(X12=\"FS\",Y12,IF(X12=\"Js\",Y12,IF(X12=\"Jfs\",Y12,IF(X12=\"\",\"\")))))))))))))","v":""},null,"",{"$f":"IF(AND(AD12=\"X\",X12=\"J\"),1.5,IF(AND(AD12=\"X\",X12=\"JF\"),2.5,IF(AND(AD12=\"X\",X12=\"JS\"),2,IF(AND(AD12=\"X\",X12=\"JFS\"),3,IF(AND(AD12=\"X\",X12=\"F\",Y12<5),1.5,IF(AND(AD12=\"X\",X12=\"FET\",Y12<5),1.5,IF(AND(AD12=\"X\",X12=\"FS\",Y12<5),2,IF(AND(AD12=\"X\",X12=\"S\",Y12<5),0.5,IF(AND(AD12=\"x\",X12=\"SF\"),0.5,\"\")))))))))","v":""},null,"",{"$f":"IF(AND(AD12=\"X\",X12=\"JF\"),1,\"\")","v":""},"","","","","",{"$f":"IF(AND(AD12=\"X\",X12=\"ET\"),1,\"\")","v":""}]
[{"$f":"IF('Liste équipes'!E5=\"\",\"\",'Liste équipes'!E5)","v":"CERGY PONTOISE"},null,null,null,null,null,null,null,"",null,"",{"$f":"IF(AND(J13=\"X\",D13=\"J\"),1.5,IF(AND(J13=\"X\",D13=\"JF\"),2.5,IF(AND(J13=\"X\",D13=\"JS\"),2,IF(AND(J13=\"X\",D13=\"JFS\"),3,IF(AND(J13=\"X\",D13=\"F\",E13<5),1.5,IF(AND(J13=\"X\",D13=\"FET\",E13<5),1.5,IF(AND(J13=\"X\",D13=\"FS\",E13<5),2,IF(AND(J13=\"X\",D13=\"S\",E13<5),0.5,IF(AND(J13=\"X\",D13=\"SF\"),0.5,\"\")))))))))","v":""},null,"","","","","","","","",null,null,null,null,null,null,null,"",null,"","",null,"","","","","","","",""]
[{"$f":"IF('Liste équipes'!E6=\"\",\"\",'Liste équipes'!E6)","v":"SUD OISE SPORTS ET HANDICAPS"},null,null,null,null,null,null,null,"",null,"","",null,"","","","","","","","",null,null,null,null,null,null,null,"",null,"","",null,"","","","","","","",""]
[{"$f":"IF('Liste équipes'!E7=\"\",\"\",'Liste équipes'!E7)","v":"Ent-HURRICANE-PBF"},null,null,null,null,null,null,null,"",null,"","",null,"","","","","","","","",null,null,null,null,null,null,null,"",null,"","",null,"","","","","","","",""]
["ORLEANS",null,null,null,null,null,null,null,"",null,"","",null,"","","","","","","","",null,null,null,null,null,null,null,"",null,"","",null,"","","","","","","",""]
[{"$f":"IF('Liste équipes'!E9=\"\",\"\",'Liste équipes'!E9)","v":"ORLEANS"},null,null,null,null,null,null,null,"",null,"","",null,"","","","","","","","",null,null,null,null,null,null,null,"",null,"","",null,"","","","","","","",""]
[{"$f":"IF('Liste équipes'!E10=\"\",\"\",'Liste équipes'!E10)","v":"SAINT OUEN"},null,null,null,null,null,null,null,"",null,"","",null,"","","","","","","","",null,null,null,null,null,null,null,"",null,"","",null,"","","","","","","",""]
[{"$f":"IF('Liste équipes'!E11=\"\",\"\",'Liste équipes'!E11)","v":"VALENCIENNES"},null,null,null,null,null,null,null,"",null,"","",null,"","","","","","","","",null,null,null,null,null,null,null,"",null,"","",null,"","","","","","","",""]
[{"$f":"IF('Liste équipes'!E12=\"\",\"\",'Liste équipes'!E12)","v":""},null,null,null,null,null,null,null,"",null,"","",null,"","","","","","","","",null,null,null,null,null,null,null,"",null,"","",null,"","","","","","","",""]
[{"$f":"IF('Liste équipes'!E13=\"\",\"\",'Liste équipes'!E13)","v":""},null,null,null,null,null,null,null,"",null,"","",null,"","","","","","","","",null,null,null,null,null,null,null,"",null,"","",null,"","","","","","","",""]
[{"$f":"IF('Liste équipes'!E14=\"\",\"\",'Liste équipes'!E14)","v":""},null,null,null,null,null,null,null,"",null,"","",null,"","","","","","","","",null,null,null,null,null,null,null,"",null,"","",null,"","","","","","","",""]
[{"$f":"IF('Liste équipes'!E15=\"\",\"\",'Liste équipes'!E15)","v":""},null,null,null,null,null,null,null,null,null,"","",null,"","","","","","","","",null,null,null,null,null,null,null,null,null,"","",null,"","","","","","","",""]
[null,null,null,null,null,null,null,null,null,null,"","",null,"","","","","","","","",null,null,null,null,null,null,null,null,null,"","",null,"","","","","","","",""]
[null,null,null,"  Nombre joueurs sur le terrain",null,null,{"$f":"IF(J25>5,\"\",\"OK\")","v":""},{"$f":"IF(R25>5,\"PAS OK\",\"\")","v":""},null,{"$f":"IF(L27=\"\",\"\",R25)","v":""},"Points en jeu","Avec Bonus maxi 19 pts",null,{"$f":"SUM(N11:N24)","v":0},0,0,0,0,{"$f":"SUM(S11:S24)","v":0},{"$f":"SUM(T11:T24)","v":0},{"$f":"SUM(U11:U24)","v":0},null,null,"  Nombre joueurs sur le terrain",null,null,{"$f":"IF(AD25>5,\"\",\"OK\")","v":""},{"$f":"IF(AL25>5,\"PAS OK\",\"\")","v":""},null,{"$f":"IF(AF27=\"\",\"\",AL25)","v":""},"Points en jeu","Avec Bonus maxi 19 pts",null,{"$f":"SUM(AH11:AH24)","v":0},0,0,0,0,{"$f":"SUM(AM11:AM24)","v":0},{"$f":"SUM(AN11:AN24)","v":0},{"$f":"SUM(AO11:AO24)","v":0}]
[null,null,null,null,null,null,null,null,null,null,null,null,null,{"$f":"IF(N25=0,\"\",IF(N25=1,17,IF(N25=2,18.5,IF(N25=3,19,IF(N25>3,19,IF(N25>4,19,IF(N25>5,19,\"\")))))))","v":""},{"$f":"IF(O25=0,\"\",IF(O25=1,18,IF(O25=2,19,IF(O25=3,19,IF(O25=4,19,IF(O25=4,19,\"\"))))))","v":""},{"$f":"IF(P25=0,\"\",IF(P25=1,17,IF(P25=2,18.5,IF(P25=3,19,IF(P25=4,19,IF(P25=5,17.5,\"\"))))))","v":""},{"$f":"IF(Q25=0,\"\",IF(Q25=1,16,IF(Q25=2,16.5,IF(Q25=3,17,IF(Q25=4,17.5,IF(Q25=5,18,IF(Q25=6,18.5,IF(Q25=7,19,IF(Q25=8,19,IF(Q25=9,19,IF(Q25=10,19,IF(Q25=11,19,IF(Q25=12,19,\"\")))))))))))))","v":""},{"$f":"IF(AND(O26=16.5,P26=16),17.5,IF(AND(N26=15.5,P26=16),17,IF(AND(N26=15.5,O26=16.5),17.5,IF(AND(N26=16.5,P26=16),17.5,IF(AND(N25=2,O26=16.5),17.5,\"\")))))","v":""},null,null,null,null,null,null,null,null,null,null,null,null,null,null,null,{"$f":"IF(AH25=0,\"\",IF(AH25=1,17,IF(AH25=2,18.5,IF(AH25=3,19,IF(AH25>3,19,IF(AH25>4,19,IF(AH25>5,19,\"\")))))))","v":""},{"$f":"IF(AI25=0,\"\",IF(AI25=1,18,IF(AI25=2,19,IF(AI25=3,19,IF(AI25=4,19,IF(AI25=4,19,\"\"))))))","v":""},{"$f":"IF(AJ25=0,\"\",IF(AJ25=1,17,IF(AJ25=2,18.5,IF(AJ25=3,19,IF(AJ25=4,19,IF(AJ25=5,17.5,\"\"))))))","v":""},{"$f":"IF(AK25=0,\"\",IF(AK25=1,16,IF(AK25=2,16.5,IF(AK25=3,17,IF(AK25=4,17.5,IF(AK25=5,18,IF(AK25=6,18.5,IF(AK25=7,19,IF(AK25=8,19,IF(AK25=9,19,IF(AK25=10,19,IF(AK25=11,19,IF(AK25=12,19,\"\")))))))))))))","v":""},{"$f":"IF(AND(AI26=16.5,AJ26=16),17.5,IF(AND(AH26=15.5,AJ26=16),17,IF(AND(AH26=15.5,AI26=16.5),17.5,IF(AND(AH26=16.5,AJ26=16),17.5,IF(AND(AH25=2,AI26=16.5),17.5,\"\")))))","v":""}]
[null,null," ",{"$f":"IF(K27>L27,\"Trop de points en jeu\",\"\")","v":""},null,null,null,null,null,null,{"$f":"IF(O28>0,O28,\"\")","v":""},{"$f":"IF(O28=0,\"\",Q28)","v":""},null,{"$f":"SUM(N26)","v":0},0,0,0,0,null,null,null,null," ",{"$f":"IF(AE27>AF27,\"Trop de points en jeu\",\"\")","v":""},null,null,null,null,null,null,{"$f":"IF(AI28>0,AI28,\"\")","v":""},{"$f":"IF(AI28=0,\"\",AK28)","v":""},null,{"$f":"SUM(AH26)","v":0},0,0,0,0]
[null,null,null,{"$f":"IF(S25>2,\"Trop de joueurs  valides inscrits sur la feuille\",\"\")","v":""},null,null,null,null,null,null,null,null,null,{"$f":"SUM(L11:L24)","v":0},{"$f":"SUM(K11:K24)","v":0},{"$f":"SUM(N28+15.5)","v":15.5},{"$f":"IF(P28>19,19,P28)","v":15.5},null,null,{"$f":"SUM(T30:T31)","v":0},null,null,null,{"$f":"IF(AM25>2,\"Trop de joueurs  valides inscrits sur la feuille\",\"\")","v":""},null,null,null,null,null,null,null,null,null,{"$f":"SUM(AF11:AF24)","v":0},{"$f":"SUM(AE11:AE24)","v":0},{"$f":"SUM(AH28+15.5)","v":15.5},{"$f":"IF(AJ28>19,19,AJ28)","v":15.5},null,null,{"$f":"SUM(AN30:AN31)","v":0}]
[]
[null,null,null,{"$f":"IF(T25>5,\" Pas OK. Trop de joueurs (5 points), vérifier la liste de l'équipe.\",IF(U25>4,\"Pas OK. Trop de joueurs étrangers en jeu (ET), vérifier la liste.\",\"\"))","v":""},null,null,null,null,null,null,null,null,null,{"$f":"IF(D11=\"ET\",1,\"\")","v":""},{"$f":"IF(D12=\"ET\",1,\"\")","v":""},{"$f":"IF(D13=\"ET\",1,\"\")","v":""},{"$f":"IF(D14=\"ET\",1,\"\")","v":""},{"$f":"IF(D15=\"ET\",1,\"\")","v":""},{"$f":"IF(D16=\"ET\",1,\"\")","v":""},{"$f":"SUM(N30:S30)","v":0},null,null,null,{"$f":"IF(AN25>5,\" Pas OK. Trop de joueurs (5 points), vérifier la liste de l'équipe.\",IF(AO25>4,\"Pas OK. Trop de joueurs étrangers en jeu (ET), vérifier la liste.\",\"\"))","v":""},null,null,null,null,null,null,null,null,null,{"$f":"IF(X11=\"ET\",1,\"\")","v":""},{"$f":"IF(X12=\"ET\",1,\"\")","v":""},{"$f":"IF(X13=\"ET\",1,\"\")","v":""},{"$f":"IF(X14=\"ET\",1,\"\")","v":""},{"$f":"IF(X15=\"ET\",1,\"\")","v":""},{"$f":"IF(X16=\"ET\",1,\"\")","v":""},{"$f":"SUM(AH30:AM30)","v":0}]
[null,null,null,null,null,null,null,null,null,null,null,null,null,{"$f":"IF(D17=\"ET\",1,\"\")","v":""},{"$f":"IF(D18=\"ET\",1,\"\")","v":""},{"$f":"IF(D19=\"ET\",1,\"\")","v":""},{"$f":"IF(D20=\"ET\",1,\"\")","v":""},{"$f":"IF(D21=\"ET\",1,\"\")","v":""},{"$f":"IF(D22=\"ET\",1,\"\")","v":""},{"$f":"SUM(N31:S31)","v":0},null,null,null,null,null,null,null,null,null,null,null,null,null,{"$f":"IF(X17=\"ET\",1,\"\")","v":""},{"$f":"IF(X18=\"ET\",1,\"\")","v":""},{"$f":"IF(X19=\"ET\",1,\"\")","v":""},{"$f":"IF(X20=\"ET\",1,\"\")","v":""},{"$f":"IF(X21=\"ET\",1,\"\")","v":""},{"$f":"IF(X22=\"ET\",1,\"\")","v":""},{"$f":"SUM(AH31:AM31)","v":0}]

{"sheet":"Nationale_3_poule_B","index":6,"n_rows":31,"n_cols":41,"rows_kept":31,"cut":false,"hidden":false,"merged":[[5,3,5,11],[5,23,5,31],[6,3,6,11],[6,23,6,31],[25,3,25,8],[25,23,25,28],[8,25,8,26],[24,10,25,10],[24,30,25,30],[24,11,25,11],[24,31,25,31],[24,7,24,8],[24,27,24,28],[34,23,40,23],[26,3,26,8],[26,11,27,11],[26,23,26,28],[26,31,27,31],[26,10,27,10],[26,30,27,30],[29,3,30,11],[29,23,30,31],[27,3,27,8],[27,23,27,28]]}
[]
[]
[]
[]
[]
[null,null,null,"Equipe A",null,null,null,null,null,null,null,null,null,null,null,null,null,null,null,null,null,null,null,"Equipe B"]
[null,null,null,"TROYES",null,null,null,null,null,null,null,null,null,null,null,null,null,null,null,null,null,null,null,"AUXERRE"]
[]
[null,null,null,"Carte","Pts","   Noms         /          Prénoms",null,"N°","Valeur","entrée en jeu","Sans Abattement","Bonus",null,"J","JF","F-FET","S-SF",null,"Valide","ET",null,null,null,"Carte","Pts","   Noms         /          Prénoms",null,"N°","Valeur","entrée en jeu","Sans Abattement","Bonus",null,"J","JF","F-FET","S-SF",null,"Valide","ET"]
[]
[{"$f":"IF('Liste équipes'!F3=\"\",\"\",'Liste équipes'!F3)","v":"AUXERRE"},null,null,null,null,null,null,null,{"$f":"IF(D11=\"SF\",E11,IF(D11=\"n\",E11,IF(D11=\"j\",E11,IF(D11=\"jf\",E11,IF(D11=\"f\",E11,IF(D11=\"fet\",E11,IF(D11=\"et\",E11,IF(D11=\"fid\",E11,IF(D11=\"s\",E11,IF(D11=\"FS\",E11,IF(D11=\"Js\",E11,IF(D11=\"Jfs\",E11,IF(D11=\"\",\"\")))))))))))))","v":""},null,{"$f":"IF(AND(J11=\"X\",E11>0),I11,\"\")","v":""},{"$f":"IF(AND(J11=\"X\",D11=\"J\"),1.5,IF(AND(J11=\"X\",D11=\"JF\"),2.5,IF(AND(J11=\"X\",D11=\"JS\"),2,IF(AND(J11=\"X\",D11=\"JFS\"),3,IF(AND(J11=\"X\",D11=\"F\",E11<5),1.5,IF(AND(J11=\"X\",D11=\"FET\",E11<5),1.5,IF(AND(J11=\"X\",D11=\"FS\",E11<5),2,IF(AND(J11=\"X\",D11=\"S\",E11<5),0.5,IF(AND(J11=\"X\",D11=\"SF\"),0.5,\"\")))))))))","v":""},null,{"$f":"IF(AND(J11=\"X\",D11=\"J\"),1,\"\")","v":""},{"$f":"IF(AND(J11=\"X\",D11=\"JF\"),1,IF(AND(J11=\"X\",D11=\"SF\"),1,\"\"))","v":""},{"$f":"IF(AND(J11=\"X\",D11=\"F\"),1,IF(AND(J11=\"X\",D11=\"FET\"),1,\"\"))","v":""},{"$f":"IF(AND(J11=\"X\",D11=\"S\"),1,\"\")","v":""},{"$f":"IF(AND(J11=\"X\",E11>0),1,\"\")","v":""},{"$f":"IF(E11=5,1,\"\")","v":""},{"$f":"IF(D11=\"ET\",1,\"\")","v":""},{"$f":"IF(AND(J11=\"X\",D11=\"ET\"),1,\"\")","v":""},null,null,null,null,null,null,null,{"$f":"IF(X11=\"SF\",Y11,IF(X11=\"n\",Y11,IF(X11=\"j\",Y11,IF(X11=\"jf\",Y11,IF(X11=\"f\",Y11,IF(X11=\"fet\",Y11,IF(X11=\"et\",Y11,IF(X11=\"fid\",Y11,IF(X11=\"s\",Y11,IF(X11=\"FS\",Y11,IF(X11=\"Js\",Y11,IF(X11=\"Jfs\",Y11,IF(X11=\"\",\"\")))))))))))))","v":""},null,{"$f":"IF(AND(AD11=\"X\",Y11>0),AC11,\"\")","v":""},{"$f":"IF(AND(AD11=\"X\",X11=\"J\"),1.5,IF(AND(AD11=\"X\",X11=\"JF\"),2.5,IF(AND(AD11=\"X\",X11=\"JS\"),2,IF(AND(AD11=\"X\",X11=\"JFS\"),3,IF(AND(AD11=\"X\",X11=\"F\",Y11<5),1.5,IF(AND(AD11=\"X\",X11=\"FET\",Y11<5),1.5,IF(AND(AD11=\"X\",X11=\"FS\",Y11<5),2,IF(AND(AD11=\"X\",X11=\"S\",Y11<5),0.5,IF(AND(AD11=\"x\",X11=\"SF\"),0.5,\"\")))))))))","v":""},null,{"$f":"IF(AND(AD11=\"X\",X11=\"J\"),1,\"\")","v":""},{"$f":"IF(AND(AD11=\"X\",X11=\"JF\"),1,IF(AND(AD11=\"X\",X11=\"SF\"),1,\"\"))","v":""},{"$f":"IF(AND(AD11=\"X\",X11=\"F\"),1,IF(AND(AD11=\"X\",X11=\"FET\"),1,\"\"))","v":""},{"$f":"IF(AND(AD11=\"X\",X11=\"S\"),1,\"\")","v":""},{"$f":"IF(AND(AD11=\"X\",Y11>0),1,\"\")","v":""},{"$f":"IF(Y11=5,1,\"\")","v":""},{"$f":"IF(X11=\"ET\",1,\"\")","v":""},{"$f":"IF(AND(AD11=\"X\",X11=\"ET\"),1,\"\")","v":""}]
[{"$f":"IF('Liste équipes'!F4=\"\",\"\",'Liste équipes'!F4)","v":"ENT BELFORT BESANCON 2"},null,null,null,null,null,null,null,{"$f":"IF(D12=\"SF\",E12,IF(D12=\"n\",E12,IF(D12=\"j\",E12,IF(D12=\"jf\",E12,IF(D12=\"f\",E12,IF(D12=\"fet\",E12,IF(D12=\"et\",E12,IF(D12=\"fid\",E12,IF(D12=\"s\",E12,IF(D12=\"FS\",E12,IF(D12=\"Js\",E12,IF(D12=\"Jfs\",E12,IF(D12=\"\",\"\")))))))))))))","v":""},null,"",{"$f":"IF(AND(J12=\"X\",D12=\"J\"),1.5,IF(AND(J12=\"X\",D12=\"JF\"),2.5,IF(AND(J12=\"X\",D12=\"JS\"),2,IF(AND(J12=\"X\",D12=\"JFS\"),3,IF(AND(J12=\"X\",D12=\"F\",E12<5),1.5,IF(AND(J12=\"X\",D12=\"FET\",E12<5),1.5,IF(AND(J12=\"X\",D12=\"FS\",E12<5),2,IF(AND(J12=\"X\",D12=\"S\",E12<5),0.5,IF(AND(J12=\"X\",D12=\"SF\"),0.5,\"\")))))))))","v":""},null,"",{"$f":"IF(AND(J12=\"X\",D12=\"JF\"),1,\"\")","v":""},"","","","","",{"$f":"IF(AND(J12=\"X\",D12=\"ET\"),1,\"\")","v":""},null,null,null,null,null,null,null,{"$f":"IF(X12=\"SF\",Y12,IF(X12=\"n\",Y12,IF(X12=\"j\",Y12,IF(X12=\"jf\",Y12,IF(X12=\"f\",Y12,IF(X12=\"fet\",Y12,IF(X12=\"et\",Y12,IF(X12=\"fid\",Y12,IF(X12=\"s\",Y12,IF(X12=\"FS\",Y12,IF(X12=\"Js\",Y12,IF(X12=\"Jfs\",Y12,IF(X12=\"\",\"\")))))))))))))","v":""},null,"",{"$f":"IF(AND(AD12=\"X\",X12=\"J\"),1.5,IF(AND(AD12=\"X\",X12=\"JF\"),2.5,IF(AND(AD12=\"X\",X12=\"JS\"),2,IF(AND(AD12=\"X\",X12=\"JFS\"),3,IF(AND(AD12=\"X\",X12=\"F\",Y12<5),1.5,IF(AND(AD12=\"X\",X12=\"FET\",Y12<5),1.5,IF(AND(AD12=\"X\",X12=\"FS\",Y12<5),2,IF(AND(AD12=\"X\",X12=\"S\",Y12<5),0.5,IF(AND(AD12=\"x\",X12=\"SF\"),0.5,\"\")))))))))","v":""},null,"",{"$f":"IF(AND(AD12=\"X\",X12=\"JF\"),1,\"\")","v":""},"","","","","",{"$f":"IF(AND(AD12=\"X\",X12=\"ET\"),1,\"\")","v":""}]
[{"$f":"IF('Liste équipes'!F5=\"\",\"\",'Liste équipes'!F5)","v":"ENT CHALON DIJON 3"},null,null,null,null,null,null,null,"",null,"",{"$f":"IF(AND(J13=\"X\",D13=\"J\"),1.5,IF(AND(J13=\"X\",D13=\"JF\"),2.5,IF(AND(J13=\"X\",D13=\"JS\"),2,IF(AND(J13=\"X\",D13=\"JFS\"),3,IF(AND(J13=\"X\",D13=\"F\",E13<5),1.5,IF(AND(J13=\"X\",D13=\"FET\",E13<5),1.5,IF(AND(J13=\"X\",D13=\"FS\",E13<5),2,IF(AND(J13=\"X\",D13=\"S\",E13<5),0.5,IF(AND(J13=\"X\",D13=\"SF\"),0.5,\"\")))))))))","v":""},null,"","","","","","","","",null,null,null,null,null,null,null,"",null,"","",null,"","","","","","","",""]
[{"$f":"IF('Liste équipes'!F6=\"\",\"\",'Liste équipes'!F6)","v":"JARNY"},null,null,null,null,null,null,null,"",null,"","",null,"","","","","","","","",null,null,null,null,null,null,null,"",null,"","",null,"","","","","","","",""]
[{"$f":"IF('Liste équipes'!F7=\"\",\"\",'Liste équipes'!F7)","v":"MULHOUSE"},null,null,null,null,null,null,null,"",null,"","",null,"","","","","","","","",null,null,null,null,null,null,null,"",null,"","",null,"","","","","","","",""]
[{"$f":"IF('Liste équipes'!F8=\"\",\"\",'Liste équipes'!F8)","v":"STRASBOURG 2"},null,null,null,null,null,null,null,"",null,"","",null,"","","","","","","","",null,null,null,null,null,null,null,"",null,"","",null,"","","","","","","",""]
[{"$f":"IF('Liste équipes'!F9=\"\",\"\",'Liste équipes'!F9)","v":"TROYES"},null,null,null,null,null,null,null,"",null,"","",null,"","","","","","","","",null,null,null,null,null,null,null,"",null,"","",null,"","","","","","","",""]
[{"$f":"IF('Liste équipes'!F10=\"\",\"\",'Liste équipes'!F10)","v":"THIONVILLE"},null,null,null,null,null,null,null,"",null,"","",null,"","","","","","","","",null,null,null,null,null,null,null,"",null,"","",null,"","","","","","","",""]
[{"$f":"IF('Liste équipes'!F11=\"\",\"\",'Liste équipes'!F11)","v":"VANDOEUVRE 2"},null,null,null,null,null,null,null,"",null,"","",null,"","","","","","","","",null,null,null,null,null,null,null,"",null,"","",null,"","","","","","","",""]
[{"$f":"IF('Liste équipes'!F12=\"\",\"\",'Liste équipes'!F12)","v":""},null,null,null,null,null,null,null,"",null,"","",null,"","","","","","","","",null,null,null,null,null,null,null,"",null,"","",null,"","","","","","","",""]
[{"$f":"IF('Liste équipes'!F13=\"\",\"\",'Liste équipes'!F13)","v":""},null,null,null,null,null,null,null,"",null,"","",null,"","","","","","","","",null,null,null,null,null,null,null,"",null,"","",null,"","","","","","","",""]
[{"$f":"IF('Liste équipes'!F14=\"\",\"\",'Liste équipes'!F14)","v":""},null,null,null,null,null,null,null,"",null,"","",null,"","","","","","","","",null,null,null,null,null,null,null,"",null,"","",null,"","","","","","","",""]
[null,null,null,null,null,null,null,null,"",null,"","",null,"","","","","","","","",null,null,null,null,null,null,null,"",null,"",{"$f":"IF(AND(AE23=\"X\",Z23>0),AD23,\"\")","v":""},null,"","","","","","","",""]
[null,null,null,null,null,null,null,null,"",null,"","",null,"","","","","","","","",null,null,null,null,null,null,null,"",null,"","",null,"","","","","","","",""]
[null,null,null,"  Nombre joueurs sur le terrain",null,null,{"$f":"IF(J25>5,\"\",\"OK\")","v":""},{"$f":"IF(R25>5,\"PAS OK\",\"\")","v":""},null,{"$f":"IF(L27=\"\",\"\",R25)","v":""},"Points en jeu","Points autorisés maxi 19",null,{"$f":"SUM(N11:N24)","v":0},0,0,0,0,{"$f":"SUM(S11:S24)","v":0},{"$f":"SUM(T11:T24)","v":0},{"$f":"SUM(U11:U24)","v":0},null,null,"  Nombre joueurs sur le terrain",null,null,{"$f":"IF(AD25>5,\"\",\"OK\")","v":""},{"$f":"IF(AL25>5,\"PAS OK\",\"\")","v":""},null,{"$f":"IF(AF27=\"\",\"\",AL25)","v":""},"Points en jeu","Points autorisés maxi 19",null,{"$f":"SUM(AH11:AH24)","v":0},0,0,0,0,{"$f":"SUM(AM11:AM24)","v":0},{"$f":"SUM(AN11:AN24)","v":0},{"$f":"SUM(AO11:AO24)","v":0}]
[null,null,null,null,null,null,null,null,null,null,null,null,null,{"$f":"IF(N25=0,\"\",IF(N25=1,17,IF(N25=2,18.5,IF(N25=3,19,IF(N25>3,19,IF(N25>4,19,IF(N25>5,19,\"\")))))))","v":""},{"$f":"IF(O25=0,\"\",IF(O25=1,18,IF(O25=2,19,IF(O25=3,19,IF(O25=4,19,IF(O25=4,19,\"\"))))))","v":""},{"$f":"IF(P25=0,\"\",IF(P25=1,17,IF(P25=2,18.5,IF(P25=3,19,IF(P25=4,19,IF(P25=5,17.5,\"\"))))))","v":""},{"$f":"IF(Q25=0,\"\",IF(Q25=1,16,IF(Q25=2,16.5,IF(Q25=3,17,IF(Q25=4,17.5,IF(Q25=5,18,IF(Q25=6,18.5,IF(Q25=7,19,IF(Q25=8,19,IF(Q25=9,19,IF(Q25=10,19,IF(Q25=11,19,IF(Q25=12,19,\"\")))))))))))))","v":""},{"$f":"IF(AND(O26=16.5,P26=16),17.5,IF(AND(N26=15.5,P26=16),17,IF(AND(N26=15.5,O26=16.5),17.5,IF(AND(N26=16.5,P26=16),17.5,IF(AND(N25=2,O26=16.5),17.5,\"\")))))","v":""},null,null,null,null,null,null,null,null,null,null,null,null,null,null,null,{"$f":"IF(AH25=0,\"\",IF(AH25=1,17,IF(AH25=2,18.5,IF(AH25=3,19,IF(AH25>3,19,IF(AH25>4,19,IF(AH25>5,19,\"\")))))))","v":""},{"$f":"IF(AI25=0,\"\",IF(AI25=1,18,IF(AI25=2,19,IF(AI25=3,19,IF(AI25=4,19,IF(AI25=4,19,\"\"))))))","v":""},{"$f":"IF(AJ25=0,\"\",IF(AJ25=1,17,IF(AJ25=2,18.5,IF(AJ25=3,19,IF(AJ25=4,19,IF(AJ25=5,17.5,\"\"))))))","v":""},{"$f":"IF(AK25=0,\"\",IF(AK25=1,16,IF(AK25=2,16.5,IF(AK25=3,17,IF(AK25=4,17.5,IF(AK25=5,18,IF(AK25=6,18.5,IF(AK25=7,19,IF(AK25=8,19,IF(AK25=9,19,IF(AK25=10,19,IF(AK25=11,19,IF(AK25=12,19,\"\")))))))))))))","v":""},{"$f":"IF(AND(AI26=16.5,AJ26=16),17.5,IF(AND(AH26=15.5,AJ26=16),17,IF(AND(AH26=15.5,AI26=16.5),17.5,IF(AND(AH26=16.5,AJ26=16),17.5,IF(AND(AH25=2,AI26=16.5),17.5,\"\")))))","v":""}]
[null,null," ",{"$f":"IF(K27>L27,\"Trop de points en jeu\",\"\")","v":""},null,null,null,null,null,null,{"$f":"IF(O28>0,O28,\"\")","v":""},{"$f":"IF(O28=0,\"\",Q28)","v":""},null,{"$f":"SUM(N26)","v":0},0,0,0,0,null,null,null,null," ",{"$f":"IF(AE27>AF27,\"Trop de points en jeu\",\"\")","v":""},null,null,null,null,null,null,{"$f":"IF(AI28>0,AI28,\"\")","v":""},{"$f":"IF(AI28=0,\"\",AK28)","v":""},null,{"$f":"SUM(AH26)","v":0},0,0,0,0]
[null,null,null,{"$f":"IF(S25>2,\"Trop de joueurs  valides inscrits sur la feuille\",\"\")","v":""},null,null,null,null,null,null,null,null,null,{"$f":"SUM(L11:L24)","v":0},{"$f":"SUM(K11:K24)","v":0},{"$f":"SUM(N28+15.5)","v":15.5},{"$f":"IF(P28>19,19,P28)","v":15.5},null,null,{"$f":"SUM(T30:T31)","v":0},null,null,null,{"$f":"IF(AM25>2,\"Trop de joueurs  valides inscrits sur la feuille\",\"\")","v":""},null,null,null,null,null,null,null,null,null,{"$f":"SUM(AF11:AF24)","v":0},{"$f":"SUM(AE11:AE24)","v":0},{"$f":"SUM(AH28+15.5)","v":15.5},{"$f":"IF(AJ28>19,19,AJ28)","v":15.5},null,null,{"$f":"SUM(AN30:AN31)","v":0}]
[]
[null,null,null,{"$f":"IF(T25>5,\" Pas OK. Trop de joueurs (5 points), vérifier la liste de l'équipe.\",IF(U25>4,\"Pas OK. Trop de joueurs étrangers en jeu (ET), vérifier la liste.\",\"\"))","v":""},null,null,null,null,null,null,null,null,null,{"$f":"IF(D11=\"ET\",1,\"\")","v":""},{"$f":"IF(D12=\"ET\",1,\"\")","v":""},{"$f":"IF(D13=\"ET\",1,\"\")","v":""},{"$f":"IF(D14=\"ET\",1,\"\")","v":""},{"$f":"IF(D15=\"ET\",1,\"\")","v":""},{"$f":"IF(D16=\"ET\",1,\"\")","v":""},{"$f":"SUM(N30:S30)","v":0},null,null,null,{"$f":"IF(AN25>5,\" Pas OK. Trop de joueurs (5 points), vérifier la liste de l'équipe.\",IF(AO25>4,\"Pas OK. Trop de joueurs étrangers en jeu (ET), vérifier la liste.\",\"\"))","v":""},null,null,null,null,null,null,null,null,null,{"$f":"IF(X11=\"ET\",1,\"\")","v":""},{"$f":"IF(X12=\"ET\",1,\"\")","v":""},{"$f":"IF(X13=\"ET\",1,\"\")","v":""},{"$f":"IF(X14=\"ET\",1,\"\")","v":""},{"$f":"IF(X15=\"ET\",1,\"\")","v":""},{"$f":"IF(X16=\"ET\",1,\"\")","v":""},{"$f":"SUM(AH30:AM30)","v":0}]
[null,null,null,null,null,null,null,null,null,null,null,null,null,{"$f":"IF(D17=\"ET\",1,\"\")","v":""},{"$f":"IF(D18=\"ET\",1,\"\")","v":""},{"$f":"IF(D19=\"ET\",1,\"\")","v":""},{"$f":"IF(D20=\"ET\",1,\"\")","v":""},{"$f":"IF(D21=\"ET\",1,\"\")","v":""},{"$f":"IF(D22=\"ET\",1,\"\")","v":""},{"$f":"SUM(N31:S31)","v":0},null,null,null,null,null,null,null,null,null,null,null,null,null,{"$f":"IF(X17=\"ET\",1,\"\")","v":""},{"$f":"IF(X18=\"ET\",1,\"\")","v":""},{"$f":"IF(X19=\"ET\",1,\"\")","v":""},{"$f":"IF(X20=\"ET\",1,\"\")","v":""},{"$f":"IF(X21=\"ET\",1,\"\")","v":""},{"$f":"IF(X22=\"ET\",1,\"\")","v":""},{"$f":"SUM(AH31:AM31)","v":0}]

{"sheet":"Nationale_3_poule_C","index":7,"n_rows":31,"n_cols":41,"rows_kept":31,"cut":false,"hidden":false,"merged":[[5,3,5,11],[5,23,5,31],[6,3,6,11],[6,23,6,31],[25,3,25,8],[25,23,25,28],[8,25,8,26],[24,10,25,10],[24,30,25,30],[24,11,25,11],[24,31,25,31],[24,7,24,8],[24,27,24,28],[34,23,40,23],[26,3,26,8],[26,11,27,11],[26,23,26,28],[26,31,27,31],[26,10,27,10],[26,30,27,30],[29,3,30,11],[29,23,30,31],[27,3,27,8],[27,23,27,28]]}
[]
[]
[]
[]
[]
[null,null,null,"Equipe A",null,null,null,null,null,null,null,null,null,null,null,null,null,null,null,null,null,null,null,"Equipe B"]
[null,null,null,"CHAMBRAY",null,null,null,null,null,null,null,null,null,null,null,null,null,null,null,null,null,null,null,"QUIMPER"]
[]
[null,null,null,"Carte","Pts","   Noms         /          Prénoms",null,"N°","Valeur","entrée en jeu","Sans Abattement","Bonus",null,"J","JF","F-FET","S-SF",null,"Valide","ET",null,null,null,"Carte","Pts","   Noms         /          Prénoms",null,"N°","Valeur","entrée en jeu","Sans Abattement","Bonus",null,"J","JF","F-FET","S-SF",null,"Valide","ET"]
[null,null,null,null,null,null,null,null,null,null,null,null,null,null,null,null,null,null,null,null,null,null,null,null,2]
[{"$f":"IF('Liste équipes'!G3=\"\",\"\",'Liste équipes'!G3)","v":"CHAMBRAY"},null,null,null,null,null,null,null,{"$f":"IF(D11=\"SF\",E11,IF(D11=\"n\",E11,IF(D11=\"j\",E11,IF(D11=\"jf\",E11,IF(D11=\"f\",E11,IF(D11=\"fet\",E11,IF(D11=\"et\",E11,IF(D11=\"fid\",E11,IF(D11=\"s\",E11,IF(D11=\"FS\",E11,IF(D11=\"Js\",E11,IF(D11=\"Jfs\",E11,IF(D11=\"\",\"\")))))))))))))","v":""},null,{"$f":"IF(AND(J11=\"X\",E11>0),I11,\"\")","v":""},{"$f":"IF(AND(J11=\"X\",D11=\"J\"),1.5,IF(AND(J11=\"X\",D11=\"JF\"),2.5,IF(AND(J11=\"X\",D11=\"JS\"),2,IF(AND(J11=\"X\",D11=\"JFS\"),3,IF(AND(J11=\"X\",D11=\"F\",E11<5),1.5,IF(AND(J11=\"X\",D11=\"FET\",E11<5),1.5,IF(AND(J11=\"X\",D11=\"FS\",E11<5),2,IF(AND(J11=\"X\",D11=\"S\",E11<5),0.5,IF(AND(J11=\"X\",D11=\"SF\"),0.5,\"\")))))))))","v":""},null,{"$f":"IF(AND(J11=\"X\",D11=\"J\"),1,\"\")","v":""},{"$f":"IF(AND(J11=\"X\",D11=\"JF\"),1,IF(AND(J11=\"X\",D11=\"SF\"),1,\"\"))","v":""},{"$f":"IF(AND(J11=\"X\",D11=\"F\"),1,IF(AND(J11=\"X\",D11=\"FET\"),1,\"\"))","v":""},{"$f":"IF(AND(J11=\"X\",D11=\"S\"),1,\"\")","v":""},{"$f":"IF(AND(J11=\"X\",E11>0),1,\"\")","v":""},{"$f":"IF(E11=5,1,\"\")","v":""},{"$f":"IF(D11=\"ET\",1,\"\")","v":""},{"$f":"IF(AND(J11=\"X\",D11=\"ET\"),1,\"\")","v":""},null,null,null,null,null,null,null,{"$f":"IF(X11=\"SF\",Y11,IF(X11=\"n\",Y11,IF(X11=\"j\",Y11,IF(X11=\"jf\",Y11,IF(X11=\"f\",Y11,IF(X11=\"fet\",Y11,IF(X11=\"et\",Y11,IF(X11=\"fid\",Y11,IF(X11=\"s\",Y11,IF(X11=\"FS\",Y11,IF(X11=\"Js\",Y11,IF(X11=\"Jfs\",Y11,IF(X11=\"\",\"\")))))))))))))","v":""},null,{"$f":"IF(AND(AD11=\"X\",Y11>0),AC11,\"\")","v":""},{"$f":"IF(AND(AD11=\"X\",X11=\"J\"),1.5,IF(AND(AD11=\"X\",X11=\"JF\"),2.5,IF(AND(AD11=\"X\",X11=\"JS\"),2,IF(AND(AD11=\"X\",X11=\"JFS\"),3,IF(AND(AD11=\"X\",X11=\"F\",Y11<5),1.5,IF(AND(AD11=\"X\",X11=\"FET\",Y11<5),1.5,IF(AND(AD11=\"X\",X11=\"FS\",Y11<5),2,IF(AND(AD11=\"X\",X11=\"S\",Y11<5),0.5,IF(AND(AD11=\"x\",X11=\"SF\"),0.5,\"\")))))))))","v":""},null,{"$f":"IF(AND(AD11=\"X\",X11=\"J\"),1,\"\")","v":""},{"$f":"IF(AND(AD11=\"X\",X11=\"JF\"),1,IF(AND(AD11=\"X\",X11=\"SF\"),1,\"\"))","v":""},{"$f":"IF(AND(AD11=\"X\",X11=\"F\"),1,IF(AND(AD11=\"X\",X11=\"FET\"),1,\"\"))","v":""},{"$f":"IF(AND(AD11=\"X\",X11=\"S\"),1,\"\")","v":""},{"$f":"IF(AND(AD11=\"X\",Y11>0),1,\"\")","v":""},{"$f":"IF(Y11=5,1,\"\")","v":""},{"$f":"IF(X11=\"ET\",1,\"\")","v":""},{"$f":"IF(AND(AD11=\"X\",X11=\"ET\"),1,\"\")","v":""}]
[{"$f":"IF('Liste équipes'!G4=\"\",\"\",'Liste équipes'!G4)","v":"EQUEURDREVILLE"},null,null,null,null,null,null,null,{"$f":"IF(D12=\"SF\",E12,IF(D12=\"n\",E12,IF(D12=\"j\",E12,IF(D12=\"jf\",E12,IF(D12=\"f\",E12,IF(D12=\"fet\",E12,IF(D12=\"et\",E12,IF(D12=\"fid\",E12,IF(D12=\"s\",E12,IF(D12=\"FS\",E12,IF(D12=\"Js\",E12,IF(D12=\"Jfs\",E12,IF(D12=\"\",\"\")))))))))))))","v":""},null,"",{"$f":"IF(AND(J12=\"X\",D12=\"J\"),1.5,IF(AND(J12=\"X\",D12=\"JF\"),2.5,IF(AND(J12=\"X\",D12=\"JS\"),2,IF(AND(J12=\"X\",D12=\"JFS\"),3,IF(AND(J12=\"X\",D12=\"F\",E12<5),1.5,IF(AND(J12=\"X\",D12=\"FET\",E12<5),1.5,IF(AND(J12=\"X\",D12=\"FS\",E12<5),2,IF(AND(J12=\"X\",D12=\"S\",E12<5),0.5,IF(AND(J12=\"X\",D12=\"SF\"),0.5,\"\")))))))))","v":""},null,"",{"$f":"IF(AND(J12=\"X\",D12=\"JF\"),1,\"\")","v":""},"","","","","",{"$f":"IF(AND(J12=\"X\",D12=\"ET\"),1,\"\")","v":""},null,null,null,null,null,null,null,{"$f":"IF(X12=\"SF\",Y12,IF(X12=\"n\",Y12,IF(X12=\"j\",Y12,IF(X12=\"jf\",Y12,IF(X12=\"f\",Y12,IF(X12=\"fet\",Y12,IF(X12=\"et\",Y12,IF(X12=\"fid\",Y12,IF(X12=\"s\",Y12,IF(X12=\"FS\",Y12,IF(X12=\"Js\",Y12,IF(X12=\"Jfs\",Y12,IF(X12=\"\",\"\")))))))))))))","v":""},null,"",{"$f":"IF(AND(AD12=\"X\",X12=\"J\"),1.5,IF(AND(AD12=\"X\",X12=\"JF\"),2.5,IF(AND(AD12=\"X\",X12=\"JS\"),2,IF(AND(AD12=\"X\",X12=\"JFS\"),3,IF(AND(AD12=\"X\",X12=\"F\",Y12<5),1.5,IF(AND(AD12=\"X\",X12=\"FET\",Y12<5),1.5,IF(AND(AD12=\"X\",X12=\"FS\",Y12<5),2,IF(AND(AD12=\"X\",X12=\"S\",Y12<5),0.5,IF(AND(AD12=\"x\",X12=\"SF\"),0.5,\"\")))))))))","v":""},null,"",{"$f":"IF(AND(AD12=\"X\",X12=\"JF\"),1,\"\")","v":""},"","","","","",{"$f":"IF(AND(AD12=\"X\",X12=\"ET\"),1,\"\")","v":""}]
[{"$f":"IF('Liste équipes'!G5=\"\",\"\",'Liste équipes'!G5)","v":"Ent LAVAL-RENNES"},null,null,null,null,null,null,null,"",null,"",{"$f":"IF(AND(J13=\"X\",D13=\"J\"),1.5,IF(AND(J13=\"X\",D13=\"JF\"),2.5,IF(AND(J13=\"X\",D13=\"JS\"),2,IF(AND(J13=\"X\",D13=\"JFS\"),3,IF(AND(J13=\"X\",D13=\"F\",E13<5),1.5,IF(AND(J13=\"X\",D13=\"FET\",E13<5),1.5,IF(AND(J13=\"X\",D13=\"FS\",E13<5),2,IF(AND(J13=\"X\",D13=\"S\",E13<5),0.5,IF(AND(J13=\"X\",D13=\"SF\"),0.5,\"\")))))))))","v":""},null,"","","","","","","","",null,null,null,null,null,null,null,"",null,"","",null,"","","","","","","",""]
[{"$f":"IF('Liste équipes'!G6=\"\",\"\",'Liste équipes'!G6)","v":"QUIMPER"},null,null,null,null,null,null,null,"",null,"","",null,"","","","","","","","",null,null,null,null,null,null,null,"",null,"","",null,"","","","","","","",""]
[{"$f":"IF('Liste équipes'!G7=\"\",\"\",'Liste équipes'!G7)","v":"SAINT HERBLAIN 2"},null,null,null,null,null,null,null,"",null,"","",null,"","","","","","","","",null,null,null,null,null,null,null,"",null,"","",null,"","","","","","","",""]
[{"$f":"IF('Liste équipes'!G8=\"\",\"\",'Liste équipes'!G8)","v":"SAINT POL DE LEON"},null,null,null,null,null,null,null,"",null,"","",null,"","","","","","","","",null,null,null,null,null,null,null,"",null,"","",null,"","","","","","","",""]
[{"$f":"IF('Liste équipes'!G9=\"\",\"\",'Liste équipes'!G9)","v":"YFFINIAC"},null,null,null,null,null,null,null,"",null,"","",null,"","","","","","","","",null,null,null,null,null,null,null,"",null,"","",null,"","","","","","","",""]
[{"$f":"IF('Liste équipes'!G10=\"\",\"\",'Liste équipes'!G10)","v":""},null,null,null,null,null,null,null,"",null,"","",null,"","","","","","","","",null,null,null,null,null,null,null,"",null,"","",null,"","","","","","","",""]
[{"$f":"IF('Liste équipes'!G11=\"\",\"\",'Liste équipes'!G11)","v":""},null,null,null,null,null,null,null,"",null,"","",null,"","","","","","","","",null,null,null,null,null,null,null,"",null,"","",null,"","","","","","","",""]
[{"$f":"IF('Liste équipes'!G12=\"\",\"\",'Liste équipes'!G12)","v":""},null,null,null,null,null,null,null,"",null,"","",null,"","","","","","","","",null,null,null,null,null,null,null,"",null,"","",null,"","","","","","","",""]
[{"$f":"IF('Liste équipes'!G13=\"\",\"\",'Liste équipes'!G13)","v":""},null,null,null,null,null,null,null,"",null,"","",null,"","","","","","","","",null,null,null,null,null,null,null,"",null,"","",null,"","","","","","","",""]
[{"$f":"IF('Liste équipes'!G14=\"\",\"\",'Liste équipes'!G14)","v":""},null,null,null,null,null,null,null,"",null,"","",null,"","","","","","","","",null,null,null,null,null,null,null,"",null,"","",null,"","","","","","","",""]
[{"$f":"IF('Liste équipes'!G15=\"\",\"\",'Liste équipes'!G15)","v":""},null,null,null,null,null,null,null,"",null,"","",null,{"$f":"IF(AND(J23=\"X\",D23=\"J\"),1,\"\")","v":""},{"$f":"IF(AND(J23=\"X\",D23=\"JF\"),1,\"\")","v":""},{"$f":"IF(AND(J23=\"X\",D23=\"F\"),1,IF(AND(J23=\"X\",D23=\"FET\"),1,\"\"))","v":""},{"$f":"IF(AND(J23=\"X\",D23=\"S\"),1,\"\")","v":""},{"$f":"IF(AND(J23=\"X\",E23>0),1,\"\")","v":""},{"$f":"IF(E23=5,1,\"\")","v":""},{"$f":"IF(D23=\"ET\",1,\"\")","v":""},"",null,null,null,null,null,null,null,"",null,"","",null,"","","","","","","",""]
[null,null,null,null,null,null,null,null,"",null,"","",null,"","","","","","","","",null,null,null,null,null,null,null,"",null,"","",null,"","","","","","","",""]
[null,null,null,"  Nombre joueurs sur le terrain",null,null,{"$f":"IF(J25>5,\"\",\"OK\")","v":""},{"$f":"IF(R25>5,\"PAS OK\",\"\")","v":""},null,{"$f":"IF(L27=\"\",\"\",R25)","v":""},"Points en jeu","Points autorisés maxi 19",null,{"$f":"SUM(N11:N24)","v":0},0,0,0,0,{"$f":"SUM(S11:S24)","v":0},{"$f":"SUM(T11:T24)","v":0},{"$f":"SUM(U11:U24)","v":0},null,null,"  Nombre joueurs sur le terrain",null,null,{"$f":"IF(AD25>5,\"\",\"OK\")","v":""},{"$f":"IF(AL25>5,\"PAS OK\",\"\")","v":""},null,{"$f":"IF(AF27=\"\",\"\",AL25)","v":""},"Points en jeu","Points autorisés maxi 19",null,{"$f":"SUM(AH11:AH24)","v":0},0,0,0,0,{"$f":"SUM(AM11:AM24)","v":0},{"$f":"SUM(AN11:AN24)","v":0},{"$f":"SUM(AO11:AO24)","v":0}]
[null,null,null,null,null,null,null,null,null,null,null,null,null,{"$f":"IF(N25=0,\"\",IF(N25=1,17,IF(N25=2,18.5,IF(N25=3,19,IF(N25>3,19,IF(N25>4,19,IF(N25>5,19,\"\")))))))","v":""},{"$f":"IF(O25=0,\"\",IF(O25=1,18,IF(O25=2,19,IF(O25=3,19,IF(O25=4,19,IF(O25=4,19,\"\"))))))","v":""},{"$f":"IF(P25=0,\"\",IF(P25=1,17,IF(P25=2,18.5,IF(P25=3,19,IF(P25=4,19,IF(P25=5,17.5,\"\"))))))","v":""},{"$f":"IF(Q25=0,\"\",IF(Q25=1,16,IF(Q25=2,16.5,IF(Q25=3,17,IF(Q25=4,17.5,IF(Q25=5,18,IF(Q25=6,18.5,IF(Q25=7,19,IF(Q25=8,19,IF(Q25=9,19,IF(Q25=10,19,IF(Q25=11,19,IF(Q25=12,19,\"\")))))))))))))","v":""},{"$f":"IF(AND(O26=16.5,P26=16),17.5,IF(AND(N26=15.5,P26=16),17,IF(AND(N26=15.5,O26=16.5),17.5,IF(AND(N26=16.5,P26=16),17.5,IF(AND(N25=2,O26=16.5),17.5,\"\")))))","v":""},null,null,null,null,null,null,null,null,null,null,null,null,null,null,null,{"$f":"IF(AH25=0,\"\",IF(AH25=1,17,IF(AH25=2,18.5,IF(AH25=3,19,IF(AH25>3,19,IF(AH25>4,19,IF(AH25>5,19,\"\")))))))","v":""},{"$f":"IF(AI25=0,\"\",IF(AI25=1,18,IF(AI25=2,19,IF(AI25=3,19,IF(AI25=4,19,IF(AI25=4,19,\"\"))))))","v":""},{"$f":"IF(AJ25=0,\"\",IF(AJ25=1,17,IF(AJ25=2,18.5,IF(AJ25=3,19,IF(AJ25=4,19,IF(AJ25=5,17.5,\"\"))))))","v":""},{"$f":"IF(AK25=0,\"\",IF(AK25=1,16,IF(AK25=2,16.5,IF(AK25=3,17,IF(AK25=4,17.5,IF(AK25=5,18,IF(AK25=6,18.5,IF(AK25=7,19,IF(AK25=8,19,IF(AK25=9,19,IF(AK25=10,19,IF(AK25=11,19,IF(AK25=12,19,\"\")))))))))))))","v":""},{"$f":"IF(AND(AI26=16.5,AJ26=16),17.5,IF(AND(AH26=15.5,AJ26=16),17,IF(AND(AH26=15.5,AI26=16.5),17.5,IF(AND(AH26=16.5,AJ26=16),17.5,IF(AND(AH25=2,AI26=16.5),17.5,\"\")))))","v":""}]
[null,null," ",{"$f":"IF(K27>L27,\"Trop de points en jeu\",\"\")","v":""},null,null,null,null,null,null,{"$f":"IF(O28>0,O28,\"\")","v":""},{"$f":"IF(O28=0,\"\",Q28)","v":""},null,{"$f":"SUM(N26)","v":0},0,0,0,0,null,null,null,null," ",{"$f":"IF(AE27>AF27,\"Trop de points en jeu\",\"\")","v":""},null,null,null,null,null,null,{"$f":"IF(AI28>0,AI28,\"\")","v":""},{"$f":"IF(AI28=0,\"\",AK28)","v":""},null,{"$f":"SUM(AH26)","v":0},0,0,0,0]
[null,null,null,{"$f":"IF(S25>2,\"Trop de joueurs  valides inscrits sur la feuille\",\"\")","v":""},null,null,null,null,null,null,null,null,null,{"$f":"SUM(L11:L24)","v":0},{"$f":"SUM(K11:K24)","v":0},{"$f":"SUM(N28+15.5)","v":15.5},{"$f":"IF(P28>19,19,P28)","v":15.5},null,null,{"$f":"SUM(T30:T31)","v":0},null,null,null,{"$f":"IF(AM25>2,\"Trop de joueurs  valides inscrits sur la feuille\",\"\")","v":""},null,null,null,null,null,null,null,null,null,{"$f":"SUM(AF11:AF24)","v":0},{"$f":"SUM(AE11:AE24)","v":0},{"$f":"SUM(AH28+15.5)","v":15.5},{"$f":"IF(AJ28>19,19,AJ28)","v":15.5},null,null,{"$f":"SUM(AN30:AN31)","v":0}]
[]
[null,null,null,{"$f":"IF(T25>5,\" Pas OK. Trop de joueurs (5 points), vérifier la liste de l'équipe.\",IF(U25>4,\"Pas OK. Trop de joueurs étrangers en jeu (ET), vérifier la liste.\",\"\"))","v":""},null,null,null,null,null,null,null,null,null,{"$f":"IF(D11=\"ET\",1,\"\")","v":""},{"$f":"IF(D12=\"ET\",1,\"\")","v":""},{"$f":"IF(D13=\"ET\",1,\"\")","v":""},{"$f":"IF(D14=\"ET\",1,\"\")","v":""},{"$f":"IF(D15=\"ET\",1,\"\")","v":""},{"$f":"IF(D16=\"ET\",1,\"\")","v":""},{"$f":"SUM(N30:S30)","v":0},null,null,null,{"$f":"IF(AN25>5,\" Pas OK. Trop de joueurs (5 points), vérifier la liste de l'équipe.\",IF(AO25>4,\"Pas OK. Trop de joueurs étrangers en jeu (ET), vérifier la liste.\",\"\"))","v":""},null,null,null,null,null,null,null,null,null,{"$f":"IF(X11=\"ET\",1,\"\")","v":""},{"$f":"IF(X12=\"ET\",1,\"\")","v":""},{"$f":"IF(X13=\"ET\",1,\"\")","v":""},{"$f":"IF(X14=\"ET\",1,\"\")","v":""},{"$f":"IF(X15=\"ET\",1,\"\")","v":""},{"$f":"IF(X16=\"ET\",1,\"\")","v":""},{"$f":"SUM(AH30:AM30)","v":0}]
[null,null,null,null,null,null,null,null,null,null,null,null,null,{"$f":"IF(D17=\"ET\",1,\"\")","v":""},{"$f":"IF(D18=\"ET\",1,\"\")","v":""},{"$f":"IF(D19=\"ET\",1,\"\")","v":""},{"$f":"IF(D20=\"ET\",1,\"\")","v":""},{"$f":"IF(D21=\"ET\",1,\"\")","v":""},{"$f":"IF(D22=\"ET\",1,\"\")","v":""},{"$f":"SUM(N31:S31)","v":0},null,null,null,null,null,null,null,null,null,null,null,null,null,{"$f":"IF(X17=\"ET\",1,\"\")","v":""},{"$f":"IF(X18=\"ET\",1,\"\")","v":""},{"$f":"IF(X19=\"ET\",1,\"\")","v":""},{"$f":"IF(X20=\"ET\",1,\"\")","v":""},{"$f":"IF(X21=\"ET\",1,\"\")","v":""},{"$f":"IF(X22=\"ET\",1,\"\")","v":""},{"$f":"SUM(AH31:AM31)","v":0}]

{"sheet":"Nationale_3_poule_D","index":8,"n_rows":31,"n_cols":41,"rows_kept":31,"cut":false,"hidden":false,"merged":[[5,3,5,11],[5,23,5,31],[6,3,6,11],[6,23,6,31],[25,3,25,8],[25,23,25,28],[8,25,8,26],[24,10,25,10],[24,30,25,30],[24,7,24,8],[24,11,25,11],[24,27,24,28],[24,31,25,31],[34,23,40,23],[26,3,26,8],[26,11,27,11],[26,23,26,28],[26,31,27,31],[26,10,27,10],[26,30,27,30],[29,3,30,11],[29,23,30,31],[27,3,27,8],[27,23,27,28]]}
[]
[]
[]
[]
[]
[null,null,null,"Equipe A",null,null,null,null,null,null,null,null,null,null,null,null,null,null,null,null,null,null,null,"Equipe B"]
[null,null,null,"ANGLET",null,null,null,null,null,null,null,null,null,null,null,null,null,null,null,null,null,null,null,"ASMTH"]
[]
[null,null,null,"Carte","Pts","   Noms         /          Prénoms",null,"N°","Valeur","entrée en jeu","Sans Abattement","Bonus",null,"J","JF","F-FET","S-SF",null,"Valide","ET",null,null,null,"Carte","Pts","   Noms         /          Prénoms",null,"N°","Valeur","entrée en jeu","Sans Abattement","Bonus",null,"J","JF","F-FET","S-SF",null,"Valide","ET"]
[]
[{"$f":"IF('Liste équipes'!H3=\"\",\"\",'Liste équipes'!H3)","v":"ANGLET"},null,null,null,null,null,null,null,{"$f":"IF(D11=\"SF\",E11,IF(D11=\"n\",E11,IF(D11=\"j\",E11,IF(D11=\"jf\",E11,IF(D11=\"f\",E11,IF(D11=\"fet\",E11,IF(D11=\"et\",E11,IF(D11=\"fid\",E11,IF(D11=\"s\",E11,IF(D11=\"FS\",E11,IF(D11=\"Js\",E11,IF(D11=\"Jfs\",E11,IF(D11=\"\",\"\")))))))))))))","v":""},null,{"$f":"IF(AND(J11=\"X\",E11>0),I11,\"\")","v":""},{"$f":"IF(AND(J11=\"X\",D11=\"J\"),1.5,IF(AND(J11=\"X\",D11=\"JF\"),2.5,IF(AND(J11=\"X\",D11=\"JS\"),2,IF(AND(J11=\"X\",D11=\"JFS\"),3,IF(AND(J11=\"X\",D11=\"F\",E11<5),1.5,IF(AND(J11=\"X\",D11=\"FET\",E11<5),1.5,IF(AND(J11=\"X\",D11=\"FS\",E11<5),2,IF(AND(J11=\"X\",D11=\"S\",E11<5),0.5,IF(AND(J11=\"X\",D11=\"SF\"),0.5,\"\")))))))))","v":""},null,{"$f":"IF(AND(J11=\"X\",D11=\"J\"),1,\"\")","v":""},{"$f":"IF(AND(J11=\"X\",D11=\"JF\"),1,IF(AND(J11=\"X\",D11=\"SF\"),1,\"\"))","v":""},{"$f":"IF(AND(J11=\"X\",D11=\"F\"),1,IF(AND(J11=\"X\",D11=\"FET\"),1,\"\"))","v":""},{"$f":"IF(AND(J11=\"X\",D11=\"S\"),1,\"\")","v":""},{"$f":"IF(AND(J11=\"X\",E11>0),1,\"\")","v":""},{"$f":"IF(E11=5,1,\"\")","v":""},{"$f":"IF(D11=\"ET\",1,\"\")","v":""},{"$f":"IF(AND(J11=\"X\",D11=\"ET\"),1,\"\")","v":""},null,null,null,null,null,null,null,{"$f":"IF(X11=\"SF\",Y11,IF(X11=\"n\",Y11,IF(X11=\"j\",Y11,IF(X11=\"jf\",Y11,IF(X11=\"f\",Y11,IF(X11=\"fet\",Y11,IF(X11=\"et\",Y11,IF(X11=\"fid\",Y11,IF(X11=\"s\",Y11,IF(X11=\"FS\",Y11,IF(X11=\"Js\",Y11,IF(X11=\"Jfs\",Y11,IF(X11=\"\",\"\")))))))))))))","v":""},null,{"$f":"IF(AND(AD11=\"X\",Y11>0),AC11,\"\")","v":""},{"$f":"IF(AND(AD11=\"X\",X11=\"J\"),1.5,IF(AND(AD11=\"X\",X11=\"JF\"),2.5,IF(AND(AD11=\"X\",X11=\"JS\"),2,IF(AND(AD11=\"X\",X11=\"JFS\"),3,IF(AND(AD11=\"X\",X11=\"F\",Y11<5),1.5,IF(AND(AD11=\"X\",X11=\"FET\",Y11<5),1.5,IF(AND(AD11=\"X\",X11=\"FS\",Y11<5),2,IF(AND(AD11=\"X\",X11=\"S\",Y11<5),0.5,IF(AND(AD11=\"X\",X11=\"SF\"),0.5,\"\")))))))))","v":""},null,{"$f":"IF(AND(AD11=\"X\",X11=\"J\"),1,\"\")","v":""},{"$f":"IF(AND(AD11=\"X\",X11=\"JF\"),1,IF(AND(AD11=\"X\",X11=\"SF\"),1,\"\"))","v":""},{"$f":"IF(AND(AD11=\"X\",X11=\"F\"),1,IF(AND(AD11=\"X\",X11=\"FET\"),1,\"\"))","v":""},{"$f":"IF(AND(AD11=\"X\",X11=\"S\"),1,\"\")","v":""},{"$f":"IF(AND(AD11=\"X\",Y11>0),1,\"\")","v":""},{"$f":"IF(Y11=5,1,\"\")","v":""},{"$f":"IF(X11=\"ET\",1,\"\")","v":""},{"$f":"IF(AND(AD11=\"X\",X11=\"ET\"),1,\"\")","v":""}]
[{"$f":"IF('Liste équipes'!H4=\"\",\"\",'Liste équipes'!H4)","v":"ASMTH"},null,null,null,null,null,null,null,{"$f":"IF(D12=\"SF\",E12,IF(D12=\"n\",E12,IF(D12=\"j\",E12,IF(D12=\"jf\",E12,IF(D12=\"f\",E12,IF(D12=\"fet\",E12,IF(D12=\"et\",E12,IF(D12=\"fid\",E12,IF(D12=\"s\",E12,IF(D12=\"FS\",E12,IF(D12=\"Js\",E12,IF(D12=\"Jfs\",E12,IF(D12=\"\",\"\")))))))))))))","v":""},null,"",{"$f":"IF(AND(J12=\"X\",D12=\"J\"),1.5,IF(AND(J12=\"X\",D12=\"JF\"),2.5,IF(AND(J12=\"X\",D12=\"JS\"),2,IF(AND(J12=\"X\",D12=\"JFS\"),3,IF(AND(J12=\"X\",D12=\"F\",E12<5),1.5,IF(AND(J12=\"X\",D12=\"FET\",E12<5),1.5,IF(AND(J12=\"X\",D12=\"FS\",E12<5),2,IF(AND(J12=\"X\",D12=\"S\",E12<5),0.5,IF(AND(J12=\"X\",D12=\"SF\"),0.5,\"\")))))))))","v":""},null,"",{"$f":"IF(AND(J12=\"X\",D12=\"JF\"),1,\"\")","v":""},"","","","","",{"$f":"IF(AND(J12=\"X\",D12=\"ET\"),1,\"\")","v":""},null,null,null,null,null,null,null,{"$f":"IF(X12=\"SF\",Y12,IF(X12=\"n\",Y12,IF(X12=\"j\",Y12,IF(X12=\"jf\",Y12,IF(X12=\"f\",Y12,IF(X12=\"fet\",Y12,IF(X12=\"et\",Y12,IF(X12=\"fid\",Y12,IF(X12=\"s\",Y12,IF(X12=\"FS\",Y12,IF(X12=\"Js\",Y12,IF(X12=\"Jfs\",Y12,IF(X12=\"\",\"\")))))))))))))","v":""},null,"",{"$f":"IF(AND(AD12=\"X\",X12=\"J\"),1.5,IF(AND(AD12=\"X\",X12=\"JF\"),2.5,IF(AND(AD12=\"X\",X12=\"JS\"),2,IF(AND(AD12=\"X\",X12=\"JFS\"),3,IF(AND(AD12=\"X\",X12=\"F\",Y12<5),1.5,IF(AND(AD12=\"X\",X12=\"FET\",Y12<5),1.5,IF(AND(AD12=\"X\",X12=\"FS\",Y12<5),2,IF(AND(AD12=\"X\",X12=\"S\",Y12<5),0.5,IF(AND(AD12=\"X\",X12=\"SF\"),0.5,\"\")))))))))","v":""},null,"",{"$f":"IF(AND(AD12=\"X\",X12=\"JF\"),1,\"\")","v":""},"","","","","",{"$f":"IF(AND(AD12=\"X\",X12=\"ET\"),1,\"\")","v":""}]
[{"$f":"IF('Liste équipes'!H5=\"\",\"\",'Liste équipes'!H5)","v":"PAVIE"},null,null,null,null,null,null,null,"",null,"",{"$f":"IF(AND(J13=\"X\",D13=\"J\"),1.5,IF(AND(J13=\"X\",D13=\"JF\"),2.5,IF(AND(J13=\"X\",D13=\"JS\"),2,IF(AND(J13=\"X\",D13=\"JFS\"),3,IF(AND(J13=\"X\",D13=\"F\",E13<5),1.5,IF(AND(J13=\"X\",D13=\"FET\",E13<5),1.5,IF(AND(J13=\"X\",D13=\"FS\",E13<5),2,IF(AND(J13=\"X\",D13=\"S\",E13<5),0.5,IF(AND(J13=\"X\",D13=\"SF\"),0.5,\"\")))))))))","v":""},null,"","","","","","","","",null,null,null,null,null,null,null,"",null,"",{"$f":"IF(AND(AD13=\"X\",X13=\"J\"),1.5,IF(AND(AD13=\"X\",X13=\"JF\"),2.5,IF(AND(AD13=\"X\",X13=\"JS\"),2,IF(AND(AD13=\"X\",X13=\"JFS\"),3,IF(AND(AD13=\"X\",X13=\"F\",Y13<5),1.5,IF(AND(AD13=\"X\",X13=\"FET\",Y13<5),1.5,IF(AND(AD13=\"X\",X13=\"FS\",Y13<5),2,IF(AND(AD13=\"X\",X13=\"S\",Y13<5),0.5,IF(AND(AD13=\"X\",X13=\"SF\"),0.5,\"\")))))))))","v":""},null,"","","","","","","",""]
[{"$f":"IF('Liste équipes'!H6=\"\",\"\",'Liste équipes'!H6)","v":"LA ROCHELLE"},null,null,null,null,null,null,null,"",null,"","",null,"","","","","","","","",null,null,null,null,null,null,null,"",null,"","",null,"","","","","","","",""]
[{"$f":"IF('Liste équipes'!H7=\"\",\"\",'Liste équipes'!H7)","v":"POLE NATIONAL"},null,null,null,null,null,null,null,"",null,"","",null,"","","","","","","","",null,null,null,null,null,null,null,"",null,"","",null,"","","","","","","",""]
[{"$f":"IF('Liste équipes'!H8=\"\",\"\",'Liste équipes'!H8)","v":"TOULOUSE 2"},null,null,null,null,null,null,null,"",null,"","",null,"","","","","","","","",null,null,null,null,null,null,null,"",null,"","",null,"","","","","","","",""]
[{"$f":"IF('Liste équipes'!H9=\"\",\"\",'Liste équipes'!H9)","v":""},null,null,null,null,null,null,null,"",null,"","",null,"","","","","","","","",null,null,null,null,null,null,null,"",null,"","",null,"","","","","","","",""]
[{"$f":"IF('Liste équipes'!H10=\"\",\"\",'Liste équipes'!H10)","v":""},null,null,null,null,null,null,null,"",null,"","",null,"","","","","","","","",null,null,null,null,null,null,null,"",null,"","",null,"","","","","","","",""]
[{"$f":"IF('Liste équipes'!H11=\"\",\"\",'Liste équipes'!H11)","v":""},null,null,null,null,null,null,null,"",null,"","",null,"","","","","","","","",null,null,null,null,null,null,null,"",null,"","",null,"","","","","","","",""]
[{"$f":"IF('Liste équipes'!H12=\"\",\"\",'Liste équipes'!H12)","v":""},null,null,null,null,null,null,null,"",null,"","",null,"","","","","","","","",null,null,null,null,null,null,null,"",null,"","",null,"","","","","","","",""]
[{"$f":"IF('Liste équipes'!H13=\"\",\"\",'Liste équipes'!H13)","v":""},null,null,null,null,null,null,null,"",null,"","",null,"","","","","","","","",null,null,null,null,null,null,null,"",null,"","",null,"","","","","","","",""]
[{"$f":"IF('Liste équipes'!H14=\"\",\"\",'Liste équipes'!H14)","v":""},null,null,null,null,null,null,null,"",null,"","",null,"","","","","","","","",null,null,null,null,null,null,null,"",null,"","",null,"","","","","","","",""]
[{"$f":"IF('Liste équipes'!H15=\"\",\"\",'Liste équipes'!H15)","v":""},null,null,null,null,null,null,null,"",null,"","",null,"","","","","","","","",null,null,null,null,null,null,null,"",null,"","",null,"","","","","","","",""]
[null,null,null,null,null,null,null,null,"",null,"","",null,"","","","","","","","",null,null,null,null,null,null,null,"",null,"","",null,"","","","","","","",""]
[null,null,null,"  Nombre joueurs sur le terrain",null,null,{"$f":"IF(J25>5,\"\",\"OK\")","v":""},{"$f":"IF(R25>5,\"PAS OK\",\"\")","v":""},null,{"$f":"IF(L27=\"\",\"\",R25)","v":""},"Points en jeu","Points autorisés maxi 19",null,{"$f":"SUM(N11:N24)","v":0},0,0,0,0,{"$f":"SUM(S11:S24)","v":0},{"$f":"SUM(T11:T24)","v":0},{"$f":"SUM(U11:U24)","v":0},null,null,"  Nombre joueurs sur le terrain",null,null,{"$f":"IF(AD25>5,\"\",\"OK\")","v":""},{"$f":"IF(AL25>5,\"PAS OK\",\"\")","v":""},null,{"$f":"IF(AF27=\"\",\"\",AL25)","v":""},"Points en jeu","Points autorisés maxi 19",null,{"$f":"SUM(AH11:AH24)","v":0},0,0,0,0,{"$f":"SUM(AM11:AM24)","v":0},{"$f":"SUM(AN11:AN24)","v":0},{"$f":"SUM(AO11:AO24)","v":0}]
[null,null,null,null,null,null,null,null,null,null,null,null,null,{"$f":"IF(N25=0,\"\",IF(N25=1,17,IF(N25=2,18.5,IF(N25=3,19,IF(N25>3,19,IF(N25>4,19,IF(N25>5,19,\"\")))))))","v":""},{"$f":"IF(O25=0,\"\",IF(O25=1,18,IF(O25=2,19,IF(O25=3,19,IF(O25=4,19,IF(O25=4,19,\"\"))))))","v":""},{"$f":"IF(P25=0,\"\",IF(P25=1,17,IF(P25=2,18.5,IF(P25=3,19,IF(P25=4,19,IF(P25=5,17.5,\"\"))))))","v":""},{"$f":"IF(Q25=0,\"\",IF(Q25=1,16,IF(Q25=2,16.5,IF(Q25=3,17,IF(Q25=4,17.5,IF(Q25=5,18,IF(Q25=6,18.5,IF(Q25=7,19,IF(Q25=8,19,IF(Q25=9,19,IF(Q25=10,19,IF(Q25=11,19,IF(Q25=12,19,\"\")))))))))))))","v":""},{"$f":"IF(AND(O26=16.5,P26=16),17.5,IF(AND(N26=15.5,P26=16),17,IF(AND(N26=15.5,O26=16.5),17.5,IF(AND(N26=16.5,P26=16),17.5,IF(AND(N25=2,O26=16.5),17.5,\"\")))))","v":""},null,null,null,null,null,null,null,null,null,null,null,null,null,null,null,{"$f":"IF(AH25=0,\"\",IF(AH25=1,17,IF(AH25=2,18.5,IF(AH25=3,19,IF(AH25>3,19,IF(AH25>4,19,IF(AH25>5,19,\"\")))))))","v":""},{"$f":"IF(AI25=0,\"\",IF(AI25=1,18,IF(AI25=2,19,IF(AI25=3,19,IF(AI25=4,19,IF(AI25=4,19,\"\"))))))","v":""},{"$f":"IF(AJ25=0,\"\",IF(AJ25=1,17,IF(AJ25=2,18.5,IF(AJ25=3,19,IF(AJ25=4,19,IF(AJ25=5,17.5,\"\"))))))","v":""},{"$f":"IF(AK25=0,\"\",IF(AK25=1,16,IF(AK25=2,16.5,IF(AK25=3,17,IF(AK25=4,17.5,IF(AK25=5,18,IF(AK25=6,18.5,IF(AK25=7,19,IF(AK25=8,19,IF(AK25=9,19,IF(AK25=10,19,IF(AK25=11,19,IF(AK25=12,19,\"\")))))))))))))","v":""},{"$f":"IF(AND(AI26=16.5,AJ26=16),17.5,IF(AND(AH26=15.5,AJ26=16),17,IF(AND(AH26=15.5,AI26=16.5),17.5,IF(AND(AH26=16.5,AJ26=16),17.5,IF(AND(AH25=2,AI26=16.5),17.5,\"\")))))","v":""}]
[null,null," ",{"$f":"IF(K27>L27,\"Trop de points en jeu\",\"\")","v":""},null,null,null,null,null,null,{"$f":"IF(O28>0,O28,\"\")","v":""},{"$f":"IF(O28=0,\"\",Q28)","v":""},null,{"$f":"SUM(N26)","v":0},0,0,0,0,null,null,null,null," ",{"$f":"IF(AE27>AF27,\"Trop de points en jeu\",\"\")","v":""},null,null,null,null,null,null,{"$f":"IF(AI28>0,AI28,\"\")","v":""},{"$f":"IF(AI28=0,\"\",AK28)","v":""},null,{"$f":"SUM(AH26)","v":0},0,0,0,0]
[null,null,null,{"$f":"IF(S25>2,\"Trop de joueurs  valides inscrits sur la feuille\",\"\")","v":""},null,null,null,null,null,null,null,null,null,{"$f":"SUM(L11:L24)","v":0},{"$f":"SUM(K11:K24)","v":0},{"$f":"SUM(N28+15.5)","v":15.5},{"$f":"IF(P28>19,19,P28)","v":15.5},null,null,{"$f":"SUM(T30:T31)","v":0},null,null,null,{"$f":"IF(AM25>2,\"Trop de joueurs  valides inscrits sur la feuille\",\"\")","v":""},null,null,null,null,null,null,null,null,null,{"$f":"SUM(AF11:AF24)","v":0},{"$f":"SUM(AE11:AE24)","v":0},{"$f":"SUM(AH28+15.5)","v":15.5},{"$f":"IF(AJ28>19,19,AJ28)","v":15.5},null,null,{"$f":"SUM(AN30:AN31)","v":0}]
[]
[null,null,null,{"$f":"IF(T25>5,\" Pas OK. Trop de joueurs (5 points), vérifier la liste de l'équipe.\",IF(U25>4,\"Pas OK. Trop de joueurs étrangers en jeu (ET), vérifier la liste.\",\"\"))","v":""},null,null,null,null,null,null,null,null,null,{"$f":"IF(D11=\"ET\",1,\"\")","v":""},{"$f":"IF(D12=\"ET\",1,\"\")","v":""},{"$f":"IF(D13=\"ET\",1,\"\")","v":""},{"$f":"IF(D14=\"ET\",1,\"\")","v":""},{"$f":"IF(D15=\"ET\",1,\"\")","v":""},{"$f":"IF(D16=\"ET\",1,\"\")","v":""},{"$f":"SUM(N30:S30)","v":0},null,null,null,{"$f":"IF(AN25>5,\" Pas OK. Trop de joueurs (5 points), vérifier la liste de l'équipe.\",IF(AO25>4,\"Pas OK. Trop de joueurs étrangers en jeu (ET), vérifier la liste.\",\"\"))","v":""},null,null,null,null,null,null,null,null,null,{"$f":"IF(X11=\"ET\",1,\"\")","v":""},{"$f":"IF(X12=\"ET\",1,\"\")","v":""},{"$f":"IF(X13=\"ET\",1,\"\")","v":""},{"$f":"IF(X14=\"ET\",1,\"\")","v":""},{"$f":"IF(X15=\"ET\",1,\"\")","v":""},{"$f":"IF(X16=\"ET\",1,\"\")","v":""},{"$f":"SUM(AH30:AM30)","v":0}]
[null,null,null,null,null,null,null,null,null,null,null,null,null,{"$f":"IF(D17=\"ET\",1,\"\")","v":""},{"$f":"IF(D18=\"ET\",1,\"\")","v":""},{"$f":"IF(D19=\"ET\",1,\"\")","v":""},{"$f":"IF(D20=\"ET\",1,\"\")","v":""},{"$f":"IF(D21=\"ET\",1,\"\")","v":""},{"$f":"IF(D22=\"ET\",1,\"\")","v":""},{"$f":"SUM(N31:S31)","v":0},null,null,null,null,null,null,null,null,null,null,null,null,null,{"$f":"IF(X17=\"ET\",1,\"\")","v":""},{"$f":"IF(X18=\"ET\",1,\"\")","v":""},{"$f":"IF(X19=\"ET\",1,\"\")","v":""},{"$f":"IF(X20=\"ET\",1,\"\")","v":""},{"$f":"IF(X21=\"ET\",1,\"\")","v":""},{"$f":"IF(X22=\"ET\",1,\"\")","v":""},{"$f":"SUM(AH31:AM31)","v":0}]

{"sheet":"Nationale_3_poule_E","index":9,"n_rows":31,"n_cols":41,"rows_kept":31,"cut":false,"hidden":false,"merged":[[24,10,25,10],[24,30,25,30],[25,3,25,8],[25,23,25,28],[5,3,5,11],[5,23,5,31],[6,3,6,11],[6,23,6,31],[8,25,8,26],[24,7,24,8],[24,11,25,11],[24,27,24,28],[24,31,25,31],[34,23,40,23],[26,3,26,8],[26,11,27,11],[26,23,26,28],[26,31,27,31],[26,10,27,10],[26,30,27,30],[29,3,30,11],[29,23,30,31],[27,3,27,8],[27,23,27,28]]}
[]
[]
[]
[]
[]
[null,null,null,"Equipe A",null,null,null,null,null,null,null,null,null,null,null,null,null,null,null,null,null,null,null,"Equipe B"]
[null,null,null,"LE CANNET 2",null,null,null,null,null,null,null,null,null,null,null,null,null,null,null,null,null,null,null,"GUILHERAND"]
[]
[null,null,null,"Carte","Pts","   Noms         /          Prénoms",null,"N°","Valeur","entrée en jeu","Sans Abattement","Bonus",null,"J","JF","F-FET","S-SF",null,"Valide","ET",null,null,null,"Carte","Pts","   Noms         /          Prénoms",null,"N°","Valeur","entrée en jeu","Sans Abattement","Bonus",null,"J","JF","F-FET","S-SF",null,"Valide","ET"]
[]
[{"$f":"IF('Liste équipes'!I3=\"\",\"\",'Liste équipes'!I3)","v":"LE CANNET 2"},null,null,null,null,null,null,null,{"$f":"IF(D11=\"SF\",E11,IF(D11=\"n\",E11,IF(D11=\"j\",E11,IF(D11=\"jf\",E11,IF(D11=\"f\",E11,IF(D11=\"fet\",E11,IF(D11=\"et\",E11,IF(D11=\"fid\",E11,IF(D11=\"s\",E11,IF(D11=\"FS\",E11,IF(D11=\"Js\",E11,IF(D11=\"Jfs\",E11,IF(D11=\"\",\"\")))))))))))))","v":""},null,{"$f":"IF(AND(J11=\"X\",E11>0),I11,\"\")","v":""},{"$f":"IF(AND(J11=\"X\",D11=\"J\"),1.5,IF(AND(J11=\"X\",D11=\"JF\"),2.5,IF(AND(J11=\"X\",D11=\"JS\"),2,IF(AND(J11=\"X\",D11=\"JFS\"),3,IF(AND(J11=\"X\",D11=\"F\",E11<5),1.5,IF(AND(J11=\"X\",D11=\"FET\",E11<5),1.5,IF(AND(J11=\"X\",D11=\"FS\",E11<5),2,IF(AND(J11=\"X\",D11=\"S\",E11<5),0.5,IF(AND(J11=\"X\",D11=\"SF\"),0.5,\"\")))))))))","v":""},null,{"$f":"IF(AND(J11=\"X\",D11=\"J\"),1,\"\")","v":""},{"$f":"IF(AND(J11=\"X\",D11=\"JF\"),1,IF(AND(J11=\"X\",D11=\"SF\"),1,\"\"))","v":""},{"$f":"IF(AND(J11=\"X\",D11=\"F\"),1,IF(AND(J11=\"X\",D11=\"FET\"),1,\"\"))","v":""},{"$f":"IF(AND(J11=\"X\",D11=\"S\"),1,\"\")","v":""},{"$f":"IF(AND(J11=\"X\",E11>0),1,\"\")","v":""},{"$f":"IF(E11=5,1,\"\")","v":""},{"$f":"IF(D11=\"ET\",1,\"\")","v":""},{"$f":"IF(AND(J11=\"X\",D11=\"ET\"),1,\"\")","v":""},null,null,null,null,null,null,null,{"$f":"IF(X11=\"SF\",Y11,IF(X11=\"n\",Y11,IF(X11=\"j\",Y11,IF(X11=\"jf\",Y11,IF(X11=\"f\",Y11,IF(X11=\"fet\",Y11,IF(X11=\"et\",Y11,IF(X11=\"fid\",Y11,IF(X11=\"s\",Y11,IF(X11=\"FS\",Y11,IF(X11=\"Js\",Y11,IF(X11=\"Jfs\",Y11,IF(X11=\"\",\"\")))))))))))))","v":""},null,{"$f":"IF(AND(AD11=\"X\",Y11>0),AC11,\"\")","v":""},{"$f":"IF(AND(AD11=\"X\",X11=\"J\"),1.5,IF(AND(AD11=\"X\",X11=\"JF\"),2.5,IF(AND(AD11=\"X\",X11=\"JS\"),2,IF(AND(AD11=\"X\",X11=\"JFS\"),3,IF(AND(AD11=\"X\",X11=\"F\",Y11<5),1.5,IF(AND(AD11=\"X\",X11=\"FET\",Y11<5),1.5,IF(AND(AD11=\"X\",X11=\"FS\",Y11<5),2,IF(AND(AD11=\"X\",X11=\"S\",Y11<5),0.5,IF(AND(AD11=\"X\",X11=\"SF\"),0.5,\"\")))))))))","v":""},null,{"$f":"IF(AND(AD11=\"X\",X11=\"J\"),1,\"\")","v":""},{"$f":"IF(AND(AD11=\"X\",X11=\"JF\"),1,IF(AND(AD11=\"X\",X11=\"SF\"),1,\"\"))","v":""},{"$f":"IF(AND(AD11=\"X\",X11=\"F\"),1,IF(AND(AD11=\"X\",X11=\"FET\"),1,\"\"))","v":""},{"$f":"IF(AND(AD11=\"X\",X11=\"S\"),1,\"\")","v":""},{"$f":"IF(AND(AD11=\"X\",Y11>0),1,\"\")","v":""},{"$f":"IF(Y11=5,1,\"\")","v":""},{"$f":"IF(X11=\"ET\",1,\"\")","v":""},{"$f":"IF(AND(AD11=\"X\",X11=\"ET\"),1,\"\")","v":""}]
[{"$f":"IF('Liste équipes'!I4=\"\",\"\",'Liste équipes'!I4)","v":"GUILHERAND"},null,null,null,null,null,null,null,{"$f":"IF(D12=\"SF\",E12,IF(D12=\"n\",E12,IF(D12=\"j\",E12,IF(D12=\"jf\",E12,IF(D12=\"f\",E12,IF(D12=\"fet\",E12,IF(D12=\"et\",E12,IF(D12=\"fid\",E12,IF(D12=\"s\",E12,IF(D12=\"FS\",E12,IF(D12=\"Js\",E12,IF(D12=\"Jfs\",E12,IF(D12=\"\",\"\")))))))))))))","v":""},null,"",{"$f":"IF(AND(J12=\"X\",D12=\"J\"),1.5,IF(AND(J12=\"X\",D12=\"JF\"),2.5,IF(AND(J12=\"X\",D12=\"JS\"),2,IF(AND(J12=\"X\",D12=\"JFS\"),3,IF(AND(J12=\"X\",D12=\"F\",E12<5),1.5,IF(AND(J12=\"X\",D12=\"FET\",E12<5),1.5,IF(AND(J12=\"X\",D12=\"FS\",E12<5),2,IF(AND(J12=\"X\",D12=\"S\",E12<5),0.5,IF(AND(J12=\"X\",D12=\"SF\"),0.5,\"\")))))))))","v":""},null,"",{"$f":"IF(AND(J12=\"X\",D12=\"JF\"),1,\"\")","v":""},"","","","","",{"$f":"IF(AND(J12=\"X\",D12=\"ET\"),1,\"\")","v":""},null,null,null,null,null,null,null,{"$f":"IF(X12=\"SF\",Y12,IF(X12=\"n\",Y12,IF(X12=\"j\",Y12,IF(X12=\"jf\",Y12,IF(X12=\"f\",Y12,IF(X12=\"fet\",Y12,IF(X12=\"et\",Y12,IF(X12=\"fid\",Y12,IF(X12=\"s\",Y12,IF(X12=\"FS\",Y12,IF(X12=\"Js\",Y12,IF(X12=\"Jfs\",Y12,IF(X12=\"\",\"\")))))))))))))","v":""},null,"",{"$f":"IF(AND(AD12=\"X\",X12=\"J\"),1.5,IF(AND(AD12=\"X\",X12=\"JF\"),2.5,IF(AND(AD12=\"X\",X12=\"JS\"),2,IF(AND(AD12=\"X\",X12=\"JFS\"),3,IF(AND(AD12=\"X\",X12=\"F\",Y12<5),1.5,IF(AND(AD12=\"X\",X12=\"FET\",Y12<5),1.5,IF(AND(AD12=\"X\",X12=\"FS\",Y12<5),2,IF(AND(AD12=\"X\",X12=\"S\",Y12<5),0.5,IF(AND(AD12=\"X\",X12=\"SF\"),0.5,\"\")))))))))","v":""},null,"",{"$f":"IF(AND(AD12=\"X\",X12=\"JF\"),1,\"\")","v":""},"","","","","",{"$f":"IF(AND(AD12=\"X\",X12=\"ET\"),1,\"\")","v":""}]
[{"$f":"IF('Liste équipes'!I5=\"\",\"\",'Liste équipes'!I5)","v":"HYERES 2"},null,null,null,null,null,null,null,"",null,"",{"$f":"IF(AND(J13=\"X\",D13=\"J\"),1.5,IF(AND(J13=\"X\",D13=\"JF\"),2.5,IF(AND(J13=\"X\",D13=\"JS\"),2,IF(AND(J13=\"X\",D13=\"JFS\"),3,IF(AND(J13=\"X\",D13=\"F\",E13<5),1.5,IF(AND(J13=\"X\",D13=\"FET\",E13<5),1.5,IF(AND(J13=\"X\",D13=\"FS\",E13<5),2,IF(AND(J13=\"X\",D13=\"S\",E13<5),0.5,IF(AND(J13=\"X\",D13=\"SF\"),0.5,\"\")))))))))","v":""},null,"","","","","","","","",null,null,null,null,null,null,null,"",null,"",{"$f":"IF(AND(AD13=\"X\",X13=\"J\"),1.5,IF(AND(AD13=\"X\",X13=\"JF\"),2.5,IF(AND(AD13=\"X\",X13=\"JS\"),2,IF(AND(AD13=\"X\",X13=\"JFS\"),3,IF(AND(AD13=\"X\",X13=\"F\",Y13<5),1.5,IF(AND(AD13=\"X\",X13=\"FET\",Y13<5),1.5,IF(AND(AD13=\"X\",X13=\"FS\",Y13<5),2,IF(AND(AD13=\"X\",X13=\"S\",Y13<5),0.5,IF(AND(AD13=\"X\",X13=\"SF\"),0.5,\"\")))))))))","v":""},null,"","","","","","","",""]
[{"$f":"IF('Liste équipes'!I6=\"\",\"\",'Liste équipes'!I6)","v":"MARSEILLE 2"},null,null,null,null,null,null,null,"",null,"","",null,"","","","","","","","",null,null,null,null,null,null,null,"",null,"","",null,"","","","","","","",""]
[{"$f":"IF('Liste équipes'!I7=\"\",\"\",'Liste équipes'!I7)","v":"MONTPELLIER"},null,null,null,null,null,null,null,"",null,"","",null,"","","","","","","","",null,null,null,null,null,null,null,"",null,"","",null,"","","","","","","",""]
[{"$f":"IF('Liste équipes'!I8=\"\",\"\",'Liste équipes'!I8)","v":""},null,null,null,null,null,null,null,"",null,"","",null,"","","","","","","","",null,null,null,null,null,null,null,"",null,"","",null,"","","","","","","",""]
[{"$f":"IF('Liste équipes'!I9=\"\",\"\",'Liste équipes'!I9)","v":""},null,null,null,null,null,null,null,"",null,"","",null,"","","","","","","","",null,null,null,null,null,null,null,"",null,"","",null,"","","","","","","",""]
[{"$f":"IF('Liste équipes'!I10=\"\",\"\",'Liste équipes'!I10)","v":""},null,null,null,null,null,null,null,"",null,"","",null,"","","","","","","","",null,null,null,null,null,null,null,"",null,"","",null,"","","","","","","",""]
[{"$f":"IF('Liste équipes'!I11=\"\",\"\",'Liste équipes'!I11)","v":""},null,null,null,null,null,null,null,"",null,"","",null,"","","","","","","","",null,null,null,null,null,null,null,"",null,"","",null,"","","","","","","",""]
[{"$f":"IF('Liste équipes'!I12=\"\",\"\",'Liste équipes'!I12)","v":""},null,null,null,null,null,null,null,"",null,"","",null,"","","","","","","","",null,null,null,null,null,null,null,"",null,"","",null,"","","","","","","",""]
[{"$f":"IF('Liste équipes'!I13=\"\",\"\",'Liste équipes'!I13)","v":""},null,null,null,null,null,null,null,"",null,"","",null,"","","","","","","","",null,null,null,null,null,null,null,"",null,"","",null,"","","","","","","",""]
[null,null,null,null,null,null,null,null,"",null,"","",null,"","","","","","","","",null,null,null,null,null,null,null,"",null,"","",null,"","","","","","","",""]
[{"$f":"IF('Liste équipes'!H15=\"\",\"\",'Liste équipes'!H15)","v":""},null,null,null,null,null,null,null,"",null,"","",null,"","","","","","","","",null,null,null,null,null,null,null,"",null,"","",null,"","","","","","","",""]
[null,null,null,null,null,null,null,null,"",null,"","",null,"","","","","","","","",null,null,null,null,null,null,null,"",null,"","",null,"","","","","","","",""]
[null,null,null,"  Nombre joueurs sur le terrain",null,null,{"$f":"IF(J25>5,\"\",\"OK\")","v":""},{"$f":"IF(R25>5,\"PAS OK\",\"\")","v":""},null,{"$f":"IF(L27=\"\",\"\",R25)","v":""},"Points en jeu","Points autorisés maxi 19",null,{"$f":"SUM(N11:N24)","v":0},0,0,0,0,{"$f":"SUM(S11:S24)","v":0},{"$f":"SUM(T11:T24)","v":0},{"$f":"SUM(U11:U24)","v":0},null,null,"  Nombre joueurs sur le terrain",null,null,{"$f":"IF(AD25>5,\"\",\"OK\")","v":""},{"$f":"IF(AL25>5,\"PAS OK\",\"\")","v":""},null,{"$f":"IF(AF27=\"\",\"\",AL25)","v":""},"Points en jeu","Points autorisés maxi 19",null,{"$f":"SUM(AH11:AH24)","v":0},0,0,0,0,{"$f":"SUM(AM11:AM24)","v":0},{"$f":"SUM(AN11:AN24)","v":0},{"$f":"SUM(AO11:AO24)","v":0}]
[null,null,null,null,null,null,null,null,null,null,null,null,null,{"$f":"IF(N25=0,\"\",IF(N25=1,17,IF(N25=2,18.5,IF(N25=3,19,IF(N25>3,19,IF(N25>4,19,IF(N25>5,19,\"\")))))))","v":""},{"$f":"IF(O25=0,\"\",IF(O25=1,18,IF(O25=2,19,IF(O25=3,19,IF(O25=4,19,IF(O25=4,19,\"\"))))))","v":""},{"$f":"IF(P25=0,\"\",IF(P25=1,17,IF(P25=2,18.5,IF(P25=3,19,IF(P25=4,19,IF(P25=5,17.5,\"\"))))))","v":""},{"$f":"IF(Q25=0,\"\",IF(Q25=1,16,IF(Q25=2,16.5,IF(Q25=3,17,IF(Q25=4,17.5,IF(Q25=5,18,IF(Q25=6,18.5,IF(Q25=7,19,IF(Q25=8,19,IF(Q25=9,19,IF(Q25=10,19,IF(Q25=11,19,IF(Q25=12,19,\"\")))))))))))))","v":""},{"$f":"IF(AND(O26=16.5,P26=16),17.5,IF(AND(N26=15.5,P26=16),17,IF(AND(N26=15.5,O26=16.5),17.5,IF(AND(N26=16.5,P26=16),17.5,IF(AND(N25=2,O26=16.5),17.5,\"\")))))","v":""},null,null,null,null,null,null,null,null,null,null,null,null,null,null,null,{"$f":"IF(AH25=0,\"\",IF(AH25=1,17,IF(AH25=2,18.5,IF(AH25=3,19,IF(AH25>3,19,IF(AH25>4,19,IF(AH25>5,19,\"\")))))))","v":""},{"$f":"IF(AI25=0,\"\",IF(AI25=1,18,IF(AI25=2,19,IF(AI25=3,19,IF(AI25=4,19,IF(AI25=4,19,\"\"))))))","v":""},{"$f":"IF(AJ25=0,\"\",IF(AJ25=1,17,IF(AJ25=2,18.5,IF(AJ25=3,19,IF(AJ25=4,19,IF(AJ25=5,17.5,\"\"))))))","v":""},{"$f":"IF(AK25=0,\"\",IF(AK25=1,16,IF(AK25=2,16.5,IF(AK25=3,17,IF(AK25=4,17.5,IF(AK25=5,18,IF(AK25=6,18.5,IF(AK25=7,19,IF(AK25=8,19,IF(AK25=9,19,IF(AK25=10,19,IF(AK25=11,19,IF(AK25=12,19,\"\")))))))))))))","v":""},{"$f":"IF(AND(AI26=16.5,AJ26=16),17.5,IF(AND(AH26=15.5,AJ26=16),17,IF(AND(AH26=15.5,AI26=16.5),17.5,IF(AND(AH26=16.5,AJ26=16),17.5,IF(AND(AH25=2,AI26=16.5),17.5,\"\")))))","v":""}]
[null,null," ",{"$f":"IF(K27>L27,\"Trop de points en jeu\",\"\")","v":""},null,null,null,null,null,null,{"$f":"IF(O28>0,O28,\"\")","v":""},{"$f":"IF(O28=0,\"\",Q28)","v":""},null,{"$f":"SUM(N26)","v":0},0,0,0,0,null,null,null,null," ",{"$f":"IF(AE27>AF27,\"Trop de points en jeu\",\"\")","v":""},null,null,null,null,null,null,{"$f":"IF(AI28>0,AI28,\"\")","v":""},{"$f":"IF(AI28=0,\"\",AK28)","v":""},null,{"$f":"SUM(AH26)","v":0},0,0,0,0]
[null,null,null,{"$f":"IF(S25>2,\"Trop de joueurs  valides inscrits sur la feuille\",\"\")","v":""},null,null,null,null,null,null,null,null,null,{"$f":"SUM(L11:L24)","v":0},{"$f":"SUM(K11:K24)","v":0},{"$f":"SUM(N28+15.5)","v":15.5},{"$f":"IF(P28>19,19,P28)","v":15.5},null,null,{"$f":"SUM(T30:T31)","v":0},null,null,null,{"$f":"IF(AM25>2,\"Trop de joueurs  valides inscrits sur la feuille\",\"\")","v":""},null,null,null,null,null,null,null,null,null,{"$f":"SUM(AF11:AF24)","v":0},{"$f":"SUM(AE11:AE24)","v":0},{"$f":"SUM(AH28+15.5)","v":15.5},{"$f":"IF(AJ28>19,19,AJ28)","v":15.5},null,null,{"$f":"SUM(AN30:AN31)","v":0}]
[]
[null,null,null,{"$f":"IF(T25>5,\" Pas OK. Trop de joueurs (5 points), vérifier la liste de l'équipe.\",IF(U25>4,\"Pas OK. Trop de joueurs étrangers en jeu (ET), vérifier la liste.\",\"\"))","v":""},null,null,null,null,null,null,null,null,null,{"$f":"IF(D11=\"ET\",1,\"\")","v":""},{"$f":"IF(D12=\"ET\",1,\"\")","v":""},{"$f":"IF(D13=\"ET\",1,\"\")","v":""},{"$f":"IF(D14=\"ET\",1,\"\")","v":""},{"$f":"IF(D15=\"ET\",1,\"\")","v":""},{"$f":"IF(D16=\"ET\",1,\"\")","v":""},{"$f":"SUM(N30:S30)","v":0},null,null,null,{"$f":"IF(AN25>5,\" Pas OK. Trop de joueurs (5 points), vérifier la liste de l'équipe.\",IF(AO25>4,\"Pas OK. Trop de joueurs étrangers en jeu (ET), vérifier la liste.\",\"\"))","v":""},null,null,null,null,null,null,null,null,null,{"$f":"IF(X11=\"ET\",1,\"\")","v":""},{"$f":"IF(X12=\"ET\",1,\"\")","v":""},{"$f":"IF(X13=\"ET\",1,\"\")","v":""},{"$f":"IF(X14=\"ET\",1,\"\")","v":""},{"$f":"IF(X15=\"ET\",1,\"\")","v":""},{"$f":"IF(X16=\"ET\",1,\"\")","v":""},{"$f":"SUM(AH30:AM30)","v":0}]
[null,null,null,null,null,null,null,null,null,null,null,null,null,{"$f":"IF(D17=\"ET\",1,\"\")","v":""},{"$f":"IF(D18=\"ET\",1,\"\")","v":""},{"$f":"IF(D19=\"ET\",1,\"\")","v":""},{"$f":"IF(D20=\"ET\",1,\"\")","v":""},{"$f":"IF(D21=\"ET\",1,\"\")","v":""},{"$f":"IF(D22=\"ET\",1,\"\")","v":""},{"$f":"SUM(N31:S31)","v":0},null,null,null,null,null,null,null,null,null,null,null,null,null,{"$f":"IF(X17=\"ET\",1,\"\")","v":""},{"$f":"IF(X18=\"ET\",1,\"\")","v":""},{"$f":"IF(X19=\"ET\",1,\"\")","v":""},{"$f":"IF(X20=\"ET\",1,\"\")","v":""},{"$f":"IF(X21=\"ET\",1,\"\")","v":""},{"$f":"IF(X22=\"ET\",1,\"\")","v":""},{"$f":"SUM(AH31:AM31)","v":0}]

{"sheet":"Liste équipes","index":10,"n_rows":12,"n_cols":9,"rows_kept":12,"cut":false,"hidden":false,"merged":[[0,2,0,3],[0,0,1,0],[0,1,1,1],[0,4,0,8]]}
["Elite Nationale Bastide Médical","Nationale 1 ","Nationale 2",null,"Nationale 3"]
[null,null,"Poule A","Poule B","Poule A","Poule B","Poule C","Poule D","Poule E"]
["ENT CHALON DIJON BF","BORDEAUX","ENT BELFORT BESANCON 1","AMIENS","BERCK","AUXERRE","CHAMBRAY","ANGLET","LE CANNET 2"]
["HURRICANE 92","CAPSAAA","CAPPELLE LA GRANDE","AULNOYE","CAPSAAA 2","ENT BELFORT BESANCON 2","EQUEURDREVILLE","ASMTH","GUILHERAND"]
["HYERES","CAUSSADE","CORBEIL","BLANQUEFORT","CERGY PONTOISE","ENT CHALON DIJON 3","Ent LAVAL-RENNES","PAVIE","HYERES 2"]
["LANNION","ENT CHALON DIJON BF 2","GRAVELINES","CAMBRAI","SUD OISE SPORTS ET HANDICAPS","JARNY","QUIMPER","LA ROCHELLE","MARSEILLE 2"]
["LE CANNET","DOUAI","LE PUY 2","BASKET FAUTEUIL FEMININ","Ent-HURRICANE-PBF","MULHOUSE","SAINT HERBLAIN 2","POLE NATIONAL","MONTPELLIER"]
["LE PUY","FEURS","LYON","LANNION 2","LILLE 2","STRASBOURG 2","SAINT POL DE LEON","TOULOUSE 2"]
["MARSEILLE","LILLE","VANDOEUVRE","SAINT HERBLAIN","ORLEANS","TROYES","YFFINIAC"]
["MEAUX","MEAUX 2",null,null,"SAINT OUEN","THIONVILLE"]
["TOULOUSE","MEYLAN",null,null,"VALENCIENNES","VANDOEUVRE 2"]
[null,"STRASBOURG"]

{"sheet":"ENT CHALON DIJON BF","index":11,"n_rows":32,"n_cols":29,"rows_kept":32,"cut":false,"hidden":false,"merged":[[14,26,14,27],[14,28,14,29],[15,15,15,29],[19,15,21,17],[19,18,21,21],[9,28,9,29],[10,28,10,29],[11,15,14,17],[11,18,11,19],[11,22,14,22],[11,23,14,23],[11,24,14,24],[11,25,14,25],[11,28,11,29],[12,18,14,19],[12,20,12,21],[12,26,12,27],[12,28,12,29],[13,20,13,21],[13,26,13,27],[13,28,13,29],[5,28,6,29],[7,15,8,17],[7,18,8,19],[7,22,8,22],[7,23,8,23],[7,24,8,24],[7,28,7,29],[8,28,8,29],[0,15,0,29],[1,22,3,22],[1,23,3,23],[1,24,3,24],[1,25,3,25],[1,26,3,27],[1,28,3,29],[28,0,28,4],[8,20,8,21],[10,20,10,21],[11,20,11,21],[9,20,9,21],[27,0,27,4],[9,15,10,17],[9,18,10,19],[14,20,14,21],[26,0,26,4],[24,15,24,17],[23,15,23,29],[25,15,25,17],[16,18,18,21],[16,15,18,17],[22,15,22,17],[1,9,1,13],[1,1,2,3],[1,0,2,0],[2,9,2,13],[7,26,7,27],[5,26,5,27],[6,26,6,27],[5,20,5,21],[6,20,6,21],[7,20,7,21],[5,15,6,17],[5,18,6,19],[5,22,6,22],[5,23,6,23],[5,24,6,24],[10,26,10,27],[9,26,9,27],[11,26,11,27],[8,26,8,27],[9,22,10,22],[9,23,10,23],[9,24,10,24],[9,25,10,25],[22,18,22,21],[31,15,31,17],[29,15,29,17],[27,15,27,17],[28,15,28,29],[26,15,26,17],[30,15,30,17]]}
["ENT CHALON DIJON BF",null,null,null,null,null,null,null,null,null,null,null,null,null,null,"Saison 2023-2024"]
[null,"Joueur(es) participant à la rencontre",null,null,null,null,null,null,null,"Saisir votre liste complète en MAJUSCULES ",null,null,null,null,null,null,null,null,null,null,null,null,"Carte Verte","Carte Jaune","Carte Rose","Carte Bleue","5,0 Val",null,"Non Sélectionnables en EDF (hors Fidet)"]
[null,null,null,null,null,null,null,null,null,"Joueurs(es) qualifié(es) saison 2023 -2024",null,null,null,null,null,null,null,null,"Avec une date de validité"]
[]
["Statuts","Classif.","          Noms      /    Prénoms",null,"Numéros","ET","VALIDE",null,null,"Statuts","Classif.","          Noms      /    Prénoms",null,"Numéros"]
["FID",2.5,"CHALLAT","Z",4,{"$f":"IF(A6=\"ET\",1,\"\")","v":""},{"$f":"IF(B6=5,1,\"\")","v":""},null,null,"FID",2.5,"CHALLAT","Z",4,null,"Elite Nationale Bastide Médical",null,null,14.5,null,"Maxi 17,5 pts",null,"+  1 ","+  2","+  1,5",null,"1 sur la feuille",null,"Pas de limite"]
["F",2,"ITA","V",5,{"$f":"IF(A7=\"ET\",1,\"\")","v":""},{"$f":"IF(B7=5,1,\"\")","v":""},null,null,"F",2,"ITA","V",5,null,null,null,null,null,null,"si cartes de couleurs",null,null,null,null,null,"et terrain"]
["FID",4,"DIOUF","Y",7,{"$f":"IF(A8=\"ET\",1,\"\")","v":""},{"$f":"IF(B8=5,1,\"\")","v":""},null,null,"N",4.5,"HUMBERT","M",6,null," Nationale 1",null,null,14.5,null,"Maxi 17,5 pts",null,"+  1 ,5","+  2,5","+  1,5",null,"1 sur la feuille",null,"4  Maxi / terrain     "]
["N",3,"DARJOUR","K",8,"","",null,null,"FID",4,"DIOUF","Y",7,null,null,null,null,null,null,"si cartes de couleurs",null,null,null,null,null,"et terrain",null," (5 sur la feuille)"]
["ET",4,"DAHMANI","C",9,1,"",null,null,"N",3,"DARJOUR","K",8,null," Nationale 2",null,null,15,null,"Maxi 19 pts",null,null,"+  2,5","+  1,5","+  0,5","2 sur la feuille",null,"4  Maxi / terrain     "]
["J",2.5,"MASSOUANGA","AJ",10,"","",null,null,"ET",4,"DAHMANI","C",9,null,null,null,null,null,null,"si cartes de couleurs",null,null,null,null,null,"2 sur le terrain",null," (5 sur la feuille)"]
["N",4,"BOULEFA","Z",11,"","",null,null,"J",2.5,"MASSOUANGA","AJ",10,null," Nationale 3",null,null,15.5,null,null,null,"+  1,5","+  2,5","+  1,5","+  0,5"]
["FID",3,"MILYUTIN","G",12,"","",null,null,"N",4,"BOULEFA","Z",11,null,null,null,null,"Si 16pts début match-handicap de 10pts",null,"Maxi 19 pts",null,null,null,null,null,"2 sur la feuille",null,"4 Maxi / terrain"]
["N",3.5,"BOUGHANIA","AJ",13,"","",null,null,"FID",3,"MILYUTIN","G",12,null,null,null,null,null,null,"si cartes de couleurs",null,null,null,null,null,"2 sur le terrain",null," (5 sur la feuille)"]
[null,null,null,null,null,"","",null,null,"N",3.5,"BOUGHANIA","AJ",13]
[null,null,null,null,null,"","",null,null,"ET",1.5,"ROSS","J",14,null,"Inscrire dans la colonne de gauche les \"Statuts\" des joueurs de l'équipe"]
[null,null,null,null,null,"","","",null,null,null,null,null,15,null,"J",null,null,"Pour les cartes Vertes",null,null,null,"Jeune joueur (U19 en Elite Nationale Bastide Médical)"]
[null,null,null,null,null,"","","",null,"N",3.5,"ABDELGHANEE","B",16,null,null,null,null,null,null,null,null,"Joueur débutant, sélectionnable en Equipe de France"]
[null,null,null,null,null,"","","",null,null,null,null,null,17,null,null,null,null,null,null,null,null,"seulement (attention à la date de validité juqu'à 22 ans révolu)"]
[null,null,null,null,null,"","",null,null,null,null,null,null,18,null,"JF",null,null,"Pour les cartes Jaunes",null,null,null,"Jeune joueuse (U19 en Elite Nationale Bastide Médical)"]
[null,null,null,null,null,"","","",null,null,null,null,null,19,null,null,null,null,null,null,null,null,"Joueuse débutante, sélectionnable en Equipe de France"]
[null,null,null,null,null,"","",null,null,null,null,null,null,20,null,null,null,null,null,null,null,null,"seulement (attention à la date de validité juqu' à 22 ans révolu)"]
[null,null,null,null,null,"","",null,null,null,null,null,null,21,null,"F ou FET",null,null,"Pour les cartes roses",null,null,null,"Pour les femmes ou femmes étrangères <5pts  (Bonus 1,5 pts)"]
[null,null,null,null,null,"","",null,null,null,null,null,null,88,null,"En Nationale 2 et 3 uniquement (joueuses et joueurs de plus de 55 ans)"]
[null,null,null,null,null,"","",null,null,null,null,null,null,null,null,"S",null,null,"Pour les hommes séniors",null,null,null," Français ou Etrangers (Bonus de 0,5pt)"]
[null,null,null,null,null,null,null,null,null,null,null,null,null,null,null,"FS",null,null,"   Pour les femmes seniors",null,null,null," (Bonus 2pts)      "]
[" Joueurs-joueuses valides de l'équipe",null,null,null,null,null,null,null,null,null,null,null,null,null,null,"JS",null,null," Pour les jeunes hommes séniors",null,null,null," Débutants  (Bonus 2pts)  validité (<3pts 2ans)       ( > 3pts 1 an)"]
[{"$f":"IF(G31=0,\"\",IF(G31>1,\"Trop de valides sur le terrain\",\"OK\"))","v":""},null,null,null,null,null,null,null,null,null,null,null,null,null,null,"JFS",null,null," Pour les jeunes femmes séniors",null,null,null," Débutantes  (Bonus 3pts)  validité (<3pts 2ans)     ( > 3pts 1 an)"]
[null,null,null,null,null,null,null,null,null,null,null,null,null,null,null,"Autres possibilités (sans Bonus)"]
[null,null,null,null,null,null,null,null,null,null,null,null,null,null,null,"ET",null,null,"Pour un joueur étranger"]
[null,null,null,null,null,{"$f":"SUM(F6:F28)","v":1},{"$f":"SUM(G6:G30)","v":0},null,null,null,null,null,null,null,null,"FID",null,null,"Pour un joueur fidèle"]
[null,null,null,null,null,null,null,null,null,null,null,null,null,null,null,"N",null,null,"Pour tous joueurs sans symbole sur la carte de classification"]

{"sheet":"HURRICANE 92","index":12,"n_rows":32,"n_cols":29,"rows_kept":32,"cut":false,"hidden":false,"merged":[[28,15,28,29],[30,15,30,17],[31,15,31,17],[29,15,29,17],[22,18,22,21],[23,15,23,29],[24,15,24,17],[25,15,25,17],[26,15,26,17],[14,26,14,27],[14,28,14,29],[15,15,15,29],[19,15,21,17],[19,18,21,21],[12,26,12,27],[12,28,12,29],[13,20,13,21],[13,26,13,27],[13,28,13,29],[11,18,11,19],[11,22,14,22],[11,23,14,23],[11,24,14,24],[11,25,14,25],[12,18,14,19],[12,20,12,21],[14,20,14,21],[9,22,10,22],[9,23,10,23],[9,24,10,24],[9,25,10,25],[9,28,9,29],[10,28,10,29],[7,22,8,22],[7,23,8,23],[7,24,8,24],[7,28,7,29],[8,28,8,29],[1,0,2,0],[1,1,2,3],[1,9,1,13],[2,9,2,13],[0,15,0,29],[1,22,3,22],[1,23,3,23],[1,24,3,24],[1,25,3,25],[1,26,3,27],[1,28,3,29],[5,26,5,27],[6,26,6,27],[5,28,6,29],[11,26,11,27],[10,26,10,27],[7,26,7,27],[8,26,8,27],[9,26,9,27],[11,28,11,29],[5,15,6,17],[5,18,6,19],[5,22,6,22],[5,23,6,23],[5,24,6,24],[6,20,6,21],[5,20,5,21],[7,15,8,17],[16,15,18,17],[16,18,18,21],[26,0,26,4],[27,0,27,4],[27,15,27,17],[7,20,7,21],[8,20,8,21],[9,20,9,21],[10,20,10,21],[11,20,11,21],[22,15,22,17],[7,18,8,19],[9,15,10,17],[9,18,10,19],[11,15,14,17]]}
["HURRICANE 92",null,null,null,null,null,null,null,null,null,null,null,null,null,null,"Saison 2023-2024"]
[null,"Joueur(es) participant à la rencontre",null,null,null,null,null,null,null,"Saisir votre liste complète en MAJUSCULES ",null,null,null,null,null,null,null,null,null,null,null,null,"Carte Verte","Carte Jaune","Carte Rose","Carte Bleue","5,0 Val",null,"Non Sélectionnables en EDF (hors Fidet)"]
[null,null,null,null,null,null,null,null,null,"Joueurs(es) qualifié(es) saison 2023 -2024",null,null,null,null,null,null,null,null,"Avec une date de validité"]
[]
["Statuts","Classif.","          Noms      /    Prénoms",null,"Numéros","ET","VALIDE",null,null,"Statuts","Classif.","          Noms      /    Prénoms",null,"Numéros"]
["ET",2.5,"ALDEEB","F",6,{"$f":"IF(A6=\"ET\",1,\"\")","v":1},{"$f":"IF(B6=5,1,\"\")","v":""},null,null,null,null,null,null,4,null,"Elite Nationale Bastide Médical",null,null,14.5,null,"Maxi 17,5 pts",null,"+  1 ","+  2","+  1,5",null,"1 sur la feuille",null,"Pas de limite"]
["F",2.5,"CARLIEZ","M",7,{"$f":"IF(A7=\"ET\",1,\"\")","v":""},{"$f":"IF(B7=5,1,\"\")","v":""},null,null,"ET",2.5,"ALDEEB","F",5,null,null,null,null,null,null,"si cartes de couleurs",null,null,null,null,null,"et terrain"]
["N",3,"MEHIAOUI","S",9,{"$f":"IF(A8=\"ET\",1,\"\")","v":""},{"$f":"IF(B8=5,1,\"\")","v":""},null,null,null,null,null,null,6,null," Nationale 1",null,null,14.5,null,"Maxi 17,5 pts",null,"+  1 ,5","+  2,5","+  1,5",null,"1 sur la feuille",null,"4  Maxi / terrain     "]
["N",2,"ATTIOGBE","S",10,"","",null,null,"F",2.5,"CARLIEZ","M",7,null,null,null,null,null,null,"si cartes de couleurs",null,null,null,null,null,"et terrain",null," (5 sur la feuille)"]
["N",2,"KOTI-BINGO","P",11,"","",null,null,null,null,null,null,8,null," Nationale 2",null,null,15,null,"Maxi 19 pts",null,"+  1,5","+  2,5","+  1,5","+  0,5","2 sur la feuille",null,"4  Maxi / terrain     "]
["ET",4,"ARNAUT","N",13,1,"",null,null,"N",3,"MEHIAOUI","S",9,null,null,null,null,null,null,"si cartes de couleurs",null,null,null,null,null,"2 sur le terrain",null," (5 sur la feuille)"]
["N",3,"KONATE","B",23,"","",null,null,"N",2,"ATTIOGBE","S",10,null," Nationale 3",null,null,15.5,null,null,null,"+  1,5","+  2,5","+  1,5","+  0,5"]
["N",1,"HAMACHE","D",24,"","",null,null,"N",2,"KOTI-BINGO","P",11,null,null,null,null,"Si 16pts début match-handicap de 10pts",null,"Maxi 19 pts",null,null,null,null,null,"2 sur la feuille",null,"4 Maxi / terrain"]
["N",1,"GUIRASSY","I",27,"","",null,null,null,null,null,null,12,null,null,null,null,null,null,"si cartes de couleurs",null,null,null,null,null,"2 sur le terrain",null," (5 sur la feuille)"]
["ET",4,"EIVAZI","R",32,1,"",null,null,"ET",4,"ARNAUT","N",13]
[null,null,null,null,null,"","",null,null,"N",4.5,"FALEMPE","A",14,null,"Inscrire dans la colonne de gauche les \"Statuts\" des joueurs de l'équipe"]
[null,null,null,null,null,"","","",null,null,null,null,null,15,null,"J",null,null,"Pour les cartes Vertes",null,null,null,"Jeune joueur (U19 en Elite Nationale Bastide Médical)"]
[null,null,null,null,null,"","","",null,null,null,null,null,16,null,null,null,null,null,null,null,null,"Joueur débutant, sélectionnable en Equipe de France"]
[null,null,null,null,null,"","","",null,"N",3,"KONATE","B",23,null,null,null,null,null,null,null,null,"seulement (attention à la date de validité juqu'à 22 ans révolu)"]
[null,null,null,null,null,"","",null,null,"N",1,"HAMACHE","D",24,null,"JF",null,null,"Pour les cartes Jaunes",null,null,null,"Jeune joueuse (U19 en Elite Nationale Bastide Médical)"]
[null,null,null,null,null,"","","",null,"N",1,"GUIRASSY","I",27,null,null,null,null,null,null,null,null,"Joueuse débutante, sélectionnable en Equipe de France"]
[null,null,null,null,null,"","",null,null,"ET",4,"EIVAZI","R",32,null,null,null,null,null,null,null,null,"seulement (attention à la date de validité juqu' à 22 ans révolu)"]
[null,null,null,null,null,"","",null,null,"FET",1,"SENNI","S",33,null,"F ou FET",null,null,"Pour les cartes roses",null,null,null,"Pour les femmes ou femmes étrangères <5pts  (Bonus 1,5 pts)"]
[null,null,null,null,null,"","",null,null,"ET",1,"BRAHMI",0,35,null,"En Nationale 2 et 3 uniquement (joueuses et joueurs de plus de 55 ans)"]
[null,null,null,null,null,"","",null,null,null,null,null,null,null,null,"S",null,null,"Pour les hommes séniors",null,null,null," Français ou Etrangers (Bonus de 0,5pt)"]
[null,null,null,null,null,null,null,null,null,null,null,null,null,null,null,"FS",null,null,"   Pour les femmes seniors",null,null,null," (Bonus 2pts)      "]
[" Joueurs-joueuses valides de l'équipe",null,null,null,null,null,null,null,null,null,null,null,null,null,null,"JS",null,null," Pour les jeunes hommes séniors",null,null,null," Débutants  (Bonus 2pts)  validité (<3pts 2ans)       ( > 3pts 1 an)"]
[{"$f":"IF(G31=0,\"\",IF(G31>1,\"Trop de valides sur le terrain\",\"OK\"))","v":""},null,null,null,null,null,null,null,null,null,null,null,null,null,null,"JFS",null,null," Pour les jeunes femmes séniors",null,null,null," Débutantes  (Bonus 3pts)  validité (<3pts 2ans)     ( > 3pts 1 an)"]
[null,null,null,null,null,null,null,null,null,null,null,null,null,null,null,"Autres possibilités (sans Bonus)"]
[null,null,null,null,null,null,null,null,null,null,null,null,null,null,null,"ET",null,null,"Pour un joueur étranger"]
[null,null,null,null,null,{"$f":"SUM(F6:F28)","v":3},{"$f":"SUM(G6:G30)","v":0},null,null,null,null,null,null,null,null,"FID",null,null,"Pour un joueur fidèle"]
[null,null,null,null,null,null,null,null,null,null,null,null,null,null,null,"N",null,null,"Pour tous joueurs sans symbole sur la carte de classification"]

{"sheet":"HYERES","index":13,"n_rows":32,"n_cols":29,"rows_kept":32,"cut":false,"hidden":false,"merged":[[28,15,28,29],[30,15,30,17],[31,15,31,17],[14,26,14,27],[14,28,14,29],[15,15,15,29],[19,15,21,17],[19,18,21,21],[16,15,18,17],[16,18,18,21],[12,18,14,19],[12,20,12,21],[12,26,12,27],[12,28,12,29],[13,20,13,21],[13,26,13,27],[13,28,13,29],[14,20,14,21],[11,22,14,22],[11,23,14,23],[11,24,14,24],[11,25,14,25],[11,28,11,29],[5,22,6,22],[5,23,6,23],[5,24,6,24],[1,0,2,0],[1,1,2,3],[1,9,1,13],[2,9,2,13],[1,22,3,22],[9,28,9,29],[9,26,9,27],[10,26,10,27],[7,26,7,27],[5,28,6,29],[7,28,7,29],[8,28,8,29],[5,26,5,27],[6,26,6,27],[10,28,10,29],[0,15,0,29],[1,25,3,25],[1,26,3,27],[1,28,3,29],[7,15,8,17],[7,18,8,19],[7,22,8,22],[5,20,5,21],[6,20,6,21],[7,20,7,21],[7,23,8,23],[7,24,8,24],[1,23,3,23],[1,24,3,24],[5,15,6,17],[5,18,6,19],[27,0,27,4],[26,0,26,4],[27,15,27,17],[22,18,22,21],[23,15,23,29],[24,15,24,17],[25,15,25,17],[26,15,26,17],[9,22,10,22],[22,15,22,17],[9,20,9,21],[29,15,29,17],[8,26,8,27],[11,26,11,27],[10,20,10,21],[11,20,11,21],[8,20,8,21],[9,15,10,17],[9,18,10,19],[9,23,10,23],[9,24,10,24],[9,25,10,25],[11,15,14,17],[11,18,11,19]]}
["HYERES",null,null,null,null,null,null,null,null,null,null,null,null,null,null,"Saison 2023-2024"]
[null,"Joueur(es) participant à la rencontre",null,null,null,null,null,null,null,"Saisir votre liste complète en MAJUSCULES ",null,null,null,null,null,null,null,null,null,null,null,null,"Carte Verte","Carte Jaune","Carte Rose","Carte Bleue","5,0 Val",null,"Non Sélectionnables en EDF (hors Fidet)"]
[null,null,null,null,null,null,null,null,null,"Joueurs(es) qualifié(es) saison 2023 -2024",null,null,null,null,null,null,null,null,"Avec une date de validité"]
[]
["Statuts","Classif.","          Noms      /    Prénoms",null,"Numéros","ET","VALIDE",null,null,"Statuts","Classif.","          Noms      /    Prénoms",null,"Numéros"]
["N",1,"LAURERI","J",5,{"$f":"IF(A6=\"ET\",1,\"\")","v":""},{"$f":"IF(B6=5,1,\"\")","v":""},null,null,null,null,null,null,4,null,"Elite Nationale Bastide Médical",null,null,14.5,null,"Maxi 17,5 pts",null,"+  1 ","+  2","+  1,5",null,"1 sur la feuille",null,"Pas de limite"]
["FID",4.5,"ABDALI","H",7,{"$f":"IF(A7=\"ET\",1,\"\")","v":""},{"$f":"IF(B7=5,1,\"\")","v":""},null,null,"N",1,"LAURERI","J",5,null,null,null,null,null,null,"si cartes de couleurs",null,null,null,null,null,"et terrain"]
["J",3,"HERMOSILLA","A",8,{"$f":"IF(A8=\"ET\",1,\"\")","v":""},{"$f":"IF(B8=5,1,\"\")","v":""},null,null,null,null,null,null,6,null," Nationale 1",null,null,14.5,null,"Maxi 17,5 pts",null,"+  1 ,5","+  2,5","+  1,5",null,"1 sur la feuille",null,"4  Maxi / terrain     "]
["N",4.5,"JOUANSERRE","N",9,"","",null,null,"FID",4.5,"ABDALI","H",7,null,null,null,null,null,null,"si cartes de couleurs",null,null,null,null,null,"et terrain",null," (5 sur la feuille)"]
["N",2.5,"NUTTIN","P",10,"","",null,null,"ET",3,"PERDOMO","E",8,null," Nationale 2",null,null,15,null,"Maxi 19 pts",null,"+  1,5","+  2,5","+  1,5","+  0,5","2 sur la feuille",null,"4  Maxi / terrain     "]
["N",1,"ADIASSE","G",11,"","",null,null,"N",4.5,"JOUANSERRE","N",9,null,null,null,null,null,null,"si cartes de couleurs",null,null,null,null,null,"2 sur le terrain",null," (5 sur la feuille)"]
["N",3,"LERAY","D",12,"","",null,null,"N",2.5,"NUTTIN","P",10,null," Nationale 3",null,null,15.5,null,null,null,"+  1,5","+  2,5","+  1,5","+  0,5"]
["N",4,"TRAORE","M",13,"","",null,null,"N",1,"ADIASSE","G",11,null,null,null,null,"Si 16pts début match-handicap de 10pts",null,"Maxi 19 pts",null,null,null,null,null,"2 sur la feuille",null,"4 Maxi / terrain"]
["N",2,"DURAN","J",15,"","",null,null,"N",3,"LERAY","D",12,null,null,null,null,null,null,"si cartes de couleurs",null,null,null,null,null,"2 sur le terrain",null," (5 sur la feuille)"]
[null,null,null,null,null,"","",null,null,"N",4,"TRAORE","M",13]
[null,null,null,null,null,"","",null,null,"N",4,"TRAORE","M",14,null,"Inscrire dans la colonne de gauche les \"Statuts\" des joueurs de l'équipe"]
[null,null,null,null,null,"","","",null,"N",2,"DURAN","J",15,null,"J",null,null,"Pour les cartes Vertes",null,null,null,"Jeune joueur (U19 en Elite Nationale Bastide Médical)"]
[null,null,null,null,null,"","","",null,null,null,null,null,16,null,null,null,null,null,null,null,null,"Joueur débutant, sélectionnable en Equipe de France"]
[null,null,null,null,null,"","","",null,"J",3,"HERMOSILLA","A",8,null,null,null,null,null,null,null,null,"seulement (attention à la date de validité juqu'à 22 ans révolu)"]
[null,null,null,null,null,"","",null,null,"J",1,"SOULIE","P",18,null,"JF",null,null,"Pour les cartes Jaunes",null,null,null,"Jeune joueuse (U19 en Elite Nationale Bastide Médical)"]
[null,null,null,null,null,"","","",null,null,null,null,null,19,null,null,null,null,null,null,null,null,"Joueuse débutante, sélectionnable en Equipe de France"]
[null,null,null,null,null,"","",null,null,null,null,null,null,20,null,null,null,null,null,null,null,null,"seulement (attention à la date de validité juqu' à 22 ans révolu)"]
[null,null,null,null,null,"","",null,null,null,null,null,null,null,null,"F ou FET",null,null,"Pour les cartes roses",null,null,null,"Pour les femmes ou femmes étrangères <5pts  (Bonus 1,5 pts)"]
[null,null,null,null,null,"","",null,null,null,null,null,null,null,null,"En Nationale 2 et 3 uniquement (joueuses et joueurs de plus de 55 ans)"]
[null,null,null,null,null,"","",null,null,null,null,null,null,null,null,"S",null,null,"Pour les hommes séniors",null,null,null," Français ou Etrangers (Bonus de 0,5pt)"]
[null,null,null,null,null,null,null,null,null,null,null,null,null,null,null,"FS",null,null,"   Pour les femmes seniors",null,null,null," (Bonus 2pts)      "]
[" Joueurs-joueuses valides de l'équipe",null,null,null,null,null,null,null,null,null,null,null,null,null,null,"JS",null,null," Pour les jeunes hommes séniors",null,null,null," Débutants  (Bonus 2pts)  validité (<3pts 2ans)       ( > 3pts 1 an)"]
[{"$f":"IF(G31=0,\"\",IF(G31>1,\"Trop de valides sur le terrain\",\"OK\"))","v":""},null,null,null,null,null,null,null,null,null,null,null,null,null,null,"JFS",null,null," Pour les jeunes femmes séniors",null,null,null," Débutantes  (Bonus 3pts)  validité (<3pts 2ans)     ( > 3pts 1 an)"]
[null,null,null,null,null,null,null,null,null,null,null,null,null,null,null,"Autres possibilités (sans Bonus)"]
[null,null,null,null,null,null,null,null,null,null,null,null,null,null,null,"ET",null,null,"Pour un joueur étranger"]
[null,null,null,null,null,{"$f":"SUM(F6:F28)","v":0},{"$f":"SUM(G6:G30)","v":0},null,null,null,null,null,null,null,null,"FID",null,null,"Pour un joueur fidèle"]
[null,null,null,null,null,null,null,null,null,null,null,null,null,null,null,"N",null,null,"Pour tous joueurs sans symbole sur la carte de classification"]

{"sheet":"LANNION","index":14,"n_rows":32,"n_cols":29,"rows_kept":32,"cut":false,"hidden":false,"merged":[[30,15,30,17],[31,15,31,17],[8,28,8,29],[9,15,10,17],[9,18,10,19],[9,22,10,22],[9,23,10,23],[9,24,10,24],[9,25,10,25],[9,28,9,29],[10,28,10,29],[7,15,8,17],[7,18,8,19],[7,22,8,22],[7,23,8,23],[7,24,8,24],[1,0,2,0],[1,1,2,3],[1,9,1,13],[2,9,2,13],[0,15,0,29],[1,22,3,22],[1,23,3,23],[1,24,3,24],[1,25,3,25],[1,26,3,27],[1,28,3,29],[5,28,6,29],[5,15,6,17],[5,18,6,19],[5,22,6,22],[5,23,6,23],[5,24,6,24],[5,20,5,21],[6,20,6,21],[7,28,7,29],[7,26,7,27],[8,26,8,27],[9,26,9,27],[10,26,10,27],[11,18,11,19],[11,22,14,22],[12,18,14,19],[11,20,11,21],[22,15,22,17],[11,15,14,17],[12,20,12,21],[26,0,26,4],[27,0,27,4],[16,15,18,17],[16,18,18,21],[27,15,27,17],[19,15,21,17],[19,18,21,21],[22,18,22,21],[23,15,23,29],[7,20,7,21],[8,20,8,21],[11,26,11,27],[5,26,5,27],[6,26,6,27],[11,23,14,23],[11,24,14,24],[11,25,14,25],[29,15,29,17],[13,20,13,21],[13,26,13,27],[13,28,13,29],[14,20,14,21],[14,26,14,27],[14,28,14,29],[15,15,15,29],[24,15,24,17],[25,15,25,17],[26,15,26,17],[28,15,28,29],[11,28,11,29],[12,26,12,27],[12,28,12,29],[9,20,9,21],[10,20,10,21]]}
["LANNION",null,null,null,null,null,null,null,null,null,null,null,null,null,null,"Saison 2023-2024"]
[null,"Joueur(es) participant à la rencontre",null,null,null,null,null,null,null,"Saisir votre liste complète en MAJUSCULES ",null,null,null,null,null,null,null,null,null,null,null,null,"Carte Verte","Carte Jaune","Carte Rose","Carte Bleue","5,0 Val",null,"Non Sélectionnables en EDF (hors Fidet)"]
[null,null,null,null,null,null,null,null,null,"Joueurs(es) qualifié(es) saison 2023 -2024",null,null,null,null,null,null,null,null,"Avec une date de validité"]
[]
["Statuts","Classif.","          Noms      /    Prénoms",null,"Numéros","ET","VALIDE",null,null,"Statuts","Classif.","          Noms      /    Prénoms",null,"Numéros"]
["F",4.5,"PICHON","A",6,{"$f":"IF(A6=\"ET\",1,\"\")","v":""},{"$f":"IF(B6=5,1,\"\")","v":""},null,null,"N",2,"CAROFF","C",4,null,"Elite Nationale Bastide Médical",null,null,14.5,null,"Maxi 17,5 pts",null,"+  1 ","+  2","+  1,5",null,"1 sur la feuille",null,"Pas de limite"]
["F",1,"ETAVARD-GLEMP","A",7,{"$f":"IF(A7=\"ET\",1,\"\")","v":""},{"$f":"IF(B7=5,1,\"\")","v":""},null,null,null,null,null,null,5,null,null,null,null,null,null,"si cartes de couleurs",null,null,null,null,null,"et terrain"]
["N",4,"ETAVARD","F",13,{"$f":"IF(A8=\"ET\",1,\"\")","v":""},{"$f":"IF(B8=5,1,\"\")","v":""},null,null,"F",4.5,"PICHON","A",6,null," Nationale 1",null,null,14.5,null,"Maxi 17,5 pts",null,"+  1 ,5","+  2,5","+  1,5",null,"1 sur la feuille",null,"4  Maxi / terrain     "]
["FID",4,"NDIAYE","I",15,"","",null,null,"F",1,"ETAVARD-GLEMP","A",7,null,null,null,null,null,null,"si cartes de couleurs",null,null,null,null,null,"et terrain",null," (5 sur la feuille)"]
["N",2,"OUAR","N",19,"","",null,null,null,null,null,null,8,null," Nationale 2",null,null,15,null,"Maxi 19 pts",null,"+  1,5","+  2,5","+  1,5","+  0,5","2 sur la feuille",null,"4  Maxi / terrain     "]
["F",4.5,"BLAIS","M",20,"","",null,null,null,null,null,null,9,null,null,null,null,null,null,"si cartes de couleurs",null,null,null,null,null,"2 sur le terrain",null," (5 sur la feuille)"]
["ET",4,"BADACHE","H",21,1,"",null,null,null,null,null,null,10,null," Nationale 3",null,null,15.5,null,null,null,"+  1,5","+  2,5","+  1,5","+  0,5"]
[null,null,null,null,null,"","",null,null,null,null,null,null,11,null,null,null,null,"Si 16pts début match-handicap de 10pts",null,"Maxi 19 pts",null,null,null,null,null,"2 sur la feuille",null,"4 Maxi / terrain"]
[null,null,null,null,null,"","",null,null,null,null,null,null,12,null,null,null,null,null,null,"si cartes de couleurs",null,null,null,null,null,"2 sur le terrain",null," (5 sur la feuille)"]
[null,null,null,null,null,"","",null,null,"N",4,"ETAVARD","F",13]
[null,null,null,null,null,"","",null,null,null,null,null,null,14,null,"Inscrire dans la colonne de gauche les \"Statuts\" des joueurs de l'équipe"]
[null,null,null,null,null,"","","",null,"FID",4,"NDIAYE","I",15,null,"J",null,null,"Pour les cartes Vertes",null,null,null,"Jeune joueur (U19 en Elite Nationale Bastide Médical)"]
[null,null,null,null,null,"","","",null,null,null,null,null,16,null,null,null,null,null,null,null,null,"Joueur débutant, sélectionnable en Equipe de France"]
[null,null,null,null,null,"","","",null,null,null,null,null,10,null,null,null,null,null,null,null,null,"seulement (attention à la date de validité juqu'à 22 ans révolu)"]
[null,null,null,null,null,"","",null,null,null,null,null,null,18,null,"JF",null,null,"Pour les cartes Jaunes",null,null,null,"Jeune joueuse (U19 en Elite Nationale Bastide Médical)"]
[null,null,null,null,null,"","","",null,"N",2,"OUAR","N",19,null,null,null,null,null,null,null,null,"Joueuse débutante, sélectionnable en Equipe de France"]
[null,null,null,null,null,"","",null,null,"F",4.5,"BLAIS","M",20,null,null,null,null,null,null,null,null,"seulement (attention à la date de validité juqu' à 22 ans révolu)"]
[null,null,null,null,null,"","",null,null,"ET",4,"BADACHE","H",21,null,"F ou FET",null,null,"Pour les cartes roses",null,null,null,"Pour les femmes ou femmes étrangères <5pts  (Bonus 1,5 pts)"]
[null,null,null,null,null,"","",null,null,null,null,null,null,null,null,"En Nationale 2 et 3 uniquement (joueuses et joueurs de plus de 55 ans)"]
[null,null,null,null,null,"","",null,null,null,null,null,null,null,null,"S",null,null,"Pour les hommes séniors",null,null,null," Français ou Etrangers (Bonus de 0,5pt)"]
[null,null,null,null,null,null,null,null,null,null,null,null,null,null,null,"FS",null,null,"   Pour les femmes seniors",null,null,null," (Bonus 2pts)      "]
[" Joueurs-joueuses valides de l'équipe",null,null,null,null,null,null,null,null,null,null,null,null,null,null,"JS",null,null," Pour les jeunes hommes séniors",null,null,null," Débutants  (Bonus 2pts)  validité (<3pts 2ans)       ( > 3pts 1 an)"]
[{"$f":"IF(G31=0,\"\",IF(G31>1,\"Trop de valides sur le terrain\",\"OK\"))","v":""},null,null,null,null,null,null,null,null,null,null,null,null,null,null,"JFS",null,null," Pour les jeunes femmes séniors",null,null,null," Débutantes  (Bonus 3pts)  validité (<3pts 2ans)     ( > 3pts 1 an)"]
[null,null,null,null,null,null,null,null,null,null,null,null,null,null,null,"Autres possibilités (sans Bonus)"]
[null,null,null,null,null,null,null,null,null,null,null,null,null,null,null,"ET",null,null,"Pour un joueur étranger"]
[null,null,null,null,null,{"$f":"SUM(F6:F28)","v":1},{"$f":"SUM(G6:G30)","v":0},null,null,null,null,null,null,null,null,"FID",null,null,"Pour un joueur fidèle"]
[null,null,null,null,null,null,null,null,null,null,null,null,null,null,null,"N",null,null,"Pour tous joueurs sans symbole sur la carte de classification"]

{"sheet":"LE CANNET","index":15,"n_rows":32,"n_cols":29,"rows_kept":32,"cut":false,"hidden":false,"merged":[[30,15,30,17],[31,15,31,17],[8,28,8,29],[9,15,10,17],[9,18,10,19],[9,22,10,22],[9,23,10,23],[9,24,10,24],[9,25,10,25],[9,28,9,29],[10,28,10,29],[7,15,8,17],[7,18,8,19],[7,22,8,22],[7,23,8,23],[7,24,8,24],[1,9,1,13],[1,1,2,3],[1,0,2,0],[2,9,2,13],[0,15,0,29],[1,22,3,22],[1,23,3,23],[1,24,3,24],[1,25,3,25],[1,26,3,27],[1,28,3,29],[5,28,6,29],[5,15,6,17],[5,18,6,19],[5,22,6,22],[5,23,6,23],[5,24,6,24],[5,20,5,21],[6,20,6,21],[7,28,7,29],[7,26,7,27],[8,26,8,27],[9,26,9,27],[10,26,10,27],[11,18,11,19],[11,22,14,22],[12,18,14,19],[11,20,11,21],[22,15,22,17],[11,15,14,17],[12,20,12,21],[26,0,26,4],[27,0,27,4],[16,15,18,17],[16,18,18,21],[27,15,27,17],[19,15,21,17],[19,18,21,21],[22,18,22,21],[23,15,23,29],[7,20,7,21],[8,20,8,21],[11,26,11,27],[5,26,5,27],[6,26,6,27],[11,23,14,23],[11,24,14,24],[11,25,14,25],[29,15,29,17],[13,20,13,21],[13,26,13,27],[13,28,13,29],[14,20,14,21],[14,26,14,27],[14,28,14,29],[15,15,15,29],[24,15,24,17],[25,15,25,17],[26,15,26,17],[28,15,28,29],[11,28,11,29],[12,26,12,27],[12,28,12,29],[9,20,9,21],[10,20,10,21]]}
["LE CANNET",null,null,null,null,null,null,null,null,null,null,null,null,null,null,"Saison 2023-2024"]
[null,"Joueur(es) participant à la rencontre",null,null,null,null,null,null,null,"Saisir votre liste complète en MAJUSCULES ",null,null,null,null,null,null,null,null,null,null,null,null,"Carte Verte","Carte Jaune","Carte Rose","Carte Bleue","5,0 Val",null,"Non Sélectionnables en EDF (hors Fidet)"]
[null,null,null,null,null,null,null,null,null,"Joueurs(es) qualifié(es) saison 2023 -2024",null,null,null,null,null,null,null,null,"Avec une date de validité"]
[]
["Statuts","Classif.","          Noms      /    Prénoms",null,"Numéros","ET","VALIDE",null,null,"Statuts","Classif.","          Noms      /    Prénoms",null,"Numéros"]
[null,null,null,null,null,{"$f":"IF(A6=\"ET\",1,\"\")","v":""},{"$f":"IF(B6=5,1,\"\")","v":""},null,null,"N",4,"LEBLANC","W",4,null,"Elite Nationale Bastide Médical",null,null,14.5,null,"Maxi 17,5 pts",null,"+  1 ","+  2","+  1,5",null,"1 sur la feuille",null,"Pas de limite"]
[null,null,null,null,null,{"$f":"IF(A7=\"ET\",1,\"\")","v":""},{"$f":"IF(B7=5,1,\"\")","v":""},null,null,null,null,null,null,5,null,null,null,null,null,null,"si cartes de couleurs",null,null,null,null,null,"et terrain"]
[null,null,null,null,null,{"$f":"IF(A8=\"ET\",1,\"\")","v":""},{"$f":"IF(B8=5,1,\"\")","v":""},null,null,"ET",1.5,"MACEK","A",6,null," Nationale 1",null,null,14.5,null,"Maxi 17,5 pts",null,"+  1 ,5","+  2,5","+  1,5",null,"1 sur la feuille",null,"4  Maxi / terrain     "]
[null,null,null,null,null,"","",null,null,"N",1,"KELLER","S",7,null,null,null,null,null,null,"si cartes de couleurs",null,null,null,null,null,"et terrain",null," (5 sur la feuille)"]
[null,null,null,null,null,"","",null,null,null,null,null,null,8,null," Nationale 2",null,null,15,null,"Maxi 19 pts",null,"+  1,5","+  2,5","+  1,5","+  0,5","2 sur la feuille",null,"4  Maxi / terrain     "]
[null,null,null,null,null,"","",null,null,"N",3,"ROA","L",9,null,null,null,null,null,null,"si cartes de couleurs",null,null,null,null,null,"2 sur le terrain",null," (5 sur la feuille)"]
[null,null,null,null,null,"","",null,null,"N",2.5,"MEKKAZNI","K",10,null," Nationale 3",null,null,15.5,null,null,null,"+  1,5","+  2,5","+  1,5","+  0,5"]
[null,null,null,null,null,"","",null,null,null,null,null,null,11,null,null,null,null,"Si 16pts début match-handicap de 10pts",null,"Maxi 19 pts",null,null,null,null,null,"2 sur la feuille",null,"4 Maxi / terrain"]
[null,null,null,null,null,"","",null,null,null,null,null,null,12,null,null,null,null,null,null,"si cartes de couleurs",null,null,null,null,null,"2 sur le terrain",null," (5 sur la feuille)"]
[null,null,null,null,null,"","",null,null,null,null,null,null,13]
[null,null,null,null,null,"","",null,null,"N",1,"DELATTRE","T",14,null,"Inscrire dans la colonne de gauche les \"Statuts\" des joueurs de l'équipe"]
[null,null,null,null,null,"","","",null,null,null,null,null,15,null,"J",null,null,"Pour les cartes Vertes",null,null,null,"Jeune joueur (U19 en Elite Nationale Bastide Médical)"]
[null,null,null,null,null,"","","",null,null,null,null,null,16,null,null,null,null,null,null,null,null,"Joueur débutant, sélectionnable en Equipe de France"]
[null,null,null,null,null,"","","",null,"N",3.5,"BELAID","H",17,null,null,null,null,null,null,null,null,"seulement (attention à la date de validité juqu'à 22 ans révolu)"]
[null,null,null,null,null,"","",null,null,"ET",2.5,"FERNANDEZ","Y",20,null,"JF",null,null,"Pour les cartes Jaunes",null,null,null,"Jeune joueuse (U19 en Elite Nationale Bastide Médical)"]
[null,null,null,null,null,"","","",null,null,null,null,null,21,null,null,null,null,null,null,null,null,"Joueuse débutante, sélectionnable en Equipe de France"]
[null,null,null,null,null,"","",null,null,"ET",2.5,"TOSCANO","Y",22,null,null,null,null,null,null,null,null,"seulement (attention à la date de validité juqu' à 22 ans révolu)"]
[null,null,null,null,null,"","",null,null,"N",3,"CARLIER","C",25,null,"F ou FET",null,null,"Pour les cartes roses",null,null,null,"Pour les femmes ou femmes étrangères <5pts  (Bonus 1,5 pts)"]
[null,null,null,null,null,"","",null,null,null,null,null,null,30,null,"En Nationale 2 et 3 uniquement (joueuses et joueurs de plus de 55 ans)"]
[null,null,null,null,null,"","",null,null,"ET",3.5,"MAATAOUI","R",99,null,"S",null,null,"Pour les hommes séniors",null,null,null," Français ou Etrangers (Bonus de 0,5pt)"]
[null,null,null,null,null,null,null,null,null,null,null,null,null,null,null,"FS",null,null,"   Pour les femmes seniors",null,null,null," (Bonus 2pts)      "]
[" Joueurs-joueuses valides de l'équipe",null,null,null,null,null,null,null,null,null,null,null,null,null,null,"JS",null,null," Pour les jeunes hommes séniors",null,null,null," Débutants  (Bonus 2pts)  validité (<3pts 2ans)       ( > 3pts 1 an)"]
[{"$f":"IF(G31=0,\"\",IF(G31>1,\"Trop de valides sur le terrain\",\"OK\"))","v":""},null,null,null,null,null,null,null,null,null,null,null,null,null,null,"JFS",null,null," Pour les jeunes femmes séniors",null,null,null," Débutantes  (Bonus 3pts)  validité (<3pts 2ans)     ( > 3pts 1 an)"]
[null,null,null,null,null,null,null,null,null,null,null,null,null,null,null,"Autres possibilités (sans Bonus)"]
[null,null,null,null,null,null,null,null,null,null,null,null,null,null,null,"ET",null,null,"Pour un joueur étranger"]
[null,null,null,null,null,{"$f":"SUM(F6:F28)","v":0},{"$f":"SUM(G6:G30)","v":0},null,null,null,null,null,null,null,null,"FID",null,null,"Pour un joueur fidèle"]
[null,null,null,null,null,null,null,null,null,null,null,null,null,null,null,"N",null,null,"Pour tous joueurs sans symbole sur la carte de classification"]

{"sheet":"LE PUY","index":16,"n_rows":32,"n_cols":29,"rows_kept":32,"cut":false,"hidden":false,"merged":[[30,15,30,17],[31,15,31,17],[8,28,8,29],[9,15,10,17],[9,18,10,19],[9,22,10,22],[9,23,10,23],[9,24,10,24],[9,25,10,25],[9,28,9,29],[10,28,10,29],[7,15,8,17],[7,18,8,19],[7,22,8,22],[7,23,8,23],[7,24,8,24],[1,0,2,0],[1,1,2,3],[1,9,1,13],[2,9,2,13],[0,15,0,29],[1,22,3,22],[1,23,3,23],[1,24,3,24],[1,25,3,25],[1,26,3,27],[1,28,3,29],[5,28,6,29],[5,15,6,17],[5,18,6,19],[5,22,6,22],[5,23,6,23],[5,24,6,24],[5,20,5,21],[6,20,6,21],[7,28,7,29],[7,26,7,27],[8,26,8,27],[9,26,9,27],[10,26,10,27],[11,18,11,19],[11,22,14,22],[12,18,14,19],[11,20,11,21],[22,15,22,17],[11,15,14,17],[12,20,12,21],[26,0,26,4],[27,0,27,4],[16,15,18,17],[16,18,18,21],[27,15,27,17],[19,15,21,17],[19,18,21,21],[22,18,22,21],[23,15,23,29],[7,20,7,21],[8,20,8,21],[11,26,11,27],[5,26,5,27],[6,26,6,27],[11,23,14,23],[11,24,14,24],[11,25,14,25],[29,15,29,17],[13,20,13,21],[13,26,13,27],[13,28,13,29],[14,20,14,21],[14,26,14,27],[14,28,14,29],[15,15,15,29],[24,15,24,17],[25,15,25,17],[26,15,26,17],[28,15,28,29],[11,28,11,29],[12,26,12,27],[12,28,12,29],[9,20,9,21],[10,20,10,21]]}
["LE PUY",null,null,null,null,null,null,null,null,null,null,null,null,null,null,"Saison 2023-2024"]
[null,"Joueur(es) participant à la rencontre",null,null,null,null,null,null,null,"Saisir votre liste complète en MAJUSCULES ",null,null,null,null,null,null,null,null,null,null,null,null,"Carte Verte","Carte Jaune","Carte Rose","Carte Bleue","5,0 Val",null,"Non Sélectionnables en EDF (hors Fidet)"]
[null,null,null,null,null,null,null,null,null,"Joueurs(es) qualifié(es) saison 2023 -2024",null,null,null,null,null,null,null,null,"Avec une date de validité"]
[]
["Statuts","Classif.","          Noms      /    Prénoms",null,"Numéros","ET","VALIDE",null,null,"Statuts","Classif.","          Noms      /    Prénoms",null,"Numéros"]
[null,null,null,null,null,{"$f":"IF(A6=\"ET\",1,\"\")","v":""},{"$f":"IF(B6=5,1,\"\")","v":""},null,null,"ET",2,"BEGINSKIS",5,2,null,"Elite Nationale Bastide Médical",null,null,14.5,null,"Maxi 17,5 pts",null,"+  1 ","+  2","+  1,5",null,"1 sur la feuille",null,"Pas de limite"]
[null,null,null,null,null,{"$f":"IF(A7=\"ET\",1,\"\")","v":""},{"$f":"IF(B7=5,1,\"\")","v":""},null,null,null,null,null,null,3,null,null,null,null,null,null,"si cartes de couleurs",null,null,null,null,null,"et terrain"]
[null,null,null,null,null,{"$f":"IF(A8=\"ET\",1,\"\")","v":""},{"$f":"IF(B8=5,1,\"\")","v":""},null,null,"N",2.5,"BAYLE","R",4,null," Nationale 1",null,null,14.5,null,"Maxi 17,5 pts",null,"+  1 ,5","+  2,5","+  1,5",null,"1 sur la feuille",null,"4  Maxi / terrain     "]
[null,null,null,null,null,"","",null,null,null,null,null,null,5,null,null,null,null,null,null,"si cartes de couleurs",null,null,null,null,null,"et terrain",null," (5 sur la feuille)"]
[null,null,null,null,null,"","",null,null,"J",2,"PERSET","Y",6,null," Nationale 2",null,null,15,null,"Maxi 19 pts",null,"+  1,5","+  2,5","+  1,5","+  0,5","2 sur la feuille",null,"4  Maxi / terrain     "]
[null,null,null,null,null,"","",null,null,"ET",4.5,"CONTRERAS","L",7,null,null,null,null,null,null,"si cartes de couleurs",null,null,null,null,null,"2 sur le terrain",null," (5 sur la feuille)"]
[null,null,null,null,null,"","",null,null,"ET",1,"SIAURUSAITIS","E",8,null," Nationale 3",null,null,15.5,null,null,null,"+  1,5","+  2,5","+  1,5","+  0,5"]
[null,null,null,null,null,"","",null,null,"ET",4.5,"HIGGINS","C",9,null,null,null,null,"Si 16pts début match-handicap de 10pts",null,"Maxi 19 pts",null,null,null,null,null,"2 sur la feuille",null,"4 Maxi / terrain"]
[null,null,null,null,null,"","",null,null,null,null,null,null,10,null,null,null,null,null,null,"si cartes de couleurs",null,null,null,null,null,"2 sur le terrain",null," (5 sur la feuille)"]
[null,null,null,null,null,"","",null,null,"N",3,"MARIANI","A",11]
[null,null,null,null,null,"","",null,null,"ET",4,"GHARIBLOO","M",12,null,"Inscrire dans la colonne de gauche les \"Statuts\" des joueurs de l'équipe"]
[null,null,null,null,null,"","","",null,"ET",3.5,"ZIDI","O",13,null,"J",null,null,"Pour les cartes Vertes",null,null,null,"Jeune joueur (U19 en Elite Nationale Bastide Médical)"]
[null,null,null,null,null,"","","",null,null,null,null,null,14,null,null,null,null,null,null,null,null,"Joueur débutant, sélectionnable en Equipe de France"]
[null,null,null,null,null,"","","",null,"ET",1.5,"GABRANOVS","K",15,null,null,null,null,null,null,null,null,"seulement (attention à la date de validité juqu'à 22 ans révolu)"]
[null,null,null,null,null,"","",null,null,null,null,null,null,16,null,"JF",null,null,"Pour les cartes Jaunes",null,null,null,"Jeune joueuse (U19 en Elite Nationale Bastide Médical)"]
[null,null,null,null,null,"","","",null,null,null,null,null,17,null,null,null,null,null,null,null,null,"Joueuse débutante, sélectionnable en Equipe de France"]
[null,null,null,null,null,"","",null,null,null,null,null,null,18,null,null,null,null,null,null,null,null,"seulement (attention à la date de validité juqu' à 22 ans révolu)"]
[null,null,null,null,null,"","",null,null,null,null,null,null,19,null,"F ou FET",null,null,"Pour les cartes roses",null,null,null,"Pour les femmes ou femmes étrangères <5pts  (Bonus 1,5 pts)"]
[null,null,null,null,null,"","",null,null,null,null,null,null,20,null,"En Nationale 2 et 3 uniquement (joueuses et joueurs de plus de 55 ans)"]
[null,null,null,null,null,"","",null,null,null,null,null,null,null,null,"S",null,null,"Pour les hommes séniors",null,null,null," Français ou Etrangers (Bonus de 0,5pt)"]
[null,null,null,null,null,null,null,null,null,null,null,null,null,null,null,"FS",null,null,"   Pour les femmes seniors",null,null,null," (Bonus 2pts)      "]
[" Joueurs-joueuses valides de l'équipe",null,null,null,null,null,null,null,null,null,null,null,null,null,null,"JS",null,null," Pour les jeunes hommes séniors",null,null,null," Débutants  (Bonus 2pts)  validité (<3pts 2ans)       ( > 3pts 1 an)"]
[{"$f":"IF(G31=0,\"\",IF(G31>1,\"Trop de valides sur le terrain\",\"OK\"))","v":""},null,null,null,null,null,null,null,null,null,null,null,null,null,null,"JFS",null,null," Pour les jeunes femmes séniors",null,null,null," Débutantes  (Bonus 3pts)  validité (<3pts 2ans)     ( > 3pts 1 an)"]
[null,null,null,null,null,null,null,null,null,null,null,null,null,null,null,"Autres possibilités (sans Bonus)"]
[null,null,null,null,null,null,null,null,null,null,null,null,null,null,null,"ET",null,null,"Pour un joueur étranger"]
[null,null,null,null,null,{"$f":"SUM(F6:F28)","v":0},{"$f":"SUM(G6:G30)","v":0},null,null,null,null,null,null,null,null,"FID",null,null,"Pour un joueur fidèle"]
[null,null,null,null,null,null,null,null,null,null,null,null,null,null,null,"N",null,null,"Pour tous joueurs sans symbole sur la carte de classification"]

{"sheet":"MARSEILLE","index":17,"n_rows":32,"n_cols":29,"rows_kept":32,"cut":false,"hidden":false,"merged":[[30,15,30,17],[31,15,31,17],[8,28,8,29],[9,15,10,17],[9,18,10,19],[9,22,10,22],[9,23,10,23],[9,24,10,24],[9,25,10,25],[9,28,9,29],[10,28,10,29],[7,15,8,17],[7,18,8,19],[7,22,8,22],[7,23,8,23],[7,24,8,24],[1,0,2,0],[1,1,2,3],[1,9,1,13],[2,9,2,13],[0,15,0,29],[1,22,3,22],[1,23,3,23],[1,24,3,24],[1,25,3,25],[1,26,3,27],[1,28,3,29],[5,28,6,29],[5,15,6,17],[5,18,6,19],[5,22,6,22],[5,23,6,23],[5,24,6,24],[5,20,5,21],[6,20,6,21],[7,28,7,29],[7,26,7,27],[8,26,8,27],[9,26,9,27],[10,26,10,27],[11,18,11,19],[11,22,14,22],[12,18,14,19],[11,20,11,21],[22,15,22,17],[11,15,14,17],[12,20,12,21],[26,0,26,4],[27,0,27,4],[16,15,18,17],[16,18,18,21],[27,15,27,17],[19,15,21,17],[19,18,21,21],[22,18,22,21],[23,15,23,29],[7,20,7,21],[8,20,8,21],[11,26,11,27],[5,26,5,27],[6,26,6,27],[11,23,14,23],[11,24,14,24],[11,25,14,25],[29,15,29,17],[13,20,13,21],[13,26,13,27],[13,28,13,29],[14,20,14,21],[14,26,14,27],[14,28,14,29],[15,15,15,29],[24,15,24,17],[25,15,25,17],[26,15,26,17],[28,15,28,29],[11,28,11,29],[12,26,12,27],[12,28,12,29],[9,20,9,21],[10,20,10,21]]}
["MARSEILLE",null,null,null,null,null,null,null,null,null,null,null,null,null,null,"Saison 2023-2024"]
[null,"Joueur(es) participant à la rencontre",null,null,null,null,null,null,null,"Saisir votre liste complète en MAJUSCULES ",null,null,null,null,null,null,null,null,null,null,null,null,"Carte Verte","Carte Jaune","Carte Rose","Carte Bleue","5,0 Val",null,"Non Sélectionnables en EDF (hors Fidet)"]
[null,null,null,null,null,null,null,null,null,"Joueurs(es) qualifié(es) saison 2023 -2024",null,null,null,null,null,null,null,null,"Avec une date de validité"]
[]
["Statuts","Classif.","          Noms      /    Prénoms",null,"Numéros","ET","VALIDE",null,null,"Statuts","Classif.","          Noms      /    Prénoms",null,"Numéros"]
[null,null,null,null,null,{"$f":"IF(A6=\"ET\",1,\"\")","v":""},{"$f":"IF(B6=5,1,\"\")","v":""},null,null,"J",1,"TALBOT","J",0,null,"Elite Nationale Bastide Médical",null,null,14.5,null,"Maxi 17,5 pts",null,"+  1 ","+  2","+  1,5",null,"1 sur la feuille",null,"Pas de limite"]
[null,null,null,null,null,{"$f":"IF(A7=\"ET\",1,\"\")","v":""},{"$f":"IF(B7=5,1,\"\")","v":""},null,null,"ET",4.5,"QUINTERO","J",1,null,null,null,null,null,null,"si cartes de couleurs",null,null,null,null,null,"et terrain"]
[null,null,null,null,null,{"$f":"IF(A8=\"ET\",1,\"\")","v":""},{"$f":"IF(B8=5,1,\"\")","v":""},null,null,"ET",1,"LAZARO","J",4,null," Nationale 1",null,null,14.5,null,"Maxi 17,5 pts",null,"+  1 ,5","+  2,5","+  1,5",null,"1 sur la feuille",null,"4  Maxi / terrain     "]
[null,null,null,null,null,"","",null,null,"ET",2.5,"GRANADOS","J",5,null,null,null,null,null,null,"si cartes de couleurs",null,null,null,null,null,"et terrain",null," (5 sur la feuille)"]
[null,null,null,null,null,"","",null,null,null,null,null,null,6,null," Nationale 2",null,null,15,null,"Maxi 19 pts",null,"+  1,5","+  2,5","+  1,5","+  0,5","2 sur la feuille",null,"4  Maxi / terrain     "]
[null,null,null,null,null,"","",null,null,null,null,null,null,7,null,null,null,null,null,null,"si cartes de couleurs",null,null,null,null,null,"2 sur le terrain",null," (5 sur la feuille)"]
[null,null,null,null,null,"","",null,null,null,null,null,null,8,null," Nationale 3",null,null,15.5,null,null,null,"+  1,5","+  2,5","+  1,5","+  0,5"]
[null,null,null,null,null,"","",null,null,"ET",1.5,"LAZARO","J",9,null,null,null,null,"Si 16pts début match-handicap de 10pts",null,"Maxi 19 pts",null,null,null,null,null,"2 sur la feuille",null,"4 Maxi / terrain"]
[null,null,null,null,null,"","",null,null,null,null,null,null,10,null,null,null,null,null,null,"si cartes de couleurs",null,null,null,null,null,"2 sur le terrain",null," (5 sur la feuille)"]
[null,null,null,null,null,"","",null,null,null,null,null,null,11]
[null,null,null,null,null,"","",null,null,"N",3,"AMAH","K",12,null,"Inscrire dans la colonne de gauche les \"Statuts\" des joueurs de l'équipe"]
[null,null,null,null,null,"","","",null,null,null,null,null,13,null,"J",null,null,"Pour les cartes Vertes",null,null,null,"Jeune joueur (U19 en Elite Nationale Bastide Médical)"]
[null,null,null,null,null,"","","",null,"ET",1.5,"MANTILLA","J",14,null,null,null,null,null,null,null,null,"Joueur débutant, sélectionnable en Equipe de France"]
[null,null,null,null,null,"","","",null,null,null,null,null,15,null,null,null,null,null,null,null,null,"seulement (attention à la date de validité juqu'à 22 ans révolu)"]
[null,null,null,null,null,"","",null,null,null,null,null,null,18,null,"JF",null,null,"Pour les cartes Jaunes",null,null,null,"Jeune joueuse (U19 en Elite Nationale Bastide Médical)"]
[null,null,null,null,null,"","","",null,null,null,null,null,20,null,null,null,null,null,null,null,null,"Joueuse débutante, sélectionnable en Equipe de France"]
[null,null,null,null,null,"","",null,null,"ET",1,"BENMERRAH","A",21,null,null,null,null,null,null,null,null,"seulement (attention à la date de validité juqu' à 22 ans révolu)"]
[null,null,null,null,null,"","",null,null,"ET",2.5,"VARGAS","J",23,null,"F ou FET",null,null,"Pour les cartes roses",null,null,null,"Pour les femmes ou femmes étrangères <5pts  (Bonus 1,5 pts)"]
[null,null,null,null,null,"","",null,null,"ET",3,"ESCOBAR","J",24,null,"En Nationale 2 et 3 uniquement (joueuses et joueurs de plus de 55 ans)"]
[null,null,null,null,null,"","",null,null,"ET",2.5,"LOPEZ","J",29,null,"S",null,null,"Pour les hommes séniors",null,null,null," Français ou Etrangers (Bonus de 0,5pt)"]
[null,null,null,null,null,null,null,null,null,null,null,null,null,null,null,"FS",null,null,"   Pour les femmes seniors",null,null,null," (Bonus 2pts)      "]
[" Joueurs-joueuses valides de l'équipe",null,null,null,null,null,null,null,null,null,null,null,null,null,null,"JS",null,null," Pour les jeunes hommes séniors",null,null,null," Débutants  (Bonus 2pts)  validité (<3pts 2ans)       ( > 3pts 1 an)"]
[{"$f":"IF(G31=0,\"\",IF(G31>1,\"Trop de valides sur le terrain\",\"OK\"))","v":""},null,null,null,null,null,null,null,null,null,null,null,null,null,null,"JFS",null,null," Pour les jeunes femmes séniors",null,null,null," Débutantes  (Bonus 3pts)  validité (<3pts 2ans)     ( > 3pts 1 an)"]
[null,null,null,null,null,null,null,null,null,null,null,null,null,null,null,"Autres possibilités (sans Bonus)"]
[null,null,null,null,null,null,null,null,null,null,null,null,null,null,null,"ET",null,null,"Pour un joueur étranger"]
[null,null,null,null,null,{"$f":"SUM(F6:F28)","v":0},{"$f":"SUM(G6:G30)","v":0},null,null,null,null,null,null,null,null,"FID",null,null,"Pour un joueur fidèle"]
[null,null,null,null,null,null,null,null,null,null,null,null,null,null,null,"N",null,null,"Pour tous joueurs sans symbole sur la carte de classification"]

{"sheet":"MEAUX","index":18,"n_rows":32,"n_cols":29,"rows_kept":32,"cut":false,"hidden":false,"merged":[[30,15,30,17],[31,15,31,17],[8,28,8,29],[9,15,10,17],[9,18,10,19],[9,22,10,22],[9,23,10,23],[9,24,10,24],[9,25,10,25],[9,28,9,29],[10,28,10,29],[7,15,8,17],[7,18,8,19],[7,22,8,22],[7,23,8,23],[7,24,8,24],[1,0,2,0],[1,1,2,3],[1,9,1,13],[2,9,2,13],[0,15,0,29],[1,22,3,22],[1,23,3,23],[1,24,3,24],[1,25,3,25],[1,26,3,27],[1,28,3,29],[5,28,6,29],[5,15,6,17],[5,18,6,19],[5,22,6,22],[5,23,6,23],[5,24,6,24],[5,20,5,21],[6,20,6,21],[7,28,7,29],[7,26,7,27],[8,26,8,27],[9,26,9,27],[10,26,10,27],[11,18,11,19],[11,22,14,22],[12,18,14,19],[11,20,11,21],[22,15,22,17],[11,15,14,17],[12,20,12,21],[26,0,26,4],[27,0,27,4],[16,15,18,17],[16,18,18,21],[27,15,27,17],[19,15,21,17],[19,18,21,21],[22,18,22,21],[23,15,23,29],[7,20,7,21],[8,20,8,21],[11,26,11,27],[5,26,5,27],[6,26,6,27],[11,23,14,23],[11,24,14,24],[11,25,14,25],[29,15,29,17],[13,20,13,21],[13,26,13,27],[13,28,13,29],[14,20,14,21],[14,26,14,27],[14,28,14,29],[15,15,15,29],[24,15,24,17],[25,15,25,17],[26,15,26,17],[28,15,28,29],[11,28,11,29],[12,26,12,27],[12,28,12,29],[9,20,9,21],[10,20,10,21]]}
["MEAUX",null,null,null,null,null,null,null,null,null,null,null,null,null,null,"Saison 2023-2024"]
[null,"Joueur(es) participant à la rencontre",null,null,null,null,null,null,null,"Saisir votre liste complète en MAJUSCULES ",null,null,null,null,null,null,null,null,null,null,null,null,"Carte Verte","Carte Jaune","Carte Rose","Carte Bleue","5,0 Val",null,"Non Sélectionnables en EDF (hors Fidet)"]
[null,null,null,null,null,null,null,null,null,"Joueurs(es) qualifié(es) saison 2023 -2024",null,null,null,null,null,null,null,null,"Avec une date de validité"]
[]
["Statuts","Classif.","          Noms      /    Prénoms",null,"Numéros","ET","VALIDE",null,null,"Statuts","Classif.","          Noms      /    Prénoms",null,"Numéros"]
["N",1.5,"CAYOL","A",7,{"$f":"IF(A6=\"ET\",1,\"\")","v":""},{"$f":"IF(B6=5,1,\"\")","v":""},null,null,"J",3,"MAKOMA-MAOSO","D",4,null,"Elite Nationale Bastide Médical",null,null,14.5,null,"Maxi 17,5 pts",null,"+  1 ","+  2","+  1,5",null,"1 sur la feuille",null,"Pas de limite"]
["N",4,"EVANNO","S",9,{"$f":"IF(A7=\"ET\",1,\"\")","v":""},{"$f":"IF(B7=5,1,\"\")","v":""},null,null,"J",2,"MEDUS","K",5,null,null,null,null,null,null,"si cartes de couleurs",null,null,null,null,null,"et terrain"]
["N",2.5,"GOUTALI","S",11,{"$f":"IF(A8=\"ET\",1,\"\")","v":""},{"$f":"IF(B8=5,1,\"\")","v":""},null,null,"F",2,"RUBLER","AS",6,null," Nationale 1",null,null,14.5,null,"Maxi 17,5 pts",null,"+  1 ,5","+  2,5","+  1,5",null,"1 sur la feuille",null,"4  Maxi / terrain     "]
["N",4.5,"KHELAIFI","K",12,"","",null,null,"N",1.5,"CAYOL","A",7,null,null,null,null,null,null,"si cartes de couleurs",null,null,null,null,null,"et terrain",null," (5 sur la feuille)"]
["ET",3,"DE BOER","P",18,1,"",null,null,"ET",4.5,"BLAIR","Z",8,null," Nationale 2",null,null,15,null,"Maxi 19 pts",null,"+  1,5","+  2,5","+  1,5","+  0,5","2 sur la feuille",null,"4  Maxi / terrain     "]
["N",1.5,"ERRAOUI","S",15,"","",null,null,"N",4,"EVANNO","S",9,null,null,null,null,null,null,"si cartes de couleurs",null,null,null,null,null,"2 sur le terrain",null," (5 sur la feuille)"]
["N",1,"HENRIOT","E",21,"","",null,null,"N",1,"HENRIOT","E",10,null," Nationale 3",null,null,15.5,null,null,null,"+  1,5","+  2,5","+  1,5","+  0,5"]
["N",3,"MAKOMA-MAOSO","D",24,"","",null,null,"N",2.5,"GOUTALI","S",11,null,null,null,null,"Si 16pts début match-handicap de 10pts",null,"Maxi 19 pts",null,null,null,null,null,"2 sur la feuille",null,"4 Maxi / terrain"]
["N",2.5,"HARDOUIN","L",29,"","",null,null,"N",4.5,"KHELAIFI","K",12,null,null,null,null,null,null,"si cartes de couleurs",null,null,null,null,null,"2 sur le terrain",null," (5 sur la feuille)"]
["ET",4.5,"BLAIR","Z",77,1,"",null,null,"ET",3,"DE BOER","P",13]
[null,null,null,null,null,"","",null,null,null,null,null,null,14,null,"Inscrire dans la colonne de gauche les \"Statuts\" des joueurs de l'équipe"]
[null,null,null,null,null,"","","",null,null,null,null,null,15,null,"J",null,null,"Pour les cartes Vertes",null,null,null,"Jeune joueur (U19 en Elite Nationale Bastide Médical)"]
[null,null,null,null,null,"","","",null,null,null,null,null,16,null,null,null,null,null,null,null,null,"Joueur débutant, sélectionnable en Equipe de France"]
[null,null,null,null,null,"","","",null,null,null,null,null,17,null,null,null,null,null,null,null,null,"seulement (attention à la date de validité juqu'à 22 ans révolu)"]
[null,null,null,null,null,"","",null,null,"N",1.5,"ERRAOUI","S",18,null,"JF",null,null,"Pour les cartes Jaunes",null,null,null,"Jeune joueuse (U19 en Elite Nationale Bastide Médical)"]
[null,null,null,null,null,"","","",null,null,null,null,null,19,null,null,null,null,null,null,null,null,"Joueuse débutante, sélectionnable en Equipe de France"]
[null,null,null,null,null,"","",null,null,null,null,null,null,20,null,null,null,null,null,null,null,null,"seulement (attention à la date de validité juqu' à 22 ans révolu)"]
[null,null,null,null,null,"","",null,null,"N",2.5,"HARDOUIN","L",27,null,"F ou FET",null,null,"Pour les cartes roses",null,null,null,"Pour les femmes ou femmes étrangères <5pts  (Bonus 1,5 pts)"]
[null,null,null,null,null,"","",null,null,null,null,null,null,null,null,"En Nationale 2 et 3 uniquement (joueuses et joueurs de plus de 55 ans)"]
[null,null,null,null,null,"","",null,null,null,null,null,null,null,null,"S",null,null,"Pour les hommes séniors",null,null,null," Français ou Etrangers (Bonus de 0,5pt)"]
[null,null,null,null,null,null,null,null,null,null,null,null,null,null,null,"FS",null,null,"   Pour les femmes seniors",null,null,null," (Bonus 2pts)      "]
[" Joueurs-joueuses valides de l'équipe",null,null,null,null,null,null,null,null,null,null,null,null,null,null,"JS",null,null," Pour les jeunes hommes séniors",null,null,null," Débutants  (Bonus 2pts)  validité (<3pts 2ans)       ( > 3pts 1 an)"]
[{"$f":"IF(G31=0,\"\",IF(G31>1,\"Trop de valides sur le terrain\",\"OK\"))","v":""},null,null,null,null,null,null,null,null,null,null,null,null,null,null,"JFS",null,null," Pour les jeunes femmes séniors",null,null,null," Débutantes  (Bonus 3pts)  validité (<3pts 2ans)     ( > 3pts 1 an)"]
[null,null,null,null,null,null,null,null,null,null,null,null,null,null,null,"Autres possibilités (sans Bonus)"]
[null,null,null,null,null,null,null,null,null,null,null,null,null,null,null,"ET",null,null,"Pour un joueur étranger"]
[null,null,null,null,null,{"$f":"SUM(F6:F28)","v":2},{"$f":"SUM(G6:G30)","v":0},null,null,null,null,null,null,null,null,"FID",null,null,"Pour un joueur fidèle"]
[null,null,null,null,null,null,null,null,null,null,null,null,null,null,null,"N",null,null,"Pour tous joueurs sans symbole sur la carte de classification"]

{"sheet":"TOULOUSE","index":19,"n_rows":32,"n_cols":29,"rows_kept":32,"cut":false,"hidden":false,"merged":[[30,15,30,17],[31,15,31,17],[8,28,8,29],[9,15,10,17],[9,18,10,19],[9,22,10,22],[9,23,10,23],[9,24,10,24],[9,25,10,25],[9,28,9,29],[10,28,10,29],[7,15,8,17],[7,18,8,19],[7,22,8,22],[7,23,8,23],[7,24,8,24],[1,0,2,0],[1,1,2,3],[1,9,1,13],[2,9,2,13],[0,15,0,29],[1,22,3,22],[1,23,3,23],[1,24,3,24],[1,25,3,25],[1,26,3,27],[1,28,3,29],[5,28,6,29],[5,15,6,17],[5,18,6,19],[5,22,6,22],[5,23,6,23],[5,24,6,24],[5,20,5,21],[6,20,6,21],[7,28,7,29],[7,26,7,27],[8,26,8,27],[9,26,9,27],[10,26,10,27],[11,18,11,19],[11,22,14,22],[12,18,14,19],[11,20,11,21],[22,15,22,17],[11,15,14,17],[12,20,12,21],[26,0,26,4],[27,0,27,4],[16,15,18,17],[16,18,18,21],[27,15,27,17],[19,15,21,17],[19,18,21,21],[22,18,22,21],[23,15,23,29],[7,20,7,21],[8,20,8,21],[11,26,11,27],[5,26,5,27],[6,26,6,27],[11,23,14,23],[11,24,14,24],[11,25,14,25],[29,15,29,17],[13,20,13,21],[13,26,13,27],[13,28,13,29],[14,20,14,21],[14,26,14,27],[14,28,14,29],[15,15,15,29],[24,15,24,17],[25,15,25,17],[26,15,26,17],[28,15,28,29],[11,28,11,29],[12,26,12,27],[12,28,12,29],[9,20,9,21],[10,20,10,21]]}
["TOULOUSE",null,null,null,null,null,null,null,null,null,null,null,null,null,null,"Saison 2023-2024"]
[null,"Joueur(es) participant à la rencontre",null,null,null,null,null,null,null,"Saisir votre liste complète en MAJUSCULES ",null,null,null,null,null,null,null,null,null,null,null,null,"Carte Verte","Carte Jaune","Carte Rose","Carte Bleue","5,0 Val",null,"Non Sélectionnables en EDF (hors Fidet)"]
[null,null,null,null,null,null,null,null,null,"Joueurs(es) qualifié(es) saison 2023 -2024",null,null,null,null,null,null,null,null,"Avec une date de validité"]
[]
["Statuts","Classif.","          Noms      /    Prénoms",null,"Numéros","ET","VALIDE",null,null,"Statuts","Classif.","          Noms      /    Prénoms",null,"Numéros"]
["F",2.5,"MENARD","E",4,{"$f":"IF(A6=\"ET\",1,\"\")","v":""},{"$f":"IF(B6=5,1,\"\")","v":""},null,null,"F",2.5,"MENARD","E",4,null,"Elite Nationale Bastide Médical",null,null,14.5,null,"Maxi 17,5 pts",null,"+  1 ","+  2","+  1,5",null,"1 sur la feuille",null,"Pas de limite"]
["J",4.5,"FAURES","T",7,{"$f":"IF(A7=\"ET\",1,\"\")","v":""},{"$f":"IF(B7=5,1,\"\")","v":""},null,null,null,null,null,null,5,null,null,null,null,null,null,"si cartes de couleurs",null,null,null,null,null,"et terrain"]
["N",2,"COURNEIL","J",8,{"$f":"IF(A8=\"ET\",1,\"\")","v":""},{"$f":"IF(B8=5,1,\"\")","v":""},null,null,null,null,null,null,6,null," Nationale 1",null,null,14.5,null,"Maxi 17,5 pts",null,"+  1 ,5","+  2,5","+  1,5",null,"1 sur la feuille",null,"4  Maxi / terrain     "]
["FID",4,"GUEDOUN","N",9,"","",null,null,"J",4.5,"FAURES","T",7,null,null,null,null,null,null,"si cartes de couleurs",null,null,null,null,null,"et terrain",null," (5 sur la feuille)"]
["N",3,"GALY","N",10,"","",null,null,"N",2,"COURNEIL","J",8,null," Nationale 2",null,null,15,null,"Maxi 19 pts",null,"+  1,5","+  2,5","+  1,5","+  0,5","2 sur la feuille",null,"4  Maxi / terrain     "]
["N",1,"LAFFONT","JP",11,"","",null,null,"FID",4,"GUEDOUN","N",9,null,null,null,null,null,null,"si cartes de couleurs",null,null,null,null,null,"2 sur le terrain",null," (5 sur la feuille)"]
["ET",2,"GALLARDO","F",12,1,"",null,null,"N",3,"GALY","N",10,null," Nationale 3",null,null,15.5,null,null,null,"+  1,5","+  2,5","+  1,5","+  0,5"]
["N",4.5,"ROUTABOUL","G",13,"","",null,null,"N",1,"LAFFONT","JP",11,null,null,null,null,"Si 16pts début match-handicap de 10pts",null,"Maxi 19 pts",null,null,null,null,null,"2 sur la feuille",null,"4 Maxi / terrain"]
["ET",4,"SOLORZANO","N",14,1,"",null,null,"ET",2,"GALLARDO","F",12,null,null,null,null,null,null,"si cartes de couleurs",null,null,null,null,null,"2 sur le terrain",null," (5 sur la feuille)"]
["FID",3.5,"AYACHE","B",15,"","",null,null,"N",4.5,"ROUTABOUL","G",13]
[null,null,null,null,null,"","",null,null,"ET",4,"SOLORZANO","N",14,null,"Inscrire dans la colonne de gauche les \"Statuts\" des joueurs de l'équipe"]
[null,null,null,null,null,"","","",null,"FID",3.5,"AYACHE","B",15,null,"J",null,null,"Pour les cartes Vertes",null,null,null,"Jeune joueur (U19 en Elite Nationale Bastide Médical)"]
[null,null,null,null,null,"","","",null,null,null,null,null,16,null,null,null,null,null,null,null,null,"Joueur débutant, sélectionnable en Equipe de France"]
[null,null,null,null,null,"","","",null,null,null,null,null,17,null,null,null,null,null,null,null,null,"seulement (attention à la date de validité juqu'à 22 ans révolu)"]
[null,null,null,null,null,"","",null,null,null,null,null,null,18,null,"JF",null,null,"Pour les cartes Jaunes",null,null,null,"Jeune joueuse (U19 en Elite Nationale Bastide Médical)"]
[null,null,null,null,null,"","","",null,null,null,null,null,19,null,null,null,null,null,null,null,null,"Joueuse débutante, sélectionnable en Equipe de France"]
[null,null,null,null,null,"","",null,null,null,null,null,null,20,null,null,null,null,null,null,null,null,"seulement (attention à la date de validité juqu' à 22 ans révolu)"]
[null,null,null,null,null,"","",null,null,null,null,null,null,null,null,"F ou FET",null,null,"Pour les cartes roses",null,null,null,"Pour les femmes ou femmes étrangères <5pts  (Bonus 1,5 pts)"]
[null,null,null,null,null,"","",null,null,null,null,null,null,null,null,"En Nationale 2 et 3 uniquement (joueuses et joueurs de plus de 55 ans)"]
[null,null,null,null,null,"","",null,null,"F",1,"DOUMESCHE ","F",31,null,"S",null,null,"Pour les hommes séniors",null,null,null," Français ou Etrangers (Bonus de 0,5pt)"]
[null,null,null,null,null,null,null,null,null,null,null,null,null,null,null,"FS",null,null,"   Pour les femmes seniors",null,null,null," (Bonus 2pts)      "]
[" Joueurs-joueuses valides de l'équipe",null,null,null,null,null,null,null,null,null,null,null,null,null,null,"JS",null,null," Pour les jeunes hommes séniors",null,null,null," Débutants  (Bonus 2pts)  validité (<3pts 2ans)       ( > 3pts 1 an)"]
[{"$f":"IF(G31=0,\"\",IF(G31>1,\"Trop de valides sur le terrain\",\"OK\"))","v":""},null,null,null,null,null,null,null,null,null,null,null,null,null,null,"JFS",null,null," Pour les jeunes femmes séniors",null,null,null," Débutantes  (Bonus 3pts)  validité (<3pts 2ans)     ( > 3pts 1 an)"]
[null,null,null,null,null,null,null,null,null,null,null,null,null,null,null,"Autres possibilités (sans Bonus)"]
[null,null,null,null,null,null,null,null,null,null,null,null,null,null,null,"ET",null,null,"Pour un joueur étranger"]
[null,null,null,null,null,{"$f":"SUM(F6:F28)","v":2},{"$f":"SUM(G6:G30)","v":0},null,null,null,null,null,null,null,null,"FID",null,null,"Pour un joueur fidèle"]
[null,null,null,null,null,null,null,null,null,null,null,null,null,null,null,"N",null,null,"Pour tous joueurs sans symbole sur la carte de classification"]

{"sheet":"BORDEAUX","index":20,"n_rows":32,"n_cols":29,"rows_kept":32,"cut":false,"hidden":false,"merged":[[23,15,23,29],[24,15,24,17],[25,15,25,17],[26,15,26,17],[1,0,2,0],[1,1,2,3],[1,9,1,13],[2,9,2,13],[5,15,6,17],[5,18,6,19],[5,22,6,22],[5,23,6,23],[5,20,5,21],[5,26,5,27],[5,24,6,24],[5,28,6,29],[7,15,8,17],[7,18,8,19],[7,22,8,22],[7,23,8,23],[0,15,0,29],[1,22,3,22],[1,23,3,23],[1,24,3,24],[1,25,3,25],[1,26,3,27],[1,28,3,29],[6,26,6,27],[7,20,7,21],[7,26,7,27],[7,24,8,24],[7,28,7,29],[8,28,8,29],[8,20,8,21],[8,26,8,27],[6,20,6,21],[9,15,10,17],[9,18,10,19],[9,22,10,22],[9,23,10,23],[10,20,10,21],[9,20,9,21],[9,26,9,27],[9,24,10,24],[9,25,10,25],[9,28,9,29],[10,28,10,29],[10,26,10,27],[11,15,14,17],[11,18,11,19],[11,22,14,22],[11,23,14,23],[12,18,14,19],[12,20,12,21],[13,20,13,21],[14,20,14,21],[11,20,11,21],[11,26,11,27],[11,24,14,24],[11,25,14,25],[11,28,11,29],[12,26,12,27],[12,28,12,29],[13,26,13,27],[13,28,13,29],[14,26,14,27],[14,28,14,29],[16,15,18,17],[16,18,18,21],[22,15,22,17],[15,15,15,29],[19,15,21,17],[19,18,21,21],[22,18,22,21],[30,15,30,17],[31,15,31,17],[29,0,29,4],[26,0,26,4],[27,0,27,4],[27,15,27,17],[28,0,28,4],[29,15,29,17],[28,15,28,29]]}
["BORDEAUX",null,null,null,null,null,null,null,null,null,null,null,null,null,null,"Saison 2023-2024"]
[null,"Joueur(es) participant à la rencontre",null,null,null,null,null,null,null,"Saisir votre liste complète en MAJUSCULES ",null,null,null,null,null,null,null,null,null,null,null,null,"Carte Verte","Carte Jaune","Carte Rose","Carte Bleue","5,0 Val",null,"Non Sélectionnables en EDF (hors Fidet)"]
[null,null,null,null,null,null,null,null,null,"Joueurs(es) qualifié(es) saison 2023 -2024",null,null,null,null,null,null,null,null,"Avec une date de validité"]
[]
["Statuts","Classif.","          Noms      /    Prénoms",null,"Numéros","ET","VALIDE",null,null,"Statuts","Classif.","          Noms      /    Prénoms",null,"Numéros"]
[null,null,null,null,null,{"$f":"IF(A6=\"ET\",1,\"\")","v":""},{"$f":"IF(B6=5,1,\"\")","v":""},null,null,null,null,null,null,4,null,"Elite Nationale Bastide Médical",null,null,14.5,null,"Maxi 17,5 pts",null,"+  1 ","+  2","+  1,5",null,"1 sur la feuille",null,"Pas de limite"]
[null,null,null,null,null,{"$f":"IF(A7=\"ET\",1,\"\")","v":""},{"$f":"IF(B7=5,1,\"\")","v":""},null,null,null,null,null,null,5,null,null,null,null,null,null,"si cartes de couleurs",null,null,null,null,null,"et terrain"]
[null,null,null,null,null,{"$f":"IF(A8=\"ET\",1,\"\")","v":""},{"$f":"IF(B8=5,1,\"\")","v":""},null,null,null,null,null,null,6,null," Nationale 1",null,null,14.5,null,"Maxi 17 ,5pts",null,"+  1 ,5","+  2,5","+  1,5",null,"1 sur la feuille",null,"4  Maxi / terrain     "]
[null,null,null,null,null,"","",null,null,null,null,null,null,7,null,null,null,null,null,null,"si cartes de couleurs",null,null,null,null,null,"et terrain",null," (5 sur la feuille)"]
[null,null,null,null,null,"","",null,null,null,null,null,null,8,null," Nationale 2",null,null,15,null,"Maxi 19 pts",null,"+  1,5","+  2,5","+  1,5","+  0,5","2 sur la feuille",null,"4  Maxi / terrain     "]
[null,null,null,null,null,"","",null,null,null,null,null,null,9,null,null,null,null,null,null,"si cartes de couleurs",null,null,null,null,null,"2 sur le terrain",null," (5 sur la feuille)"]
[null,null,null,null,null,"","",null,null,null,null,null,null,10,null," Nationale 3",null,null,15.5,null,null,null,"+  1,5","+  2,5","+  1,5","+  0,5"]
[null,null,null,null,null,"","",null,null,null,null,null,null,20,null,null,null,null,"Si 16pts début match-handicap de 10pts",null,"Maxi 19 pts",null,null,null,null,null,"2 sur la feuille",null,"4 Maxi / terrain"]
[null,null,null,null,null,"","",null,null,null,null,null,null,22,null,null,null,null,null,null,"si cartes de couleurs",null,null,null,null,null,"2 sur le terrain",null," (5 sur la feuille)"]
[null,null,null,null,null,"","",null,null,null,null,null,null,64]
[null,null,null,null,null,"","",null,null,null,null,null,null,99,null,"Inscrire dans la colonne de gauche les \"Statuts\" des joueurs de l'équipe"]
[null,null,null,null,null,"","","",null,null,null,null,null,15,null,"J",null,null,"Pour les cartes Vertes",null,null,null,"Jeune joueur (U19 en Elite Nationale Bastide Médical)"]
[null,null,null,null,null,"","","",null,null,null,null,null,16,null,null,null,null,null,null,null,null,"Joueur débutant, sélectionnable en Equipe de France"]
[null,null,null,null,null,"","","",null,null,null,null,null,17,null,null,null,null,null,null,null,null,"seulement (attention à la date de validité juqu'à 22 ans révolu)"]
[null,null,null,null,null,"","",null,null,null,null,null,null,18,null,"JF",null,null,"Pour les cartes Jaunes",null,null,null,"Jeune joueuse (U19 en Elite Nationale Bastide Médical)"]
[null,null,null,null,null,"","","",null,null,null,null,null,19,null,null,null,null,null,null,null,null,"Joueuse débutante, sélectionnable en Equipe de France"]
[null,null,null,null,null,"","",null,null,null,null,null,null,20,null,null,null,null,null,null,null,null,"seulement (attention à la date de validité juqu' à 22 ans révolu)"]
[null,null,null,null,null,"","",null,null,null,null,null,null,null,null,"F ou FET",null,null,"Pour les cartes roses",null,null,null,"Pour les femmes ou femmes étrangères <5pts  (Bonus 1,5 pts)"]
[null,null,null,null,null,"","",null,null,null,null,null,null,null,null,"En Nationale 2 et 3 uniquement (joueuses et joueurs de plus de 55 ans)"]
[null,null,null,null,null,"","",null,null,null,null,null,null,null,null,"S",null,null,"Pour les hommes séniors",null,null,null," Français ou Etrangers (Bonus de 0,5pt)"]
[null,null,null,null,null,null,null,null,null,null,null,null,null,null,null,"FS",null,null,"   Pour les femmes seniors",null,null,null," (Bonus 2pts)      "]
[" Joueurs-joueuses valides de l'équipe (5 points)",null,null,null,null,null,null,null,null,null,null,null,null,null,null,"JS",null,null," Pour les jeunes hommes séniors",null,null,null," Débutants  (Bonus 2pts)  validité (<3pts 2ans)       ( > 3pts 1 an)"]
[{"$f":"IF(G31=0,\"\",IF(G31>1,\"Trop de valides sur le terrain\",\"OK\"))","v":""},null,null,null,null,null,null,null,null,null,null,null,null,null,null,"JFS",null,null," Pour les jeunes femmes séniors",null,null,null," Débutantes  (Bonus 3pts)  validité (<3pts 2ans)     ( > 3pts 1 an)"]
["Joueurs étrangers ",null,null,null,null,null,null,null,null,null,null,null,null,null,null,"Autres possibilités (sans Bonus)"]
[{"$f":"IF(F31=0,\"\",IF(F31>5,\"Trop de joueurs étrangers sur la feuille\",\"OK\"))","v":""},null,null,null,null,null,null,null,null,null,null,null,null,null,null,"ET",null,null,"Pour un joueur étranger"]
[null,null,null,null,null,{"$f":"SUM(F6:F28)","v":0},{"$f":"SUM(G6:G30)","v":0},null,null,null,null,null,null,null,null,"FID",null,null,"Pour un joueur fidèle"]
[null,null,null,null,null,null,null,null,null,null,null,null,null,null,null,"N",null,null,"Pour tous joueurs sans symbole sur la carte de classification"]

{"sheet":"CAPSAAA","index":21,"n_rows":32,"n_cols":29,"rows_kept":32,"cut":false,"hidden":false,"merged":[[28,15,28,29],[30,15,30,17],[31,15,31,17],[15,15,15,29],[19,15,21,17],[19,18,21,21],[22,18,22,21],[23,15,23,29],[16,15,18,17],[16,18,18,21],[14,20,14,21],[14,26,14,27],[14,28,14,29],[11,22,14,22],[11,23,14,23],[11,24,14,24],[11,25,14,25],[11,28,11,29],[12,20,12,21],[12,26,12,27],[12,28,12,29],[13,20,13,21],[13,26,13,27],[13,28,13,29],[5,28,6,29],[7,15,8,17],[7,18,8,19],[7,22,8,22],[7,23,8,23],[7,24,8,24],[7,28,7,29],[8,28,8,29],[5,20,5,21],[5,18,6,19],[5,24,6,24],[5,15,6,17],[5,22,6,22],[5,23,6,23],[10,20,10,21],[11,20,11,21],[6,20,6,21],[7,20,7,21],[8,20,8,21],[9,20,9,21],[0,15,0,29],[1,22,3,22],[1,23,3,23],[1,24,3,24],[1,25,3,25],[1,26,3,27],[1,28,3,29],[9,28,9,29],[10,28,10,29],[11,15,14,17],[26,0,26,4],[24,15,24,17],[25,15,25,17],[26,15,26,17],[9,18,10,19],[11,18,11,19],[9,26,9,27],[10,26,10,27],[9,22,10,22],[9,23,10,23],[9,24,10,24],[9,25,10,25],[12,18,14,19],[1,0,2,0],[1,1,2,3],[1,9,1,13],[29,15,29,17],[11,26,11,27],[27,0,27,4],[28,0,28,4],[29,0,29,4],[27,15,27,17],[22,15,22,17],[9,15,10,17],[2,9,2,13],[5,26,5,27],[6,26,6,27],[7,26,7,27],[8,26,8,27]]}
["CAPSAAA",null,null,null,null,null,null,null,null,null,null,null,null,null,null,"Saison 2023-2024"]
[null,"Joueur(es) participant à la rencontre",null,null,null,null,null,null,null,"Saisir votre liste complète en MAJUSCULES ",null,null,null,null,null,null,null,null,null,null,null,null,"Carte Verte","Carte Jaune","Carte Rose","Carte Bleue","5,0 Val",null,"Non Sélectionnables en EDF (hors Fidet)"]
[null,null,null,null,null,null,null,null,null,"Joueurs(es) qualifié(es) saison 2023 -2024",null,null,null,null,null,null,null,null,"Avec une date de validité"]
[]
["Statuts","Classif.","          Noms      /    Prénoms",null,"Numéros","ET","VALIDE",null,null,"Statuts","Classif.","          Noms      /    Prénoms",null,"Numéros"]
[null,null,null,null,null,{"$f":"IF(A6=\"ET\",1,\"\")","v":""},{"$f":"IF(B6=5,1,\"\")","v":""},null,null,"N",4,"JACOTTIN","M",0,null,"Elite Nationale Bastide Médical",null,null,14.5,null,"Maxi 17,5 pts",null,"+  1 ","+  2","+  1,5",null,"1 sur la feuille",null,"Pas de limite"]
[null,null,null,null,null,{"$f":"IF(A7=\"ET\",1,\"\")","v":""},{"$f":"IF(B7=5,1,\"\")","v":""},null,null,"J",1,"SOUBABE","Y",4,null,null,null,null,null,null,"si cartes de couleurs",null,null,null,null,null,"et terrain"]
[null,null,null,null,null,{"$f":"IF(A8=\"ET\",1,\"\")","v":""},{"$f":"IF(B8=5,1,\"\")","v":""},null,null,"N",2,"KEMGANG","J",4,null," Nationale 1",null,null,14.5,null,"Maxi 17,5 pts",null,"+  1 ,5","+  2,5","+  1,5",null,"1 sur la feuille",null,"4  Maxi / terrain     "]
[null,null,null,null,null,"","",null,null,null,null,null,null,7,null,null,null,null,null,null,"si cartes de couleurs",null,null,null,null,null,"et terrain",null," (5 sur la feuille)"]
[null,null,null,null,null,"","",null,null,null,null,null,null,8,null," Nationale 2",null,null,15,null,"Maxi 19 pts",null,"+  1,5","+  2,5","+  1,5","+  0,5","2 sur la feuille",null,"4  Maxi / terrain     "]
[null,null,null,null,null,"","",null,null,"N",1,"SALLEM","R",9,null,null,null,null,null,null,"si cartes de couleurs",null,null,null,null,null,"2 sur le terrain",null," (5 sur la feuille)"]
[null,null,null,null,null,"","",null,null,"FID",2,"GOITA","O",10,null," Nationale 3",null,null,15.5,null,null,null,"+  1,5","+  2,5","+  1,5","+  0,5"]
[null,null,null,null,null,"","",null,null,"FID",2.5,"CHIKH","M",11,null,null,null,null,"Si 16pts début match-handicap de 10pts",null,"Maxi 19 pts",null,null,null,null,null,"2 sur la feuille",null,"4 Maxi / terrain"]
[null,null,null,null,null,"","",null,null,null,null,null,null,12,null,null,null,null,null,null,"si cartes de couleurs",null,null,null,null,null,"2 sur le terrain",null," (5 sur la feuille)"]
[null,null,null,null,null,"","",null,null,null,null,null,null,13]
[null,null,null,null,null,"","",null,null,null,null,null,null,14,null,"Inscrire dans la colonne de gauche les \"Statuts\" des joueurs de l'équipe"]
[null,null,null,null,null,"","","",null,"FID",4,"MESSAOUDENE","M",15,null,"J",null,null,"Pour les cartes Vertes",null,null,null,"Jeune joueur (U19 en Elite Nationale Bastide Médical)"]
[null,null,null,null,null,"","","",null,null,null,null,null,16,null,null,null,null,null,null,null,null,"Joueur débutant, sélectionnable en Equipe de France"]
[null,null,null,null,null,"","","",null,"N",5,"JULVE","M",17,null,null,null,null,null,null,null,null,"seulement (attention à la date de validité juqu'à 22 ans révolu)"]
[null,null,null,null,null,"","",null,null,null,null,null,null,18,null,"JF",null,null,"Pour les cartes Jaunes",null,null,null,"Jeune joueuse (U19 en Elite Nationale Bastide Médical)"]
[null,null,null,null,null,"","","",null,null,null,null,null,19,null,null,null,null,null,null,null,null,"Joueuse débutante, sélectionnable en Equipe de France"]
[null,null,null,null,null,"","",null,null,null,null,null,null,20,null,null,null,null,null,null,null,null,"seulement (attention à la date de validité juqu' à 22 ans révolu)"]
[null,null,null,null,null,"","",null,null,"N",4.5,"EL HADAOUI","A",75,null,"F ou FET",null,null,"Pour les cartes roses",null,null,null,"Pour les femmes ou femmes étrangères <5pts  (Bonus 1,5 pts)"]
[null,null,null,null,null,"","",null,null,"ET",1.5,"BAZIZ","I",99,null,"En Nationale 2 et 3 uniquement (joueuses et joueurs de plus de 55 ans)"]
[null,null,null,null,null,"","",null,null,null,null,null,null,null,null,"S",null,null,"Pour les hommes séniors",null,null,null," Français ou Etrangers (Bonus de 0,5pt)"]
[null,null,null,null,null,null,null,null,null,null,null,null,null,null,null,"FS",null,null,"   Pour les femmes seniors",null,null,null," (Bonus 2pts)      "]
[" Joueurs-joueuses valides de l'équipe (5 points)",null,null,null,null,null,null,null,null,null,null,null,null,null,null,"JS",null,null," Pour les jeunes hommes séniors",null,null,null," Débutants  (Bonus 2pts)  validité (<3pts 2ans)       ( > 3pts 1 an)"]
[{"$f":"IF(G31=0,\"\",IF(G31>1,\"Trop de valides sur le terrain\",\"OK\"))","v":""},null,null,null,null,null,null,null,null,null,null,null,null,null,null,"JFS",null,null," Pour les jeunes femmes séniors",null,null,null," Débutantes  (Bonus 3pts)  validité (<3pts 2ans)     ( > 3pts 1 an)"]
["Joueurs étrangers ",null,null,null,null,null,null,null,null,null,null,null,null,null,null,"Autres possibilités (sans Bonus)"]
[{"$f":"IF(F31=0,\"\",IF(F31>5,\"Trop de joueurs étrangers sur la feuille\",\"OK\"))","v":""},null,null,null,null,null,null,null,null,null,null,null,null,null,null,"ET",null,null,"Pour un joueur étranger"]
[null,null,null,null,null,{"$f":"SUM(F6:F28)","v":0},{"$f":"SUM(G6:G30)","v":0},null,null,null,null,null,null,null,null,"FID",null,null,"Pour un joueur fidèle"]
[null,null,null,null,null,null,null,null,null,null,null,null,null,null,null,"N",null,null,"Pour tous joueurs sans symbole sur la carte de classification"]

{"sheet":"CAUSSADE","index":22,"n_rows":32,"n_cols":29,"rows_kept":32,"cut":false,"hidden":false,"merged":[[31,15,31,17],[24,15,24,17],[25,15,25,17],[26,15,26,17],[28,15,28,29],[30,15,30,17],[12,18,14,19],[12,20,12,21],[12,26,12,27],[13,20,13,21],[13,26,13,27],[14,20,14,21],[11,23,14,23],[11,24,14,24],[11,25,14,25],[11,22,14,22],[11,20,11,21],[15,15,15,29],[19,15,21,17],[19,18,21,21],[22,18,22,21],[16,18,18,21],[22,15,22,17],[5,28,6,29],[7,15,8,17],[7,18,8,19],[7,22,8,22],[7,23,8,23],[7,24,8,24],[7,28,7,29],[8,28,8,29],[5,15,6,17],[5,18,6,19],[5,22,6,22],[5,23,6,23],[5,24,6,24],[5,26,5,27],[6,26,6,27],[7,26,7,27],[0,15,0,29],[1,22,3,22],[1,23,3,23],[1,24,3,24],[1,25,3,25],[1,26,3,27],[1,28,3,29],[8,26,8,27],[5,20,5,21],[6,20,6,21],[7,20,7,21],[8,20,8,21],[9,15,10,17],[9,18,10,19],[9,26,9,27],[10,26,10,27],[9,22,10,22],[9,23,10,23],[9,24,10,24],[9,25,10,25],[9,20,9,21],[10,20,10,21],[11,28,11,29],[12,28,12,29],[13,28,13,29],[14,26,14,27],[14,28,14,29],[11,26,11,27],[1,0,2,0],[1,1,2,3],[1,9,1,13],[29,15,29,17],[26,0,26,4],[27,0,27,4],[29,0,29,4],[27,15,27,17],[28,0,28,4],[16,15,18,17],[2,9,2,13],[23,15,23,29],[9,28,9,29],[10,28,10,29],[11,15,14,17],[11,18,11,19]]}
["CAUSSADE",null,null,null,null,null,null,null,null,null,null,null,null,null,null,"Saison 2023-2024"]
[null,"Joueur(es) participant à la rencontre",null,null,null,null,null,null,null,"Saisir votre liste complète en MAJUSCULES ",null,null,null,null,null,null,null,null,null,null,null,null,"Carte Verte","Carte Jaune","Carte Rose","Carte Bleue","5,0 Val",null,"Non Sélectionnables en EDF (hors Fidet)"]
[null,null,null,null,null,null,null,null,null,"Joueurs(es) qualifié(es) saison 2023 -2024",null,null,null,null,null,null,null,null,"Avec une date de validité"]
[]
["Statuts","Classif.","          Noms      /    Prénoms",null,"Numéros","ET","VALIDE",null,null,"Statuts","Classif.","          Noms      /    Prénoms",null,"Numéros"]
[null,null,null,null,null,{"$f":"IF(A6=\"ET\",1,\"\")","v":""},{"$f":"IF(B6=5,1,\"\")","v":""},null,null,"N",2.5,"EL GHAZZIAOUI","M",4,null,"Elite Nationale Bastide Médical",null,null,14.5,null,"Maxi 17,5 pts",null,"+  1 ","+  2","+  1,5",null,"1 sur la feuille",null,"Pas de limite"]
[null,null,null,null,null,{"$f":"IF(A7=\"ET\",1,\"\")","v":""},{"$f":"IF(B7=5,1,\"\")","v":""},null,null,"J",1,"BENYAHYA","M",5,null,null,null,null,null,null,"si cartes de couleurs",null,null,null,null,null,"et terrain"]
[null,null,null,null,null,{"$f":"IF(A8=\"ET\",1,\"\")","v":""},{"$f":"IF(B8=5,1,\"\")","v":""},null,null,"N",2,"HENRAS","J",6,null," Nationale 1",null,null,14.5,null,"Maxi 17,5 pts",null,"+  1 ,5","+  2,5","+  1,5",null,"1 sur la feuille",null,"4  Maxi / terrain     "]
[null,null,null,null,null,"","",null,null,"FID",2,"ABASSI","M",7,null,null,null,null,null,null,"si cartes de couleurs",null,null,null,null,null,"et terrain",null," (5 sur la feuille)"]
[null,null,null,null,null,"","",null,null,null,null,null,null,8,null," Nationale 2",null,null,15,null,"Maxi 19 pts",null,"+  1,5","+  2,5","+  1,5","+  0,5","2 sur la feuille",null,"4  Maxi / terrain     "]
[null,null,null,null,null,"","",null,null,null,null,null,null,9,null,null,null,null,null,null,"si cartes de couleurs",null,null,null,null,null,"2 sur le terrain",null," (5 sur la feuille)"]
[null,null,null,null,null,"","",null,null,"N",2,"NOELCHERY","C",10,null," Nationale 3",null,null,15.5,null,null,null,"+  1,5","+  2,5","+  1,5","+  0,5"]
[null,null,null,null,null,"","",null,null,"N",3.5,"VIROL","F",11,null,null,null,null,"Si 16pts début match-handicap de 10pts",null,"Maxi 19 pts",null,null,null,null,null,"2 sur la feuille",null,"4 Maxi / terrain"]
[null,null,null,null,null,"","",null,null,"N",1.5,"BONNET","J",12,null,null,null,null,null,null,"si cartes de couleurs",null,null,null,null,null,"2 sur le terrain",null," (5 sur la feuille)"]
[null,null,null,null,null,"","",null,null,"N",4,"EL HADDEF","M",13]
[null,null,null,null,null,"","",null,null,"N",2,"OKITAPOY","O",14,null,"Inscrire dans la colonne de gauche les \"Statuts\" des joueurs de l'équipe"]
[null,null,null,null,null,"","","",null,"N",4,"CHANAS","A",15,null,"J",null,null,"Pour les cartes Vertes",null,null,null,"Jeune joueur (U19 en Elite Nationale Bastide Médical)"]
[null,null,null,null,null,"","","",null,null,null,null,null,16,null,null,null,null,null,null,null,null,"Joueur débutant, sélectionnable en Equipe de France"]
[null,null,null,null,null,"","","",null,null,null,null,null,17,null,null,null,null,null,null,null,null,"seulement (attention à la date de validité juqu'à 22 ans révolu)"]
[null,null,null,null,null,"","",null,null,null,null,null,null,18,null,"JF",null,null,"Pour les cartes Jaunes",null,null,null,"Jeune joueuse (U19 en Elite Nationale Bastide Médical)"]
[null,null,null,null,null,"","","",null,null,null,null,null,19,null,null,null,null,null,null,null,null,"Joueuse débutante, sélectionnable en Equipe de France"]
[null,null,null,null,null,"","",null,null,null,null,null,null,20,null,null,null,null,null,null,null,null,"seulement (attention à la date de validité juqu' à 22 ans révolu)"]
[null,null,null,null,null,"","",null,null,null,null,null,null,null,null,"F ou FET",null,null,"Pour les cartes roses",null,null,null,"Pour les femmes ou femmes étrangères <5pts  (Bonus 1,5 pts)"]
[null,null,null,null,null,"","",null,null,null,null,null,null,null,null,"En Nationale 2 et 3 uniquement (joueuses et joueurs de plus de 55 ans)"]
[null,null,null,null,null,"","",null,null,null,null,null,null,null,null,"S",null,null,"Pour les hommes séniors",null,null,null," Français ou Etrangers (Bonus de 0,5pt)"]
[null,null,null,null,null,null,null,null,null,null,null,null,null,null,null,"FS",null,null,"   Pour les femmes seniors",null,null,null," (Bonus 2pts)      "]
[" Joueurs-joueuses valides de l'équipe (5 points)",null,null,null,null,null,null,null,null,null,null,null,null,null,null,"JS",null,null," Pour les jeunes hommes séniors",null,null,null," Débutants  (Bonus 2pts)  validité (<3pts 2ans)       ( > 3pts 1 an)"]
[{"$f":"IF(G31=0,\"\",IF(G31>1,\"Trop de valides sur le terrain\",\"OK\"))","v":""},null,null,null,null,null,null,null,null,null,null,null,null,null,null,"JFS",null,null," Pour les jeunes femmes séniors",null,null,null," Débutantes  (Bonus 3pts)  validité (<3pts 2ans)     ( > 3pts 1 an)"]
["Joueurs étrangers ",null,null,null,null,null,null,null,null,null,null,null,null,null,null,"Autres possibilités (sans Bonus)"]
[{"$f":"IF(F31=0,\"\",IF(F31>5,\"Trop de joueurs étrangers sur la feuille\",\"OK\"))","v":""},null,null,null,null,null,null,null,null,null,null,null,null,null,null,"ET",null,null,"Pour un joueur étranger"]
[null,null,null,null,null,{"$f":"SUM(F6:F28)","v":0},{"$f":"SUM(G6:G30)","v":0},null,null,null,null,null,null,null,null,"FID",null,null,"Pour un joueur fidèle"]
[null,null,null,null,null,null,null,null,null,null,null,null,null,null,null,"N",null,null,"Pour tous joueurs sans symbole sur la carte de classification"]

{"sheet":"ENT CHALON DIJON BF 2","index":23,"n_rows":32,"n_cols":29,"rows_kept":32,"cut":false,"hidden":false,"merged":[[15,15,15,29],[30,15,30,17],[31,15,31,17],[22,18,22,21],[23,15,23,29],[24,15,24,17],[25,15,25,17],[26,15,26,17],[12,28,12,29],[13,20,13,21],[13,26,13,27],[13,28,13,29],[14,20,14,21],[14,26,14,27],[14,28,14,29],[11,22,14,22],[11,20,11,21],[12,26,12,27],[5,24,6,24],[7,20,7,21],[8,20,8,21],[7,26,7,27],[8,26,8,27],[7,24,8,24],[7,22,8,22],[7,23,8,23],[0,15,0,29],[1,22,3,22],[5,20,5,21],[6,20,6,21],[1,23,3,23],[1,24,3,24],[1,25,3,25],[1,26,3,27],[1,28,3,29],[5,28,6,29],[5,26,5,27],[6,26,6,27],[5,15,6,17],[5,18,6,19],[5,22,6,22],[5,23,6,23],[29,0,29,4],[16,15,18,17],[16,18,18,21],[27,15,27,17],[22,15,22,17],[26,0,26,4],[27,0,27,4],[29,15,29,17],[28,0,28,4],[19,15,21,17],[19,18,21,21],[28,15,28,29],[10,41,10,45],[11,41,11,45],[10,32,11,32],[10,33,11,35],[11,26,11,27],[10,26,10,27],[11,28,11,29],[9,22,10,22],[9,23,10,23],[7,28,7,29],[8,28,8,29],[9,28,9,29],[10,28,10,29],[9,26,9,27],[9,25,10,25],[9,24,10,24],[1,0,2,0],[1,1,2,3],[1,9,1,13],[10,20,10,21],[2,9,2,13],[7,15,8,17],[7,18,8,19],[9,15,10,17],[9,18,10,19],[9,20,9,21],[11,15,14,17],[11,18,11,19],[11,23,14,23],[11,24,14,24],[11,25,14,25],[12,18,14,19],[12,20,12,21]]}
["ENT CHALON DIJON BF 2",null,null,null,null,null,null,null,null,null,null,null,null,null,null,"Saison 2023-2024"]
[null,"Joueur(es) participant à la rencontre",null,null,null,null,null,null,null,"Saisir votre liste complète en MAJUSCULES ",null,null,null,null,null,null,null,null,null,null,null,null,"Carte Verte","Carte Jaune","Carte Rose","Carte Bleue","5,0 Val",null,"Non Sélectionnables en EDF (hors Fidet)"]
[null,null,null,null,null,null,null,null,null,"Joueurs(es) qualifié(es) saison 2023 -2024",null,null,null,null,null,null,null,null,"Avec une date de validité"]
[]
["Statuts","Classif.","          Noms      /    Prénoms",null,"Numéros","ET","VALIDE",null,null,"Statuts","Classif.","          Noms      /    Prénoms",null,"Numéros"]
[null,null,null,null,null,{"$f":"IF(A6=\"ET\",1,\"\")","v":""},{"$f":"IF(B6=5,1,\"\")","v":""},null,null,"F",2.5,"ERNEST-AUGUSTIN","M",4,null,"Elite Nationale Bastide Médical",null,null,14.5,null,"Maxi 17,5 pts",null,"+  1 ","+  2","+  1,5",null,"1 sur la feuille",null,"Pas de limite"]
[null,null,null,null,null,{"$f":"IF(A7=\"ET\",1,\"\")","v":""},{"$f":"IF(B7=5,1,\"\")","v":""},null,null,"F",5,"RAMONET","C",5,null,null,null,null,null,null,"si cartes de couleurs",null,null,null,null,null,"et terrain"]
[null,null,null,null,null,{"$f":"IF(A8=\"ET\",1,\"\")","v":""},{"$f":"IF(B8=5,1,\"\")","v":""},null,null,"J",1.5,"BOUDIER","V",6,null," Nationale 1",null,null,14.5,null,"Maxi 17,5 pts",null,"+  1 ,5","+  2,5","+  1,5",null,"1 sur la feuille",null,"4  Maxi / terrain     "]
[null,null,null,null,null,"","",null,null,"J",4.5,"VOIRIN","J",7,null,null,null,null,null,null,"si cartes de couleurs",null,null,null,null,null,"et terrain",null," (5 sur la feuille)"]
[null,null,null,null,null,"","",null,null,"N",3,"BOUNAB","M",8,null," Nationale 2",null,null,15,null,"Maxi 19 pts",null,"+  1,5","+  2,5","+  1,5","+  0,5","2 sur la feuille",null,"4  Maxi / terrain     "]
[null,null,null,null,null,"","",null,null,null,null,null,null,9,null,null,null,null,null,null,"si cartes de couleurs",null,null,null,null,null,"2 sur le terrain",null," (5 sur la feuille)"]
[null,null,null,null,null,"","",null,null,null,null,null,null,10,null," Nationale 3",null,null,15.5,null,null,null,"+  1,5","+  2,5","+  1,5","+  0,5"]
[null,null,null,null,null,"","",null,null,"N",1,"BAUER","A",11,null,null,null,null,"Si 16pts début match-handicap de 10pts",null,"Maxi 19 pts",null,null,null,null,null,"2 sur la feuille",null,"4 Maxi / terrain"]
[null,null,null,null,null,"","",null,null,null,null,null,null,12,null,null,null,null,null,null,"si cartes de couleurs",null,null,null,null,null,"2 sur le terrain",null," (5 sur la feuille)"]
[null,null,null,null,null,"","",null,null,null,null,null,null,13]
[null,null,null,null,null,"","",null,null,null,null,null,null,14,null,"Inscrire dans la colonne de gauche les \"Statuts\" des joueurs de l'équipe"]
[null,null,null,null,null,"","","",null,"N",3.5,"LEGENDRE","G",15,null,"J",null,null,"Pour les cartes Vertes",null,null,null,"Jeune joueur (U19 en Elite Nationale Bastide Médical)"]
[null,null,null,null,null,"","","",null,null,null,null,null,16,null,null,null,null,null,null,null,null,"Joueur débutant, sélectionnable en Equipe de France"]
[null,null,null,null,null,"","","",null,null,null,null,null,17,null,null,null,null,null,null,null,null,"seulement (attention à la date de validité juqu'à 22 ans révolu)"]
[null,null,null,null,null,"","",null,null,null,null,null,null,18,null,"JF",null,null,"Pour les cartes Jaunes",null,null,null,"Jeune joueuse (U19 en Elite Nationale Bastide Médical)"]
[null,null,null,null,null,"","","",null,null,null,null,null,19,null,null,null,null,null,null,null,null,"Joueuse débutante, sélectionnable en Equipe de France"]
[null,null,null,null,null,"","",null,null,"F",2,"NOLET","L",28,null,null,null,null,null,null,null,null,"seulement (attention à la date de validité juqu' à 22 ans révolu)"]
[null,null,null,null,null,"","",null,null,"N",4.5,"BOUNAB","M",null,null,"F ou FET",null,null,"Pour les cartes roses",null,null,null,"Pour les femmes ou femmes étrangères <5pts  (Bonus 1,5 pts)"]
[null,null,null,null,null,"","",null,null,null,null,null,null,null,null,"En Nationale 2 et 3 uniquement (joueuses et joueurs de plus de 55 ans)"]
[null,null,null,null,null,"","",null,null,null,null,null,null,null,null,"S",null,null,"Pour les hommes séniors",null,null,null," Français ou Etrangers (Bonus de 0,5pt)"]
[null,null,null,null,null,null,null,null,null,null,null,null,null,null,null,"FS",null,null,"   Pour les femmes seniors",null,null,null," (Bonus 2pts)      "]
[" Joueurs-joueuses valides de l'équipe (5 points)",null,null,null,null,null,null,null,null,null,null,null,null,null,null,"JS",null,null," Pour les jeunes hommes séniors",null,null,null," Débutants  (Bonus 2pts)  validité (<3pts 2ans)       ( > 3pts 1 an)"]
[{"$f":"IF(G31=0,\"\",IF(G31>1,\"Trop de valides sur le terrain\",\"OK\"))","v":""},null,null,null,null,null,null,null,null,null,null,null,null,null,null,"JFS",null,null," Pour les jeunes femmes séniors",null,null,null," Débutantes  (Bonus 3pts)  validité (<3pts 2ans)     ( > 3pts 1 an)"]
["Joueurs étrangers ",null,null,null,null,null,null,null,null,null,null,null,null,null,null,"Autres possibilités (sans Bonus)"]
[{"$f":"IF(F31=0,\"\",IF(F31>5,\"Trop de joueurs étrangers sur la feuille\",\"OK\"))","v":""},null,null,null,null,null,null,null,null,null,null,null,null,null,null,"ET",null,null,"Pour un joueur étranger"]
[null,null,null,null,null,{"$f":"SUM(F6:F28)","v":0},{"$f":"SUM(G6:G30)","v":0},null,null,null,null,null,null,null,null,"FID",null,null,"Pour un joueur fidèle"]
[null,null,null,null,null,null,null,null,null,null,null,null,null,null,null,"N",null,null,"Pour tous joueurs sans symbole sur la carte de classification"]

{"sheet":"DOUAI","index":24,"n_rows":32,"n_cols":29,"rows_kept":32,"cut":false,"hidden":false,"merged":[[31,15,31,17],[24,15,24,17],[25,15,25,17],[26,15,26,17],[28,15,28,29],[30,15,30,17],[29,15,29,17],[11,22,14,22],[11,23,14,23],[11,24,14,24],[11,25,14,25],[11,28,11,29],[12,26,12,27],[12,28,12,29],[13,26,13,27],[13,28,13,29],[14,26,14,27],[14,28,14,29],[9,23,10,23],[9,24,10,24],[9,25,10,25],[9,28,9,29],[10,28,10,29],[8,28,8,29],[5,15,6,17],[5,18,6,19],[5,22,6,22],[5,23,6,23],[5,24,6,24],[9,15,10,17],[9,18,10,19],[0,15,0,29],[1,22,3,22],[1,23,3,23],[1,24,3,24],[1,25,3,25],[1,26,3,27],[1,28,3,29],[5,28,6,29],[7,15,8,17],[7,18,8,19],[7,22,8,22],[7,23,8,23],[7,24,8,24],[7,28,7,29],[15,15,15,29],[19,15,21,17],[10,20,10,21],[11,20,11,21],[2,9,2,13],[5,26,5,27],[6,26,6,27],[5,20,5,21],[6,20,6,21],[7,26,7,27],[8,26,8,27],[9,26,9,27],[10,26,10,27],[7,20,7,21],[8,20,8,21],[9,20,9,21],[11,15,14,17],[11,18,11,19],[12,18,14,19],[12,20,12,21],[13,20,13,21],[14,20,14,21],[29,0,29,4],[19,18,21,21],[22,18,22,21],[23,15,23,29],[1,0,2,0],[1,1,2,3],[1,9,1,13],[16,18,18,21],[9,22,10,22],[28,0,28,4],[11,26,11,27],[27,15,27,17],[22,15,22,17],[16,15,18,17],[26,0,26,4],[27,0,27,4]]}
["DOUAI",null,null,null,null,null,null,null,null,null,null,null,null,null,null,"Saison 2023-2024"]
[null,"Joueur(es) participant à la rencontre",null,null,null,null,null,null,null,"Saisir votre liste complète en MAJUSCULES ",null,null,null,null,null,null,null,null,null,null,null,null,"Carte Verte","Carte Jaune","Carte Rose","Carte Bleue","5,0 Val",null,"Non Sélectionnables en EDF (hors Fidet)"]
[null,null,null,null,null,null,null,null,null,"Joueurs(es) qualifié(es) saison 2023 -2024",null,null,null,null,null,null,null,null,"Avec une date de validité"]
[]
["Statuts","Classif.","          Noms      /    Prénoms",null,"Numéros","ET","VALIDE",null,null,"Statuts","Classif.","          Noms      /    Prénoms",null,"Numéros"]
[null,null,null,null,null,{"$f":"IF(A6=\"ET\",1,\"\")","v":""},{"$f":"IF(B6=5,1,\"\")","v":""},null,null,"N",4.5,"AVEZ","G",1,null,"Elite Nationale Bastide Médical",null,null,14.5,null,"Maxi 17,5 pts",null,"+  1 ","+  2","+  1,5",null,"1 sur la feuille",null,"Pas de limite"]
[null,null,null,null,null,{"$f":"IF(A7=\"ET\",1,\"\")","v":""},{"$f":"IF(B7=5,1,\"\")","v":""},null,null,null,null,null,null,2,null,null,null,null,null,null,"si cartes de couleurs",null,null,null,null,null,"et terrain"]
[null,null,null,null,null,{"$f":"IF(A8=\"ET\",1,\"\")","v":""},{"$f":"IF(B8=5,1,\"\")","v":""},null,null,null,null,null,null,3,null," Nationale 1",null,null,14.5,null,"Maxi 17,5 pts",null,"+  1 ,5","+  2,5","+  1,5",null,"1 sur la feuille",null,"4  Maxi / terrain     "]
[null,null,null,null,null,"","",null,null,"N",2,"ECROGNARD","V",4,null,null,null,null,null,null,"si cartes de couleurs",null,null,null,null,null,"et terrain",null," (5 sur la feuille)"]
[null,null,null,null,null,"","",null,null,null,null,null,null,5,null," Nationale 2",null,null,15,null,"Maxi 19 pts",null,"+  1,5","+  2,5","+  1,5","+  0,5","2 sur la feuille",null,"4  Maxi / terrain     "]
[null,null,null,null,null,"","",null,null,null,null,null,null,6,null,null,null,null,null,null,"si cartes de couleurs",null,null,null,null,null,"2 sur le terrain",null," (5 sur la feuille)"]
[null,null,null,null,null,"","",null,null,"N",1,"MARCHANT","R",7,null," Nationale 3",null,null,15.5,null,null,null,"+  1,5","+  2,5","+  1,5","+  0,5"]
[null,null,null,null,null,"","",null,null,"N",2.5,"SECRET","A",8,null,null,null,null,"Si 16pts début match-handicap de 10pts",null,"Maxi 19 pts",null,null,null,null,null,"2 sur la feuille",null,"4 Maxi / terrain"]
[null,null,null,null,null,"","",null,null,null,null,null,null,9,null,null,null,null,null,null,"si cartes de couleurs",null,null,null,null,null,"2 sur le terrain",null," (5 sur la feuille)"]
[null,null,null,null,null,"","",null,null,"N",3.5,"ZANTOUTI","M",10]
[null,null,null,null,null,"","",null,null,"N",4.5,"DEUSY","JJ",11,null,"Inscrire dans la colonne de gauche les \"Statuts\" des joueurs de l'équipe"]
[null,null,null,null,null,"","","",null,"N",1,"BAILLON","K",12,null,"J",null,null,"Pour les cartes Vertes",null,null,null,"Jeune joueur (U19 en Elite Nationale Bastide Médical)"]
[null,null,null,null,null,"","","",null,null,null,null,null,24,null,null,null,null,null,null,null,null,"Joueur débutant, sélectionnable en Equipe de France"]
[null,null,null,null,null,"","","",null,"N",3,"PITHON","J",27,null,null,null,null,null,null,null,null,"seulement (attention à la date de validité juqu'à 22 ans révolu)"]
[null,null,null,null,null,"","",null,null,"N",2.5,"MACAREZ","P",75,null,"JF",null,null,"Pour les cartes Jaunes",null,null,null,"Jeune joueuse (U19 en Elite Nationale Bastide Médical)"]
[null,null,null,null,null,"","","",null,null,null,null,null,null,null,null,null,null,null,null,null,null,"Joueuse débutante, sélectionnable en Equipe de France"]
[null,null,null,null,null,"","",null,null,null,null,null,null,null,null,null,null,null,null,null,null,null,"seulement (attention à la date de validité juqu' à 22 ans révolu)"]
[null,null,null,null,null,"","",null,null,null,null,null,null,null,null,"F ou FET",null,null,"Pour les cartes roses",null,null,null,"Pour les femmes ou femmes étrangères <5pts  (Bonus 1,5 pts)"]
[null,null,null,null,null,"","",null,null,null,null,null,null,null,null,"En Nationale 2 et 3 uniquement (joueuses et joueurs de plus de 55 ans)"]
[null,null,null,null,null,"","",null,null,null,null,null,null,null,null,"S",null,null,"Pour les hommes séniors",null,null,null," Français ou Etrangers (Bonus de 0,5pt)"]
[null,null,null,null,null,null,null,null,null,null,null,null,null,null,null,"FS",null,null,"   Pour les femmes seniors",null,null,null," (Bonus 2pts)      "]
[" Joueurs-joueuses valides de l'équipe (5 points)",null,null,null,null,null,null,null,null,null,null,null,null,null,null,"JS",null,null," Pour les jeunes hommes séniors",null,null,null," Débutants  (Bonus 2pts)  validité (<3pts 2ans)       ( > 3pts 1 an)"]
[{"$f":"IF(G31=0,\"\",IF(G31>1,\"Trop de valides sur le terrain\",\"OK\"))","v":""},null,null,null,null,null,null,null,null,null,null,null,null,null,null,"JFS",null,null," Pour les jeunes femmes séniors",null,null,null," Débutantes  (Bonus 3pts)  validité (<3pts 2ans)     ( > 3pts 1 an)"]
["Joueurs étrangers ",null,null,null,null,null,null,null,null,null,null,null,null,null,null,"Autres possibilités (sans Bonus)"]
[{"$f":"IF(F31=0,\"\",IF(F31>5,\"Trop de joueurs étrangers sur la feuille\",\"OK\"))","v":""},null,null,null,null,null,null,null,null,null,null,null,null,null,null,"ET",null,null,"Pour un joueur étranger"]
[null,null,null,null,null,{"$f":"SUM(F6:F28)","v":0},{"$f":"SUM(G6:G30)","v":0},null,null,null,null,null,null,null,null,"FID",null,null,"Pour un joueur fidèle"]
[null,null,null,null,null,null,null,null,null,null,null,null,null,null,null,"N",null,null,"Pour tous joueurs sans symbole sur la carte de classification"]

{"sheet":"FEURS","index":25,"n_rows":32,"n_cols":29,"rows_kept":32,"cut":false,"hidden":false,"merged":[[31,15,31,17],[24,15,24,17],[25,15,25,17],[26,15,26,17],[28,15,28,29],[30,15,30,17],[29,15,29,17],[11,22,14,22],[11,23,14,23],[11,24,14,24],[11,25,14,25],[11,28,11,29],[12,26,12,27],[12,28,12,29],[13,26,13,27],[13,28,13,29],[14,26,14,27],[14,28,14,29],[9,23,10,23],[9,24,10,24],[9,25,10,25],[9,28,9,29],[10,28,10,29],[8,28,8,29],[5,15,6,17],[5,18,6,19],[5,22,6,22],[5,23,6,23],[5,24,6,24],[9,15,10,17],[9,18,10,19],[0,15,0,29],[1,22,3,22],[1,23,3,23],[1,24,3,24],[1,25,3,25],[1,26,3,27],[1,28,3,29],[5,28,6,29],[7,15,8,17],[7,18,8,19],[7,22,8,22],[7,23,8,23],[7,24,8,24],[7,28,7,29],[15,15,15,29],[19,15,21,17],[10,20,10,21],[11,20,11,21],[2,9,2,13],[5,26,5,27],[6,26,6,27],[5,20,5,21],[6,20,6,21],[7,26,7,27],[8,26,8,27],[9,26,9,27],[10,26,10,27],[7,20,7,21],[8,20,8,21],[9,20,9,21],[11,15,14,17],[11,18,11,19],[12,18,14,19],[12,20,12,21],[13,20,13,21],[14,20,14,21],[29,0,29,4],[19,18,21,21],[22,18,22,21],[23,15,23,29],[1,0,2,0],[1,1,2,3],[1,9,1,13],[16,18,18,21],[9,22,10,22],[28,0,28,4],[11,26,11,27],[27,15,27,17],[22,15,22,17],[16,15,18,17],[26,0,26,4],[27,0,27,4]]}
["FEURS",null,null,null,null,null,null,null,null,null,null,null,null,null,null,"Saison 2023-2024"]
[null,"Joueur(es) participant à la rencontre",null,null,null,null,null,null,null,"Saisir votre liste complète en MAJUSCULES ",null,null,null,null,null,null,null,null,null,null,null,null,"Carte Verte","Carte Jaune","Carte Rose","Carte Bleue","5,0 Val",null,"Non Sélectionnables en EDF (hors Fidet)"]
[null,null,null,null,null,null,null,null,null,"Joueurs(es) qualifié(es) saison 2023 -2024",null,null,null,null,null,null,null,null,"Avec une date de validité"]
[]
["Statuts","Classif.","          Noms      /    Prénoms",null,"Numéros","ET","VALIDE",null,null,"Statuts","Classif.","          Noms      /    Prénoms",null,"Numéros"]
[null,null,null,null,null,{"$f":"IF(A6=\"ET\",1,\"\")","v":""},{"$f":"IF(B6=5,1,\"\")","v":""},null,null,"N",4,"GIPON","M",4,null,"Elite Nationale Bastide Médical",null,null,14.5,null,"Maxi 17,5 pts",null,"+  1 ","+  2","+  1,5",null,"1 sur la feuille",null,"Pas de limite"]
[null,null,null,null,null,{"$f":"IF(A7=\"ET\",1,\"\")","v":""},{"$f":"IF(B7=5,1,\"\")","v":""},null,null,null,null,null,null,5,null,null,null,null,null,null,"si cartes de couleurs",null,null,null,null,null,"et terrain"]
[null,null,null,null,null,{"$f":"IF(A8=\"ET\",1,\"\")","v":""},{"$f":"IF(B8=5,1,\"\")","v":""},null,null,null,null,null,null,6,null," Nationale 1",null,null,14.5,null,"Maxi 17,5 pts",null,"+  1 ,5","+  2,5","+  1,5",null,"1 sur la feuille",null,"4  Maxi / terrain     "]
[null,null,null,null,null,"","",null,null,null,null,null,null,7,null,null,null,null,null,null,"si cartes de couleurs",null,null,null,null,null,"et terrain",null," (5 sur la feuille)"]
[null,null,null,null,null,"","",null,null,null,null,null,null,8,null," Nationale 2",null,null,15,null,"Maxi 19 pts",null,"+  1,5","+  2,5","+  1,5","+  0,5","2 sur la feuille",null,"4  Maxi / terrain     "]
[null,null,null,null,null,"","",null,null,null,null,null,null,9,null,null,null,null,null,null,"si cartes de couleurs",null,null,null,null,null,"2 sur le terrain",null," (5 sur la feuille)"]
[null,null,null,null,null,"","",null,null,null,null,null,null,10,null," Nationale 3",null,null,15.5,null,null,null,"+  1,5","+  2,5","+  1,5","+  0,5"]
[null,null,null,null,null,"","",null,null,"FID",4,"JARUSEIVICIUS","M",11,null,null,null,null,"Si 16pts début match-handicap de 10pts",null,"Maxi 19 pts",null,null,null,null,null,"2 sur la feuille",null,"4 Maxi / terrain"]
[null,null,null,null,null,"","",null,null,"N",2,"JOURJON","A",12,null,null,null,null,null,null,"si cartes de couleurs",null,null,null,null,null,"2 sur le terrain",null," (5 sur la feuille)"]
[null,null,null,null,null,"","",null,null,"ET",2,"CAINE","G",13]
[null,null,null,null,null,"","",null,null,null,null,null,null,14,null,"Inscrire dans la colonne de gauche les \"Statuts\" des joueurs de l'équipe"]
[null,null,null,null,null,"","","",null,"ET",4,"BONNER","W",15,null,"J",null,null,"Pour les cartes Vertes",null,null,null,"Jeune joueur (U19 en Elite Nationale Bastide Médical)"]
[null,null,null,null,null,"","","",null,"J",4,"ROGNARD","A",16,null,null,null,null,null,null,null,null,"Joueur débutant, sélectionnable en Equipe de France"]
[null,null,null,null,null,"","","",null,null,null,null,null,17,null,null,null,null,null,null,null,null,"seulement (attention à la date de validité juqu'à 22 ans révolu)"]
[null,null,null,null,null,"","",null,null,null,null,null,null,18,null,"JF",null,null,"Pour les cartes Jaunes",null,null,null,"Jeune joueuse (U19 en Elite Nationale Bastide Médical)"]
[null,null,null,null,null,"","","",null,null,null,null,null,19,null,null,null,null,null,null,null,null,"Joueuse débutante, sélectionnable en Equipe de France"]
[null,null,null,null,null,"","",null,null,null,null,null,null,23,null,null,null,null,null,null,null,null,"seulement (attention à la date de validité juqu' à 22 ans révolu)"]
[null,null,null,null,null,"","",null,null,"ET",2.5,"FAYE","I",26,null,"F ou FET",null,null,"Pour les cartes roses",null,null,null,"Pour les femmes ou femmes étrangères <5pts  (Bonus 1,5 pts)"]
[null,null,null,null,null,"","",null,null,null,null,null,null,null,null,"En Nationale 2 et 3 uniquement (joueuses et joueurs de plus de 55 ans)"]
[null,null,null,null,null,"","",null,null,null,null,null,null,null,null,"S",null,null,"Pour les hommes séniors",null,null,null," Français ou Etrangers (Bonus de 0,5pt)"]
[null,null,null,null,null,null,null,null,null,null,null,null,null,null,null,"FS",null,null,"   Pour les femmes seniors",null,null,null," (Bonus 2pts)      "]
[" Joueurs-joueuses valides de l'équipe (5 points)",null,null,null,null,null,null,null,null,null,null,null,null,null,null,"JS",null,null," Pour les jeunes hommes séniors",null,null,null," Débutants  (Bonus 2pts)  validité (<3pts 2ans)       ( > 3pts 1 an)"]
[{"$f":"IF(G31=0,\"\",IF(G31>1,\"Trop de valides sur le terrain\",\"OK\"))","v":""},null,null,null,null,null,null,null,null,null,null,null,null,null,null,"JFS",null,null," Pour les jeunes femmes séniors",null,null,null," Débutantes  (Bonus 3pts)  validité (<3pts 2ans)     ( > 3pts 1 an)"]
["Joueurs étrangers ",null,null,null,null,null,null,null,null,null,null,null,null,null,null,"Autres possibilités (sans Bonus)"]
[{"$f":"IF(F31=0,\"\",IF(F31>5,\"Trop de joueurs étrangers sur la feuille\",\"OK\"))","v":""},null,null,null,null,null,null,null,null,null,null,null,null,null,null,"ET",null,null,"Pour un joueur étranger"]
[null,null,null,null,null,{"$f":"SUM(F6:F28)","v":0},{"$f":"SUM(G6:G30)","v":0},null,null,null,null,null,null,null,null,"FID",null,null,"Pour un joueur fidèle"]
[null,null,null,null,null,null,null,null,null,null,null,null,null,null,null,"N",null,null,"Pour tous joueurs sans symbole sur la carte de classification"]

{"sheet":"LILLE","index":26,"n_rows":32,"n_cols":29,"rows_kept":32,"cut":false,"hidden":false,"merged":[[19,18,21,21],[22,18,22,21],[23,15,23,29],[31,15,31,17],[24,15,24,17],[25,15,25,17],[26,15,26,17],[28,15,28,29],[30,15,30,17],[12,28,12,29],[13,20,13,21],[13,26,13,27],[13,28,13,29],[14,20,14,21],[14,26,14,27],[14,28,14,29],[11,23,14,23],[11,24,14,24],[11,28,11,29],[5,28,6,29],[7,15,8,17],[7,18,8,19],[7,22,8,22],[7,23,8,23],[7,24,8,24],[7,28,7,29],[8,28,8,29],[5,20,5,21],[6,20,6,21],[7,20,7,21],[5,15,6,17],[5,18,6,19],[5,26,5,27],[6,26,6,27],[5,22,6,22],[0,15,0,29],[1,22,3,22],[1,23,3,23],[1,24,3,24],[1,25,3,25],[1,26,3,27],[1,28,3,29],[5,23,6,23],[5,24,6,24],[7,26,7,27],[8,26,8,27],[9,26,9,27],[8,20,8,21],[9,20,9,21],[10,20,10,21],[16,15,18,17],[16,18,18,21],[9,15,10,17],[9,18,10,19],[11,20,11,21],[12,18,14,19],[12,20,12,21],[15,15,15,29],[9,28,9,29],[10,28,10,29],[11,15,14,17],[11,18,11,19],[11,22,14,22],[10,26,10,27],[11,26,11,27],[9,22,10,22],[9,23,10,23],[9,24,10,24],[9,25,10,25],[11,25,14,25],[12,26,12,27],[1,0,2,0],[1,1,2,3],[1,9,1,13],[2,9,2,13],[29,15,29,17],[28,0,28,4],[29,0,29,4],[26,0,26,4],[27,0,27,4],[27,15,27,17],[22,15,22,17],[19,15,21,17]]}
["LILLE",null,null,null,null,null,null,null,null,null,null,null,null,null,null,"Saison 2023-2024"]
[null,"Joueur(es) participant à la rencontre",null,null,null,null,null,null,null,"Saisir votre liste complète en MAJUSCULES ",null,null,null,null,null,null,null,null,null,null,null,null,"Carte Verte","Carte Jaune","Carte Rose","Carte Bleue","5,0 Val",null,"Non Sélectionnables en EDF (hors Fidet)"]
[null,null,null,null,null,null,null,null,null,"Joueurs(es) qualifié(es) saison 2023 -2024",null,null,null,null,null,null,null,null,"Avec une date de validité"]
[]
[]
[null,null,null,null,null,{"$f":"IF(A6=\"ET\",1,\"\")","v":""},{"$f":"IF(B6=5,1,\"\")","v":""},null,null,null,null,null,null,4,null,"Elite Nationale Bastide Médical",null,null,14.5,null,"Maxi 17,5 pts",null,"+  1 ","+  2","+  1,5",null,"1 sur la feuille",null,"Pas de limite"]
[null,null,null,null,null,{"$f":"IF(A7=\"ET\",1,\"\")","v":""},{"$f":"IF(B7=5,1,\"\")","v":""},null,null,"N",2.5,"OULINI","M",5,null,null,null,null,null,null,"si cartes de couleurs",null,null,null,null,null,"et terrain"]
[null,null,null,null,null,{"$f":"IF(A8=\"ET\",1,\"\")","v":""},{"$f":"IF(B8=5,1,\"\")","v":""},null,null,null,null,null,null,6,null," Nationale 1",null,null,14.5,null,"Maxi 17,5 pts",null,"+  1 ,5","+  2,5","+  1,5",null,"1 sur la feuille",null,"4  Maxi / terrain     "]
[null,null,null,null,null,"","",null,null,"ET",4,"CHIRINOS","E",7,null,null,null,null,null,null,"si cartes de couleurs",null,null,null,null,null,"et terrain",null," (5 sur la feuille)"]
[null,null,null,null,null,"","",null,null,null,null,null,null,8,null," Nationale 2",null,null,15,null,"Maxi 19 pts",null,"+  1,5","+  2,5","+  1,5","+  0,5","2 sur la feuille",null,"4  Maxi / terrain     "]
[null,null,null,null,null,"","",null,null,null,null,null,null,9,null,null,null,null,null,null,"si cartes de couleurs",null,null,null,null,null,"2 sur le terrain",null," (5 sur la feuille)"]
[null,null,null,null,null,"","",null,null,null,null,null,null,10,null," Nationale 3",null,null,15.5,null,null,null,"+  1,5","+  2,5","+  1,5","+  0,5"]
[null,null,null,null,null,"","",null,null,"ET",1,"MOUJOUD","M",11,null,null,null,null,"Si 16pts début match-handicap de 10pts",null,"Maxi 19 pts",null,null,null,null,null,"2 sur la feuille",null,"4 Maxi / terrain"]
[null,null,null,null,null,"","",null,null,"N",4.5,"BOULET","D",12,null,null,null,null,null,null,"si cartes de couleurs",null,null,null,null,null,"2 sur le terrain",null," (5 sur la feuille)"]
[null,null,null,null,null,"","",null,null,null,null,null,null,13]
[null,null,null,null,null,"","",null,null,null,null,null,null,14,null,"Inscrire dans la colonne de gauche les \"Statuts\" des joueurs de l'équipe"]
[null,null,null,null,null,"","","",null,"ET",4,"BADER","S",15,null,"J",null,null,"Pour les cartes Vertes",null,null,null,"Jeune joueur (U19 en Elite Nationale Bastide Médical)"]
[null,null,null,null,null,"","","",null,"ET",3,"GAMRI","A",16,null,null,null,null,null,null,null,null,"Joueur débutant, sélectionnable en Equipe de France"]
[null,null,null,null,null,"","","",null,null,null,null,null,17,null,null,null,null,null,null,null,null,"seulement (attention à la date de validité juqu'à 22 ans révolu)"]
[null,null,null,null,null,"","",null,null,null,null,null,null,18,null,"JF",null,null,"Pour les cartes Jaunes",null,null,null,"Jeune joueuse (U19 en Elite Nationale Bastide Médical)"]
[null,null,null,null,null,"","","",null,"ET",3.5,"EDJAWATO","T",19,null,null,null,null,null,null,null,null,"Joueuse débutante, sélectionnable en Equipe de France"]
[null,null,null,null,null,"","",null,null,null,null,null,null,20,null,null,null,null,null,null,null,null,"seulement (attention à la date de validité juqu' à 22 ans révolu)"]
[null,null,null,null,null,"","",null,null,null,null,null,null,21,null,"F ou FET",null,null,"Pour les cartes roses",null,null,null,"Pour les femmes ou femmes étrangères <5pts  (Bonus 1,5 pts)"]
[null,null,null,null,null,"","",null,null,null,null,null,null,22,null,"En Nationale 2 et 3 uniquement (joueuses et joueurs de plus de 55 ans)"]
[null,null,null,null,null,"","",null,null,"N",1,"MONNIER","V",99,null,"S",null,null,"Pour les hommes séniors",null,null,null," Français ou Etrangers (Bonus de 0,5pt)"]
[null,null,null,null,null,null,null,null,null,null,null,null,null,null,null,"FS",null,null,"   Pour les femmes seniors",null,null,null," (Bonus 2pts)      "]
[" Joueurs-joueuses valides de l'équipe (5 points)",null,null,null,null,null,null,null,null,null,null,null,null,null,null,"JS",null,null," Pour les jeunes hommes séniors",null,null,null," Débutants  (Bonus 2pts)  validité (<3pts 2ans)       ( > 3pts 1 an)"]
[{"$f":"IF(G31=0,\"\",IF(G31>1,\"Trop de valides sur le terrain\",\"OK\"))","v":""},null,null,null,null,null,null,null,null,null,null,null,null,null,null,"JFS",null,null," Pour les jeunes femmes séniors",null,null,null," Débutantes  (Bonus 3pts)  validité (<3pts 2ans)     ( > 3pts 1 an)"]
["Joueurs étrangers ",null,null,null,null,null,null,null,null,null,null,null,null,null,null,"Autres possibilités (sans Bonus)"]
[{"$f":"IF(F31=0,\"\",IF(F31>5,\"Trop de joueurs étrangers sur la feuille\",\"OK\"))","v":""},null,null,null,null,null,null,null,null,null,null,null,null,null,null,"ET",null,null,"Pour un joueur étranger"]
[null,null,null,null,null,{"$f":"SUM(F6:F28)","v":0},{"$f":"SUM(G6:G30)","v":0},null,null,null,null,null,null,null,null,"FID",null,null,"Pour un joueur fidèle"]
[null,null,null,null,null,null,null,null,null,null,null,null,null,null,null,"N",null,null,"Pour tous joueurs sans symbole sur la carte de classification"]

{"sheet":"MEAUX 2","index":27,"n_rows":32,"n_cols":29,"rows_kept":32,"cut":false,"hidden":false,"merged":[[31,15,31,17],[24,15,24,17],[25,15,25,17],[26,15,26,17],[28,15,28,29],[30,15,30,17],[29,15,29,17],[11,22,14,22],[11,23,14,23],[11,24,14,24],[11,25,14,25],[11,28,11,29],[12,26,12,27],[12,28,12,29],[13,26,13,27],[13,28,13,29],[14,26,14,27],[14,28,14,29],[9,23,10,23],[9,24,10,24],[9,25,10,25],[9,28,9,29],[10,28,10,29],[8,28,8,29],[5,15,6,17],[5,18,6,19],[5,22,6,22],[5,23,6,23],[5,24,6,24],[9,15,10,17],[9,18,10,19],[0,15,0,29],[1,22,3,22],[1,23,3,23],[1,24,3,24],[1,25,3,25],[1,26,3,27],[1,28,3,29],[5,28,6,29],[7,15,8,17],[7,18,8,19],[7,22,8,22],[7,23,8,23],[7,24,8,24],[7,28,7,29],[15,15,15,29],[19,15,21,17],[10,20,10,21],[11,20,11,21],[2,9,2,13],[5,26,5,27],[6,26,6,27],[5,20,5,21],[6,20,6,21],[7,26,7,27],[8,26,8,27],[9,26,9,27],[10,26,10,27],[7,20,7,21],[8,20,8,21],[9,20,9,21],[11,15,14,17],[11,18,11,19],[12,18,14,19],[12,20,12,21],[13,20,13,21],[14,20,14,21],[29,0,29,4],[19,18,21,21],[22,18,22,21],[23,15,23,29],[1,0,2,0],[1,1,2,3],[1,9,1,13],[16,18,18,21],[9,22,10,22],[28,0,28,4],[11,26,11,27],[27,15,27,17],[22,15,22,17],[16,15,18,17],[26,0,26,4],[27,0,27,4]]}
["MEAUX 2",null,null,null,null,null,null,null,null,null,null,null,null,null,null,"Saison 2023-2024"]
[null,"Joueur(es) participant à la rencontre",null,null,null,null,null,null,null,"Saisir votre liste complète en MAJUSCULES ",null,null,null,null,null,null,null,null,null,null,null,null,"Carte Verte","Carte Jaune","Carte Rose","Carte Bleue","5,0 Val",null,"Non Sélectionnables en EDF (hors Fidet)"]
[null,null,null,null,null,null,null,null,null,"Joueurs(es) qualifié(es) saison 2023 -2024",null,null,null,null,null,null,null,null,"Avec une date de validité"]
[]
["Statuts","Classif.","          Noms      /    Prénoms",null,"Numéros","ET","VALIDE",null,null,"Statuts","Classif.","          Noms      /    Prénoms",null,"Numéros"]
[null,null,null,null,null,{"$f":"IF(A6=\"ET\",1,\"\")","v":""},{"$f":"IF(B6=5,1,\"\")","v":""},null,null,null,null,null,null,0,null,"Elite Nationale Bastide Médical",null,null,14.5,null,"Maxi 17,5 pts",null,"+  1 ","+  2","+  1,5",null,"1 sur la feuille",null,"Pas de limite"]
[null,null,null,null,null,{"$f":"IF(A7=\"ET\",1,\"\")","v":""},{"$f":"IF(B7=5,1,\"\")","v":""},null,null,"N",4,"RODERER","M",2,null,null,null,null,null,null,"si cartes de couleurs",null,null,null,null,null,"et terrain"]
[null,null,null,null,null,{"$f":"IF(A8=\"ET\",1,\"\")","v":""},{"$f":"IF(B8=5,1,\"\")","v":""},null,null,null,null,null,null,4,null," Nationale 1",null,null,14.5,null,"Maxi 17,5 pts",null,"+  1 ,5","+  2,5","+  1,5",null,"1 sur la feuille",null,"4  Maxi / terrain     "]
[null,null,null,null,null,"","",null,null,"N",1,"DA SILVA","G",5,null,null,null,null,null,null,"si cartes de couleurs",null,null,null,null,null,"et terrain",null," (5 sur la feuille)"]
[null,null,null,null,null,"","",null,null,"F",2,"RUBLER","AS",6,null," Nationale 2",null,null,15,null,"Maxi 19 pts",null,"+  1,5","+  2,5","+  1,5","+  0,5","2 sur la feuille",null,"4  Maxi / terrain     "]
[null,null,null,null,null,"","",null,null,null,null,null,null,null,null,null,null,null,null,null,"si cartes de couleurs",null,null,null,null,null,"2 sur le terrain",null," (5 sur la feuille)"]
[null,null,null,null,null,"","",null,null,null,null,null,null,null,null," Nationale 3",null,null,15.5,null,null,null,"+  1,5","+  2,5","+  1,5","+  0,5"]
[null,null,null,null,null,"","",null,null,"J",2,"MEDUS","K",9,null,null,null,null,"Si 16pts début match-handicap de 10pts",null,"Maxi 19 pts",null,null,null,null,null,"2 sur la feuille",null,"4 Maxi / terrain"]
[null,null,null,null,null,"","",null,null,null,null,null,null,10,null,null,null,null,null,null,"si cartes de couleurs",null,null,null,null,null,"2 sur le terrain",null," (5 sur la feuille)"]
[null,null,null,null,null,"","",null,null,"N",4,"FAHRASMANE","M",11]
[null,null,null,null,null,"","",null,null,"N",5,"ZOCLY","S",12,null,"Inscrire dans la colonne de gauche les \"Statuts\" des joueurs de l'équipe"]
[null,null,null,null,null,"","","",null,"ET",3,"LOMTADZE","G",13,null,"J",null,null,"Pour les cartes Vertes",null,null,null,"Jeune joueur (U19 en Elite Nationale Bastide Médical)"]
[null,null,null,null,null,"","","",null,"N",3,"CARLOMAN","M",14,null,null,null,null,null,null,null,null,"Joueur débutant, sélectionnable en Equipe de France"]
[null,null,null,null,null,"","","",null,null,null,null,null,15,null,null,null,null,null,null,null,null,"seulement (attention à la date de validité juqu'à 22 ans révolu)"]
[null,null,null,null,null,"","",null,null,"N",4,"AZOTO","M",23,null,"JF",null,null,"Pour les cartes Jaunes",null,null,null,"Jeune joueuse (U19 en Elite Nationale Bastide Médical)"]
[null,null,null,null,null,"","","",null,null,null,null,null,null,null,null,null,null,null,null,null,null,"Joueuse débutante, sélectionnable en Equipe de France"]
[null,null,null,null,null,"","",null,null,null,null,null,null,null,null,null,null,null,null,null,null,null,"seulement (attention à la date de validité juqu' à 22 ans révolu)"]
[null,null,null,null,null,"","",null,null,null,null,null,null,null,null,"F ou FET",null,null,"Pour les cartes roses",null,null,null,"Pour les femmes ou femmes étrangères <5pts  (Bonus 1,5 pts)"]
[null,null,null,null,null,"","",null,null,null,null,null,null,null,null,"En Nationale 2 et 3 uniquement (joueuses et joueurs de plus de 55 ans)"]
[null,null,null,null,null,"","",null,null,null,null,null,null,null,null,"S",null,null,"Pour les hommes séniors",null,null,null," Français ou Etrangers (Bonus de 0,5pt)"]
[null,null,null,null,null,null,null,null,null,null,null,null,null,null,null,"FS",null,null,"   Pour les femmes seniors",null,null,null," (Bonus 2pts)      "]
[" Joueurs-joueuses valides de l'équipe (5 points)",null,null,null,null,null,null,null,null,null,null,null,null,null,null,"JS",null,null," Pour les jeunes hommes séniors",null,null,null," Débutants  (Bonus 2pts)  validité (<3pts 2ans)       ( > 3pts 1 an)"]
[{"$f":"IF(G31=0,\"\",IF(G31>1,\"Trop de valides sur le terrain\",\"OK\"))","v":""},null,null,null,null,null,null,null,null,null,null,null,null,null,null,"JFS",null,null," Pour les jeunes femmes séniors",null,null,null," Débutantes  (Bonus 3pts)  validité (<3pts 2ans)     ( > 3pts 1 an)"]
["Joueurs étrangers ",null,null,null,null,null,null,null,null,null,null,null,null,null,null,"Autres possibilités (sans Bonus)"]
[{"$f":"IF(F31=0,\"\",IF(F31>5,\"Trop de joueurs étrangers sur la feuille\",\"OK\"))","v":""},null,null,null,null,null,null,null,null,null,null,null,null,null,null,"ET",null,null,"Pour un joueur étranger"]
[null,null,null,null,null,{"$f":"SUM(F6:F28)","v":0},{"$f":"SUM(G6:G30)","v":0},null,null,null,null,null,null,null,null,"FID",null,null,"Pour un joueur fidèle"]
[null,null,null,null,null,null,null,null,null,null,null,null,null,null,null,"N",null,null,"Pour tous joueurs sans symbole sur la carte de classification"]

{"sheet":"MEYLAN","index":28,"n_rows":32,"n_cols":29,"rows_kept":32,"cut":false,"hidden":false,"merged":[[31,15,31,17],[24,15,24,17],[25,15,25,17],[26,15,26,17],[28,15,28,29],[30,15,30,17],[29,15,29,17],[11,22,14,22],[11,23,14,23],[11,24,14,24],[11,25,14,25],[11,28,11,29],[12,26,12,27],[12,28,12,29],[13,26,13,27],[13,28,13,29],[14,26,14,27],[14,28,14,29],[9,23,10,23],[9,24,10,24],[9,25,10,25],[9,28,9,29],[10,28,10,29],[8,28,8,29],[5,15,6,17],[5,18,6,19],[5,22,6,22],[5,23,6,23],[5,24,6,24],[9,15,10,17],[9,18,10,19],[0,15,0,29],[1,22,3,22],[1,23,3,23],[1,24,3,24],[1,25,3,25],[1,26,3,27],[1,28,3,29],[5,28,6,29],[7,15,8,17],[7,18,8,19],[7,22,8,22],[7,23,8,23],[7,24,8,24],[7,28,7,29],[15,15,15,29],[19,15,21,17],[10,20,10,21],[11,20,11,21],[2,9,2,13],[5,26,5,27],[6,26,6,27],[5,20,5,21],[6,20,6,21],[7,26,7,27],[8,26,8,27],[9,26,9,27],[10,26,10,27],[7,20,7,21],[8,20,8,21],[9,20,9,21],[11,15,14,17],[11,18,11,19],[12,18,14,19],[12,20,12,21],[13,20,13,21],[14,20,14,21],[29,0,29,4],[19,18,21,21],[22,18,22,21],[23,15,23,29],[1,0,2,0],[1,1,2,3],[1,9,1,13],[16,18,18,21],[9,22,10,22],[28,0,28,4],[11,26,11,27],[27,15,27,17],[22,15,22,17],[16,15,18,17],[26,0,26,4],[27,0,27,4]]}
["MEYLAN",null,null,null,null,null,null,null,null,null,null,null,null,null,null,"Saison 2023-2024"]
[null,"Joueur(es) participant à la rencontre",null,null,null,null,null,null,null,"Saisir votre liste complète en MAJUSCULES ",null,null,null,null,null,null,null,null,null,null,null,null,"Carte Verte","Carte Jaune","Carte Rose","Carte Bleue","5,0 Val",null,"Non Sélectionnables en EDF (hors Fidet)"]
[null,null,null,null,null,null,null,null,null,"Joueurs(es) qualifié(es) saison 2023 -2024",null,null,null,null,null,null,null,null,"Avec une date de validité"]
[]
["Statuts","Classif.","          Noms      /    Prénoms",null,"Numéros","ET","VALIDE",null,null,"Statuts","Classif.","          Noms      /    Prénoms",null,"Numéros"]
[null,null,null,null,null,{"$f":"IF(A6=\"ET\",1,\"\")","v":""},{"$f":"IF(B6=5,1,\"\")","v":""},null,null,null,null,null,null,4,null,"Elite Nationale Bastide Médical",null,null,14.5,null,"Maxi 17,5 pts",null,"+  1 ","+  2","+  1,5",null,"1 sur la feuille",null,"Pas de limite"]
[null,null,null,null,null,{"$f":"IF(A7=\"ET\",1,\"\")","v":""},{"$f":"IF(B7=5,1,\"\")","v":""},null,null,"JF",2,"SAVOYE","L",5,null,null,null,null,null,null,"si cartes de couleurs",null,null,null,null,null,"et terrain"]
[null,null,null,null,null,{"$f":"IF(A8=\"ET\",1,\"\")","v":""},{"$f":"IF(B8=5,1,\"\")","v":""},null,null,null,null,null,null,6,null," Nationale 1",null,null,14.5,null,"Maxi 17,5 pts",null,"+  1 ,5","+  2,5","+  1,5",null,"1 sur la feuille",null,"4  Maxi / terrain     "]
[null,null,null,null,null,"","",null,null,"N",1,"PARFAIT ABANA","S",7,null,null,null,null,null,null,"si cartes de couleurs",null,null,null,null,null,"et terrain",null," (5 sur la feuille)"]
[null,null,null,null,null,"","",null,null,null,null,null,null,8,null," Nationale 2",null,null,15,null,"Maxi 19 pts",null,"+  1,5","+  2,5","+  1,5","+  0,5","2 sur la feuille",null,"4  Maxi / terrain     "]
[null,null,null,null,null,"","",null,null,null,null,null,null,9,null,null,null,null,null,null,"si cartes de couleurs",null,null,null,null,null,"2 sur le terrain",null," (5 sur la feuille)"]
[null,null,null,null,null,"","",null,null,null,null,null,null,10,null," Nationale 3",null,null,15.5,null,null,null,"+  1,5","+  2,5","+  1,5","+  0,5"]
[null,null,null,null,null,"","",null,null,"N",1.5,"LATRECHE","A",11,null,null,null,null,"Si 16pts début match-handicap de 10pts",null,"Maxi 19 pts",null,null,null,null,null,"2 sur la feuille",null,"4 Maxi / terrain"]
[null,null,null,null,null,"","",null,null,null,null,null,null,15,null,null,null,null,null,null,"si cartes de couleurs",null,null,null,null,null,"2 sur le terrain",null," (5 sur la feuille)"]
[null,null,null,null,null,"","",null,null,"FID",4,"NDI","H",17]
[null,null,null,null,null,"","",null,null,null,null,null,null,23,null,"Inscrire dans la colonne de gauche les \"Statuts\" des joueurs de l'équipe"]
[null,null,null,null,null,"","","",null,"J",1.5,"MAURIN","A",26,null,"J",null,null,"Pour les cartes Vertes",null,null,null,"Jeune joueur (U19 en Elite Nationale Bastide Médical)"]
[null,null,null,null,null,"","","",null,"N",1.5,"MORETON","A",30,null,null,null,null,null,null,null,null,"Joueur débutant, sélectionnable en Equipe de France"]
[null,null,null,null,null,"","","",null,"N",4,"KHERBACHE","F",32,null,null,null,null,null,null,null,null,"seulement (attention à la date de validité juqu'à 22 ans révolu)"]
[null,null,null,null,null,"","",null,null,null,null,null,null,47,null,"JF",null,null,"Pour les cartes Jaunes",null,null,null,"Jeune joueuse (U19 en Elite Nationale Bastide Médical)"]
[null,null,null,null,null,"","","",null,null,null,null,null,50,null,null,null,null,null,null,null,null,"Joueuse débutante, sélectionnable en Equipe de France"]
[null,null,null,null,null,"","",null,null,"N",4,"LEVRAT","D",84,null,null,null,null,null,null,null,null,"seulement (attention à la date de validité juqu' à 22 ans révolu)"]
[null,null,null,null,null,"","",null,null,"N",5,"DULONG","A",99,null,"F ou FET",null,null,"Pour les cartes roses",null,null,null,"Pour les femmes ou femmes étrangères <5pts  (Bonus 1,5 pts)"]
[null,null,null,null,null,"","",null,null,null,null,null,null,null,null,"En Nationale 2 et 3 uniquement (joueuses et joueurs de plus de 55 ans)"]
[null,null,null,null,null,"","",null,null,null,null,null,null,null,null,"S",null,null,"Pour les hommes séniors",null,null,null," Français ou Etrangers (Bonus de 0,5pt)"]
[null,null,null,null,null,null,null,null,null,null,null,null,null,null,null,"FS",null,null,"   Pour les femmes seniors",null,null,null," (Bonus 2pts)      "]
[" Joueurs-joueuses valides de l'équipe (5 points)",null,null,null,null,null,null,null,null,null,null,null,null,null,null,"JS",null,null," Pour les jeunes hommes séniors",null,null,null," Débutants  (Bonus 2pts)  validité (<3pts 2ans)       ( > 3pts 1 an)"]
[{"$f":"IF(G31=0,\"\",IF(G31>1,\"Trop de valides sur le terrain\",\"OK\"))","v":""},null,null,null,null,null,null,null,null,null,null,null,null,null,null,"JFS",null,null," Pour les jeunes femmes séniors",null,null,null," Débutantes  (Bonus 3pts)  validité (<3pts 2ans)     ( > 3pts 1 an)"]
["Joueurs étrangers ",null,null,null,null,null,null,null,null,null,null,null,null,null,null,"Autres possibilités (sans Bonus)"]
[{"$f":"IF(F31=0,\"\",IF(F31>5,\"Trop de joueurs étrangers sur la feuille\",\"OK\"))","v":""},null,null,null,null,null,null,null,null,null,null,null,null,null,null,"ET",null,null,"Pour un joueur étranger"]
[null,null,null,null,null,{"$f":"SUM(F6:F28)","v":0},{"$f":"SUM(G6:G30)","v":0},null,null,null,null,null,null,null,null,"FID",null,null,"Pour un joueur fidèle"]
[null,null,null,null,null,null,null,null,null,null,null,null,null,null,null,"N",null,null,"Pour tous joueurs sans symbole sur la carte de classification"]

{"sheet":"STRASBOURG","index":29,"n_rows":32,"n_cols":29,"rows_kept":32,"cut":false,"hidden":false,"merged":[[30,15,30,17],[31,15,31,17],[22,18,22,21],[23,15,23,29],[24,15,24,17],[25,15,25,17],[26,15,26,17],[29,15,29,17],[28,15,28,29],[27,15,27,17],[22,15,22,17],[14,26,14,27],[14,28,14,29],[15,15,15,29],[19,15,21,17],[19,18,21,21],[16,15,18,17],[16,18,18,21],[9,28,9,29],[10,28,10,29],[11,15,14,17],[11,18,11,19],[11,22,14,22],[11,23,14,23],[11,24,14,24],[11,25,14,25],[11,28,11,29],[12,18,14,19],[12,20,12,21],[12,26,12,27],[12,28,12,29],[13,20,13,21],[13,26,13,27],[13,28,13,29],[5,26,5,27],[5,20,5,21],[6,20,6,21],[0,15,0,29],[1,22,3,22],[1,23,3,23],[1,24,3,24],[1,25,3,25],[1,26,3,27],[1,28,3,29],[7,23,8,23],[7,24,8,24],[8,20,8,21],[5,28,6,29],[7,15,8,17],[7,18,8,19],[6,26,6,27],[7,26,7,27],[8,26,8,27],[7,28,7,29],[8,28,8,29],[5,15,6,17],[5,18,6,19],[5,22,6,22],[5,23,6,23],[5,24,6,24],[9,23,10,23],[9,24,10,24],[11,20,11,21],[11,26,11,27],[9,25,10,25],[10,20,10,21],[9,26,9,27],[10,26,10,27],[9,18,10,19],[9,22,10,22],[14,20,14,21],[1,0,2,0],[1,1,2,3],[1,9,1,13],[9,20,9,21],[9,15,10,17],[7,20,7,21],[7,22,8,22],[29,0,29,4],[26,0,26,4],[27,0,27,4],[28,0,28,4],[2,9,2,13]]}
["STRASBOURG",null,null,null,null,null,null,null,null,null,null,null,null,null,null,"Saison 2023-2024"]
[null,"Joueur(es) participant à la rencontre",null,null,null,null,null,null,null,"Saisir votre liste complète en MAJUSCULES ",null,null,null,null,null,null,null,null,null,null,null,null,"Carte Verte","Carte Jaune","Carte Rose","Carte Bleue","5,0 Val",null,"Non Sélectionnables en EDF (hors Fidet)"]
[null,null,null,null,null,null,null,null,null,"Joueurs(es) qualifié(es) saison 2023 -2024",null,null,null,null,null,null,null,null,"Avec une date de validité"]
[]
["Statuts","Classif.","          Noms      /    Prénoms",null,"Numéros","ET","VALIDE",null,null,"Statuts","Classif.","          Noms      /    Prénoms",null,"Numéros"]
[null,null,null,null,null,{"$f":"IF(A6=\"ET\",1,\"\")","v":""},{"$f":"IF(B6=5,1,\"\")","v":""},null,null,"FID",2,"SHITTU","M",4,null,"Elite Nationale Bastide Médical",null,null,14.5,null,"Maxi 17,5 pts",null,"+  1 ","+  2","+  1,5",null,"1 sur la feuille",null,"Pas de limite"]
[null,null,null,null,null,{"$f":"IF(A7=\"ET\",1,\"\")","v":""},{"$f":"IF(B7=5,1,\"\")","v":""},null,null,"N",3.5,"NDAO","S",5,null,null,null,null,null,null,"si cartes de couleurs",null,null,null,null,null,"et terrain"]
[null,null,null,null,null,{"$f":"IF(A8=\"ET\",1,\"\")","v":""},{"$f":"IF(B8=5,1,\"\")","v":""},null,null,"FID",1,"MTATASE","A",6,null," Nationale 1",null,null,14.5,null,"Maxi 17,5 pts",null,"+  1 ,5","+  2,5","+  1,5",null,"1 sur la feuille",null,"4  Maxi / terrain     "]
[null,null,null,null,null,"","",null,null,"FID",3,"IBRAHIM","L",7,null,null,null,null,null,null,"si cartes de couleurs",null,null,null,null,null,"et terrain",null," (5 sur la feuille)"]
[null,null,null,null,null,"","",null,null,null,null,null,null,8,null," Nationale 2",null,null,15,null,"Maxi 19 pts",null,"+  1,5","+  2,5","+  1,5","+  0,5","2 sur la feuille",null,"4  Maxi / terrain     "]
[null,null,null,null,null,"","",null,null,null,null,null,null,9,null,null,null,null,null,null,"si cartes de couleurs",null,null,null,null,null,"2 sur le terrain",null," (5 sur la feuille)"]
[null,null,null,null,null,"","",null,null,null,null,null,null,10,null," Nationale 3",null,null,15.5,null,null,null,"+  1,5","+  2,5","+  1,5","+  0,5"]
[null,null,null,null,null,"","",null,null,null,null,null,null,11,null,null,null,null,"Si 16pts début match-handicap de 10pts",null,"Maxi 19 pts",null,null,null,null,null,"2 sur la feuille",null,"4 Maxi / terrain"]
[null,null,null,null,null,"","",null,null,null,null,null,null,12,null,null,null,null,null,null,"si cartes de couleurs",null,null,null,null,null,"2 sur le terrain",null," (5 sur la feuille)"]
[null,null,null,null,null,"","",null,null,"N",3.5,"DIENG","A",13]
[null,null,null,null,null,"","",null,null,"ET",3.5,"OYELAMI","OM",14,null,"Inscrire dans la colonne de gauche les \"Statuts\" des joueurs de l'équipe"]
[null,null,null,null,null,"","","",null,"FID",3,"SOLTYKHANOV","A",15,null,"J",null,null,"Pour les cartes Vertes",null,null,null,"Jeune joueur (U19 en Elite Nationale Bastide Médical)"]
[null,null,null,null,null,"","","",null,null,null,null,null,16,null,null,null,null,null,null,null,null,"Joueur débutant, sélectionnable en Equipe de France"]
[null,null,null,null,null,"","","",null,null,null,null,null,17,null,null,null,null,null,null,null,null,"seulement (attention à la date de validité juqu'à 22 ans révolu)"]
[null,null,null,null,null,"","",null,null,"N",1.5,"NOVAS","M",22,null,"JF",null,null,"Pour les cartes Jaunes",null,null,null,"Jeune joueuse (U19 en Elite Nationale Bastide Médical)"]
[null,null,null,null,null,"","","",null,"J",4.5,"HOFFBECK","M",24,null,null,null,null,null,null,null,null,"Joueuse débutante, sélectionnable en Equipe de France"]
[null,null,null,null,null,"","",null,null,"ET",3.5,"OGUNBONA","H",29,null,null,null,null,null,null,null,null,"seulement (attention à la date de validité juqu' à 22 ans révolu)"]
[null,null,null,null,null,"","",null,null,"ET",4,"ATIFI",null,44,null,"F ou FET",null,null,"Pour les cartes roses",null,null,null,"Pour les femmes ou femmes étrangères <5pts  (Bonus 1,5 pts)"]
[null,null,null,null,null,"","",null,null,"N",5,"BOHN","M",51,null,"En Nationale 2 et 3 uniquement (joueuses et joueurs de plus de 55 ans)"]
[null,null,null,null,null,"","",null,null,"N",1,"KNOERRR","S",99,null,"S",null,null,"Pour les hommes séniors",null,null,null," Français ou Etrangers (Bonus de 0,5pt)"]
[null,null,null,null,null,null,null,null,null,null,null,null,null,null,null,"FS",null,null,"   Pour les femmes seniors",null,null,null," (Bonus 2pts)      "]
[" Joueurs-joueuses valides de l'équipe (5 points)",null,null,null,null,null,null,null,null,null,null,null,null,null,null,"JS",null,null," Pour les jeunes hommes séniors",null,null,null," Débutants  (Bonus 2pts)  validité (<3pts 2ans)       ( > 3pts 1 an)"]
[{"$f":"IF(G31=0,\"\",IF(G31>1,\"Trop de valides sur le terrain\",\"OK\"))","v":""},null,null,null,null,null,null,null,null,null,null,null,null,null,null,"JFS",null,null," Pour les jeunes femmes séniors",null,null,null," Débutantes  (Bonus 3pts)  validité (<3pts 2ans)     ( > 3pts 1 an)"]
["Joueurs étrangers ",null,null,null,null,null,null,null,null,null,null,null,null,null,null,"Autres possibilités (sans Bonus)"]
[{"$f":"IF(F31=0,\"\",IF(F31>5,\"Trop de joueurs étrangers sur la feuille\",\"OK\"))","v":""},null,null,null,null,null,null,null,null,null,null,null,null,null,null,"ET",null,null,"Pour un joueur étranger"]
[null,null,null,null,null,{"$f":"SUM(F6:F28)","v":0},{"$f":"SUM(G6:G30)","v":0},null,null,null,null,null,null,null,null,"FID",null,null,"Pour un joueur fidèle"]
[null,null,null,null,null,null,null,null,null,null,null,null,null,null,null,"N",null,null,"Pour tous joueurs sans symbole sur la carte de classification"]

{"sheet":"ENT BELFORT BESANCON 1","index":30,"n_rows":32,"n_cols":29,"rows_kept":32,"cut":false,"hidden":false,"merged":[[31,15,31,17],[24,15,24,17],[25,15,25,17],[26,15,26,17],[28,15,28,29],[30,15,30,17],[22,18,22,21],[23,15,23,29],[16,15,18,17],[16,18,18,21],[22,15,22,17],[15,15,15,29],[19,15,21,17],[19,18,21,21],[14,20,14,21],[14,26,14,27],[14,28,14,29],[9,28,9,29],[10,28,10,29],[11,15,14,17],[11,18,11,19],[11,22,14,22],[11,23,14,23],[11,24,14,24],[11,25,14,25],[11,28,11,29],[12,18,14,19],[12,20,12,21],[12,26,12,27],[12,28,12,29],[13,20,13,21],[13,26,13,27],[13,28,13,29],[9,15,10,17],[9,18,10,19],[9,22,10,22],[9,23,10,23],[9,24,10,24],[5,28,6,29],[7,15,8,17],[7,18,8,19],[7,22,8,22],[7,23,8,23],[7,24,8,24],[7,28,7,29],[8,28,8,29],[5,15,6,17],[5,18,6,19],[7,26,7,27],[5,26,5,27],[5,20,5,21],[5,22,6,22],[5,23,6,23],[5,24,6,24],[29,0,29,4],[26,0,26,4],[27,0,27,4],[27,15,27,17],[28,0,28,4],[29,15,29,17],[7,20,7,21],[11,20,11,21],[11,26,11,27],[8,26,8,27],[9,20,9,21],[9,26,9,27],[10,20,10,21],[10,26,10,27],[8,20,8,21],[9,25,10,25],[0,15,0,29],[1,22,3,22],[1,23,3,23],[1,24,3,24],[1,25,3,25],[1,26,3,27],[1,28,3,29],[1,0,2,0],[1,1,2,3],[1,9,1,13],[6,26,6,27],[6,20,6,21],[2,9,2,13]]}
["ENT BELFORT BESANCON 1",null,null,null,null,null,null,null,null,null,null,null,null,null,null,"Saison 2023-2024"]
[null,"Joueur(es) participant à la rencontre",null,null,null,null,null,null,null,"Saisir votre liste complète en MAJUSCULES ",null,null,null,null,null,null,null,null,null,null,null,null,"Carte Verte","Carte Jaune","Carte Rose","Carte Bleue","5,0 Val",null,"Non Sélectionnables en EDF (hors Fidet)"]
[null,null,null,null,null,null,null,null,null,"Joueurs(es) qualifié(es) saison 2023 -2024",null,null,null,null,null,null,null,null,"Avec une date de validité"]
[]
["Statuts","Classif.","          Noms      /    Prénoms",null,"Numéros","ET","VALID","",null,"Statuts","Classif.","          Noms      /    Prénoms",null,"Numéros"]
[null,null,null,null,null,{"$f":"IF(A6=\"ET\",1,\"\")","v":""},{"$f":"IF(B6=5,1,\"\")","v":""},"",null,"N",4.5,"GRILLOT","A",4,null,"Elite Nationale Bastide Médical",null,null,14.5,null,"Maxi 17,5 pts",null,"+  1 ","+  2","+  1,5",null,"1 sur la feuille",null,"Pas de limite"]
[null,null,null,null,null,{"$f":"IF(A7=\"ET\",1,\"\")","v":""},{"$f":"IF(B7=5,1,\"\")","v":""},null,null,"N",4.5,"CIELI","A",5,null,null,null,null,null,null,"si cartes de couleurs",null,null,null,null,null,"et terrain"]
[null,null,null,null,null,{"$f":"IF(A8=\"ET\",1,\"\")","v":""},{"$f":"IF(B8=5,1,\"\")","v":""},"",null,"N",1,"DJENIDI","R",6,null," Nationale 1",null,null,14.5,null,"Maxi 17,5 pts",null,"+  1 ,5","+  2,5","+  1,5",null,"1 sur la feuille",null,"4  Maxi / terrain     "]
[null,null,null,null,null,"","",null,null,"FID",2.5,"NSEM  MEDJOTO","P",7,null,null,null,null,null,null,"si cartes de couleurs",null,null,null,null,null,"et terrain",null," (5 sur la feuille)"]
[null,null,null,null,null,"","","",null,"N",1,"GOUJARD","F",8,null," Nationale 2",null,null,15,null,"Maxi 19 pts",null,"+  1,5","+  2,5","+  1,5","+  0,5","2 sur la feuille",null,"4  Maxi / terrain     "]
[null,null,null,null,null,"","","",null,"J",2.5,"CARDINEAU","D",9,null,null,null,null,null,null,"si cartes de couleurs",null,null,null,null,null,"2 sur le terrain",null," (5 sur la feuille)"]
[null,null,null,null,null,"","","",null,null,null,null,null,10,null," Nationale 3",null,null,15.5,null,null,null,"+  1,5","+  2,5","+  1,5","+  0,5"]
[null,null,null,null,null,"","","",null,null,null,null,null,11,null,null,null,null,"Si 16pts début match-handicap de 10pts",null,"Maxi 19 pts",null,null,null,null,null,"2 sur la feuille",null,"4 Maxi / terrain"]
[null,null,null,null,null,"","","",null,"N",2.5,"GALMICHE","L",12,null,null,null,null,null,null,"si cartes de couleurs",null,null,null,null,null,"2 sur le terrain",null," (5 sur la feuille)"]
[null,null,null,null,null,"","","",null,"N",2.5,"JEANNIN","M",13]
[null,null,null,null,null,"","","",null,"FID",3.5,"YANEU","E",14,null,"Inscrire dans la colonne de gauche les \"Statuts\" des joueurs de l'équipe"]
[null,null,null,null,null,"","","",null,"N",1,"CURTY","C",15,null,"J",null,null,"Pour les cartes Vertes",null,null,null,"Jeune joueur (U19 en Elite Nationale Bastide Médical)"]
[null,null,null,null,null,"","","",null,null,null,null,null,null,null,null,null,null,null,null,null,null,"Joueur débutant, sélectionnable en Equipe de France"]
[null,null,null,null,null,"","","",null,null,null,null,null,null,null,null,null,null,null,null,null,null,"seulement (attention à la date de validité juqu'à 22 ans révolu)"]
[null,null,null,null,null,"","",null,null,null,null,null,null,null,null,"JF",null,null,"Pour les cartes Jaunes",null,null,null,"Jeune joueuse (U19 en Elite Nationale Bastide Médical)"]
[null,null,null,null,null,"","","",null,null,null,null,null,null,null,null,null,null,null,null,null,null,"Joueuse débutante, sélectionnable en Equipe de France"]
[null,null,null,null,null,"","",null,null,null,null,null,null,null,null,null,null,null,null,null,null,null,"seulement (attention à la date de validité juqu' à 22 ans révolu)"]
[null,null,null,null,null,"","",null,null,null,null,null,null,null,null,"F ou FET",null,null,"Pour les cartes roses",null,null,null,"Pour les femmes ou femmes étrangères <5pts  (Bonus 1,5 pts)"]
[null,null,null,null,null,"","",null,null,null,null,null,null,null,null,"En Nationale 2 et 3 uniquement (joueuses et joueurs de plus de 55 ans)"]
[null,null,null,null,null,"","",null,null,null,null,null,null,null,null,"S",null,null,"Pour les hommes séniors",null,null,null," Français ou Etrangers (Bonus de 0,5pt)"]
[null,null,null,null,null,"","",null,null,null,null,null,null,null,null,"FS",null,null,"   Pour les femmes seniors",null,null,null," (Bonus 2pts)      "]
[" Joueurs-joueuses valides de l'équipe (5 points)",null,null,null,null,"","",null,null,null,null,null,null,null,null,"JS",null,null," Pour les jeunes hommes séniors",null,null,null," Débutants  (Bonus 2pts)  validité (<3pts 2ans)       ( > 3pts 1 an)"]
[{"$f":"IF(G31=0,\"\",IF(G31>2,\"Trop de valides sur le terrain\",\"OK\"))","v":""},null,null,null,null,"","",null,null,null,null,null,null,null,null,"JFS",null,null," Pour les jeunes femmes séniors",null,null,null," Débutantes  (Bonus 3pts)  validité (<3pts 2ans)     ( > 3pts 1 an)"]
["Joueurs étrangers ",null,null,null,null,"","",null,null,null,null,null,null,null,null,"Autres possibilités (sans Bonus)"]
[{"$f":"IF(F31=0,\"\",IF(F31>5,\"Trop de joueurs étrangers sur la feuille\",\"OK\"))","v":""},null,null,null,null,"","",null,null,null,null,null,null,null,null,"ET",null,null,"Pour un joueur étranger"]
[null,null,null,null,null,{"$f":"SUM(F6:F28)","v":0},{"$f":"SUM(G6:G28)","v":0},null,null,null,null,null,null,null,null,"FID",null,null,"Pour un joueur fidèle"]
[null,null,null,null,null,null,null,null,null,null,null,null,null,null,null,"N",null,null,"Pour tous joueurs sans symbole sur la carte de classification"]

{"sheet":"CAPPELLE LA GRANDE","index":31,"n_rows":32,"n_cols":29,"rows_kept":32,"cut":false,"hidden":false,"merged":[[31,15,31,17],[24,15,24,17],[25,15,25,17],[28,15,28,29],[29,15,29,17],[30,15,30,17],[15,15,15,29],[19,15,21,17],[19,18,21,21],[22,18,22,21],[23,15,23,29],[16,15,18,17],[16,18,18,21],[22,15,22,17],[13,20,13,21],[13,26,13,27],[13,28,13,29],[14,20,14,21],[14,26,14,27],[14,28,14,29],[5,28,6,29],[7,15,8,17],[7,18,8,19],[7,22,8,22],[7,23,8,23],[7,24,8,24],[7,28,7,29],[8,28,8,29],[7,20,7,21],[7,26,7,27],[8,20,8,21],[8,26,8,27],[5,15,6,17],[5,18,6,19],[5,26,5,27],[6,20,6,21],[0,15,0,29],[1,22,3,22],[1,23,3,23],[1,24,3,24],[1,25,3,25],[1,26,3,27],[1,28,3,29],[29,0,29,4],[26,0,26,4],[26,15,26,17],[27,0,27,4],[27,15,27,17],[28,0,28,4],[11,15,14,17],[11,18,11,19],[11,22,14,22],[10,26,10,27],[11,20,11,21],[11,26,11,27],[9,22,10,22],[9,23,10,23],[9,24,10,24],[9,25,10,25],[10,20,10,21],[9,15,10,17],[9,18,10,19],[9,20,9,21],[12,18,14,19],[12,20,12,21],[9,28,9,29],[10,28,10,29],[11,23,14,23],[11,24,14,24],[11,25,14,25],[11,28,11,29],[9,26,9,27],[12,26,12,27],[12,28,12,29],[6,26,6,27],[5,22,6,22],[5,23,6,23],[5,24,6,24],[1,0,2,0],[1,1,2,3],[1,9,1,13],[2,9,2,13],[5,20,5,21]]}
["CAPPELLE LA GRANDE",null,null,null,null,null,null,null,null,null,null,null,null,null,null,"Saison 2023-2024"]
[null,"Joueur(es) participant à la rencontre",null,null,null,null,null,null,null,"Saisir votre liste complète en MAJUSCULES ",null,null,null,null,null,null,null,null,null,null,null,null,"Carte Verte","Carte Jaune","Carte Rose","Carte Bleue","5,0 Val",null,"Non Sélectionnables en EDF (hors Fidet)"]
[null,null,null,null,null,null,null,null,null,"Joueurs(es) qualifié(es) saison 2023 -2024",null,null,null,null,null,null,null,null,"Avec une date de validité"]
[]
["Statuts","Classif.","          Noms      /    Prénoms",null,"Numéros","ET","VALID","",null,"Statuts","Classif.","          Noms      /    Prénoms",null,"Numéros"]
[null,null,null,null,null,{"$f":"IF(A6=\"ET\",1,\"\")","v":""},{"$f":"IF(B6=5,1,\"\")","v":""},"",null,"J",3.5,"HNEMELRYCK","T",4,null,"Elite Nationale Bastide Médical",null,null,14.5,null,"Maxi 17,5 pts",null,"+  1 ","+  2","+  1,5",null,"1 sur la feuille",null,"Pas de limite"]
[null,null,null,null,null,{"$f":"IF(A7=\"ET\",1,\"\")","v":""},{"$f":"IF(B7=5,1,\"\")","v":""},null,null,"N",4,"KHALALI","R",5,null,null,null,null,null,null,"si cartes de couleurs",null,null,null,null,null,"et terrain"]
[null,null,null,null,null,{"$f":"IF(A8=\"ET\",1,\"\")","v":""},{"$f":"IF(B8=5,1,\"\")","v":""},"",null,"N",1,"JAMOTTE","C",6,null," Nationale 1",null,null,14.5,null,"Maxi 17,5 pts",null,"+  1 ,5","+  2,5","+  1,5",null,"1 sur la feuille",null,"4  Maxi / terrain     "]
[null,null,null,null,null,"","",null,null,"N",5,"DELPIERRE","R",7,null,null,null,null,null,null,"si cartes de couleurs",null,null,null,null,null,"et terrain",null," (5 sur la feuille)"]
[null,null,null,null,null,"","","",null,"N",5,"DELPIERRE","G",8,null," Nationale 2",null,null,15,null,"Maxi 19 pts",null,"+  1,5","+  2,5","+  1,5","+  0,5","2 sur la feuille",null,"4  Maxi / terrain     "]
[null,null,null,null,null,"","","",null,"FS",4.5,"SAINT OMER","F",9,null,null,null,null,null,null,"si cartes de couleurs",null,null,null,null,null,"2 sur le terrain",null," (5 sur la feuille)"]
[null,null,null,null,null,"","","",null,"N",1.5,"FAVEEUW","J",10,null," Nationale 3",null,null,15.5,null,null,null,"+  1,5","+  2,5","+  1,5","+  0,5"]
[null,null,null,null,null,"","","",null,"N",2.5,"GEESEN","G",11,null,null,null,null,"Si 16pts début match-handicap de 10pts",null,"Maxi 19 pts",null,null,null,null,null,"2 sur la feuille",null,"4 Maxi / terrain"]
[null,null,null,null,null,"","","",null,null,null,null,null,12,null,null,null,null,null,null,"si cartes de couleurs",null,null,null,null,null,"2 sur le terrain",null," (5 sur la feuille)"]
[null,null,null,null,null,"","","",null,"N",1.5,"BARRA","R",13]
[null,null,null,null,null,"","","",null,"N",4.5,"DELEMME","T",14,null,"Inscrire dans la colonne de gauche les \"Statuts\" des joueurs de l'équipe"]
[null,null,null,null,null,"","","",null,"J",1,"VERLAND","E",19,null,"J",null,null,"Pour les cartes Vertes",null,null,null,"Jeune joueur (U19 en Elite Nationale Bastide Médical)"]
[null,null,null,null,null,"","","",null,null,null,null,null,20,null,null,null,null,null,null,null,null,"Joueur débutant, sélectionnable en Equipe de France"]
[null,null,null,null,null,"","","",null,null,null,null,null,21,null,null,null,null,null,null,null,null,"seulement (attention à la date de validité juqu'à 22 ans révolu)"]
[null,null,null,null,null,"","",null,null,null,null,null,null,22,null,"JF",null,null,"Pour les cartes Jaunes",null,null,null,"Jeune joueuse (U19 en Elite Nationale Bastide Médical)"]
[null,null,null,null,null,"","","",null,null,null,null,null,23,null,null,null,null,null,null,null,null,"Joueuse débutante, sélectionnable en Equipe de France"]
[null,null,null,null,null,"","",null,null,null,null,null,null,24,null,null,null,null,null,null,null,null,"seulement (attention à la date de validité juqu' à 22 ans révolu)"]
[null,null,null,null,null,"","",null,null,null,null,null,null,25,null,"F ou FET",null,null,"Pour les cartes roses",null,null,null,"Pour les femmes ou femmes étrangères <5pts  (Bonus 1,5 pts)"]
[null,null,null,null,null,"","",null,null,null,null,null,null,null,null,"En Nationale 2 et 3 uniquement (joueuses et joueurs de plus de 55 ans)"]
[null,null,null,null,null,"","",null,null,null,null,null,null,null,null,"S",null,null,"Pour les hommes séniors",null,null,null," Français ou Etrangers (Bonus de 0,5pt)"]
[null,null,null,null,null,"","",null,null,null,null,null,null,null,null,"FS",null,null,"   Pour les femmes seniors",null,null,null," (Bonus 2pts)      "]
[" Joueurs-joueuses valides de l'équipe (5 points)",null,null,null,null,"","",null,null,null,null,null,null,null,null,"JS",null,null," Pour les jeunes hommes séniors",null,null,null," Débutants  (Bonus 2pts)  validité (<3pts 2ans)       ( > 3pts 1 an)"]
[{"$f":"IF(G31=0,\"\",IF(G31>2,\"Trop de valides sur le terrain\",\"OK\"))","v":""},null,null,null,null,"","",null,null,null,null,null,null,null,null,"JFS",null,null," Pour les jeunes femmes séniors",null,null,null," Débutantes  (Bonus 3pts)  validité (<3pts 2ans)     ( > 3pts 1 an)"]
["Joueurs étrangers ",null,null,null,null,"","",null,null,null,null,null,null,null,null,"Autres possibilités (sans Bonus)"]
[{"$f":"IF(F31=0,\"\",IF(F31>5,\"Trop de joueurs étrangers sur la feuille\",\"OK\"))","v":""},null,null,null,null,"","",null,null,null,null,null,null,null,null,"ET",null,null,"Pour un joueur étranger"]
[null,null,null,null,null,{"$f":"SUM(F6:F28)","v":0},{"$f":"SUM(G6:G28)","v":0},null,null,null,null,null,null,null,null,"FID",null,null,"Pour un joueur fidèle"]
[null,null,null,null,null,null,null,null,null,null,null,null,null,null,null,"N",null,null,"Pour tous joueurs sans symbole sur la carte de classification"]

{"sheet":"CORBEIL","index":32,"n_rows":32,"n_cols":29,"rows_kept":32,"cut":false,"hidden":false,"merged":[[30,15,30,17],[31,15,31,17],[23,15,23,29],[24,15,24,17],[25,15,25,17],[26,15,26,17],[28,15,28,29],[2,9,2,13],[5,20,5,21],[5,26,5,27],[0,15,0,29],[1,22,3,22],[1,23,3,23],[1,24,3,24],[1,25,3,25],[1,26,3,27],[1,28,3,29],[5,15,6,17],[5,18,6,19],[5,22,6,22],[5,23,6,23],[5,24,6,24],[5,28,6,29],[7,15,8,17],[7,18,8,19],[7,22,8,22],[7,23,8,23],[6,26,6,27],[7,20,7,21],[7,26,7,27],[7,24,8,24],[6,20,6,21],[7,28,7,29],[8,28,8,29],[8,20,8,21],[9,15,10,17],[9,18,10,19],[9,22,10,22],[9,23,10,23],[10,20,10,21],[8,26,8,27],[9,20,9,21],[9,26,9,27],[9,24,10,24],[9,25,10,25],[9,28,9,29],[10,28,10,29],[10,26,10,27],[11,15,14,17],[11,18,11,19],[11,22,14,22],[11,23,14,23],[12,18,14,19],[12,20,12,21],[13,20,13,21],[14,20,14,21],[11,20,11,21],[11,26,11,27],[11,24,14,24],[11,25,14,25],[11,28,11,29],[12,26,12,27],[12,28,12,29],[13,26,13,27],[13,28,13,29],[14,26,14,27],[14,28,14,29],[15,15,15,29],[1,0,2,0],[1,1,2,3],[1,9,1,13],[29,0,29,4],[26,0,26,4],[27,0,27,4],[27,15,27,17],[28,0,28,4],[29,15,29,17],[22,15,22,17],[19,15,21,17],[19,18,21,21],[22,18,22,21],[16,15,18,17],[16,18,18,21]]}
["CORBEIL",null,null,null,null,null,null,null,null,null,null,null,null,null,null,"Saison 2023-2024"]
[null,"Joueur(es) participant à la rencontre",null,null,null,null,null,null,null,"Saisir votre liste complète en MAJUSCULES ",null,null,null,null,null,null,null,null,null,null,null,null,"Carte Verte","Carte Jaune","Carte Rose","Carte Bleue","5,0 Val",null,"Non Sélectionnables en EDF (hors Fidet)"]
[null,null,null,null,null,null,null,null,null,"Joueurs(es) qualifié(es) saison 2023 -2024",null,null,null,null,null,null,null,null,"Avec une date de validité"]
[]
["Statuts","Classif.","          Noms      /    Prénoms",null,"Numéros","ET","VALID","",null,"Statuts","Classif.","          Noms      /    Prénoms",null,"Numéros"]
[null,null,null,null,null,{"$f":"IF(A6=\"ET\",1,\"\")","v":""},{"$f":"IF(B6=5,1,\"\")","v":""},"",null,"J",1,"DIJON","P",4,null,"Elite Nationale Bastide Médical",null,null,14.5,null,"Maxi 17,5 pts",null,"+  1 ","+  2","+  1,5",null,"1 sur la feuille",null,"Pas de limite"]
[null,null,null,null,null,{"$f":"IF(A7=\"ET\",1,\"\")","v":""},{"$f":"IF(B7=5,1,\"\")","v":""},null,null,null,null,null,null,5,null,null,null,null,null,null,"si cartes de couleurs",null,null,null,null,null,"et terrain"]
[null,null,null,null,null,{"$f":"IF(A8=\"ET\",1,\"\")","v":""},{"$f":"IF(B8=5,1,\"\")","v":""},"",null,null,null,null,null,6,null," Nationale 1",null,null,14.5,null,"Maxi 17,5 pts",null,"+  1 ,5","+  2,5","+  1,5",null,"1 sur la feuille",null,"4  Maxi / terrain     "]
[null,null,null,null,null,"","",null,null,"S",3.5,"CELESTIN","M",7,null,null,null,null,null,null,"si cartes de couleurs",null,null,null,null,null,"et terrain",null," (5 sur la feuille)"]
[null,null,null,null,null,"","","",null,"N",4,"NDOMANDJI","R",8,null," Nationale 2",null,null,15,null,"Maxi 19 pts",null,"+  1,5","+  2,5","+  1,5","+  0,5","2 sur la feuille",null,"4  Maxi / terrain     "]
[null,null,null,null,null,"","","",null,"N",1,"MALARDIER","G",9,null,null,null,null,null,null,"si cartes de couleurs",null,null,null,null,null,"2 sur le terrain",null," (5 sur la feuille)"]
[null,null,null,null,null,"","","",null,null,null,null,null,10,null," Nationale 3",null,null,15.5,null,null,null,"+  1,5","+  2,5","+  1,5","+  0,5"]
[null,null,null,null,null,"","","",null,null,null,null,null,11,null,null,null,null,"Si 16pts début match-handicap de 10pts",null,"Maxi 19 pts",null,null,null,null,null,"2 sur la feuille",null,"4 Maxi / terrain"]
[null,null,null,null,null,"","","",null,"N",1,"MARTEL","F",12,null,null,null,null,null,null,"si cartes de couleurs",null,null,null,null,null,"2 sur le terrain",null," (5 sur la feuille)"]
[null,null,null,null,null,"","","",null,"S",4,"FONTAINE","JP",13]
[null,null,null,null,null,"","","",null,null,null,null,null,30,null,"Inscrire dans la colonne de gauche les \"Statuts\" des joueurs de l'équipe"]
[null,null,null,null,null,"","","",null,"N",2,"KHIER","F",31,null,"J",null,null,"Pour les cartes Vertes",null,null,null,"Jeune joueur (U19 en Elite Nationale Bastide Médical)"]
[null,null,null,null,null,"","","",null,"N",4.5,"RAZOUANE","M",91,null,null,null,null,null,null,null,null,"Joueur débutant, sélectionnable en Equipe de France"]
[null,null,null,null,null,"","","",null,null,null,null,null,null,null,null,null,null,null,null,null,null,"seulement (attention à la date de validité juqu'à 22 ans révolu)"]
[null,null,null,null,null,"","",null,null,null,null,null,null,null,null,"JF",null,null,"Pour les cartes Jaunes",null,null,null,"Jeune joueuse (U19 en Elite Nationale Bastide Médical)"]
[null,null,null,null,null,"","","",null,null,null,null,null,null,null,null,null,null,null,null,null,null,"Joueuse débutante, sélectionnable en Equipe de France"]
[null,null,null,null,null,"","",null,null,null,null,null,null,null,null,null,null,null,null,null,null,null,"seulement (attention à la date de validité juqu' à 22 ans révolu)"]
[null,null,null,null,null,"","",null,null,null,null,null,null,null,null,"F ou FET",null,null,"Pour les cartes roses",null,null,null,"Pour les femmes ou femmes étrangères <5pts  (Bonus 1,5 pts)"]
[null,null,null,null,null,"","",null,null,null,null,null,null,null,null,"En Nationale 2 et 3 uniquement (joueuses et joueurs de plus de 55 ans)"]
[null,null,null,null,null,"","",null,null,null,null,null,null,null,null,"S",null,null,"Pour les hommes séniors",null,null,null," Français ou Etrangers (Bonus de 0,5pt)"]
[null,null,null,null,null,"","",null,null,null,null,null,null,null,null,"FS",null,null,"   Pour les femmes seniors",null,null,null," (Bonus 2pts)      "]
[" Joueurs-joueuses valides de l'équipe (5 points)",null,null,null,null,"","",null,null,null,null,null,null,null,null,"JS",null,null," Pour les jeunes hommes séniors",null,null,null," Débutants  (Bonus 2pts)  validité (<3pts 2ans)       ( > 3pts 1 an)"]
[{"$f":"IF(G31=0,\"\",IF(G31>2,\"Trop de valides sur le terrain\",\"OK\"))","v":""},null,null,null,null,"","",null,null,null,null,null,null,null,null,"JFS",null,null," Pour les jeunes femmes séniors",null,null,null," Débutantes  (Bonus 3pts)  validité (<3pts 2ans)     ( > 3pts 1 an)"]
["Joueurs étrangers ",null,null,null,null,"","",null,null,null,null,null,null,null,null,"Autres possibilités (sans Bonus)"]
[{"$f":"IF(F31=0,\"\",IF(F31>5,\"Trop de joueurs étrangers sur la feuille\",\"OK\"))","v":""},null,null,null,null,"","",null,null,null,null,null,null,null,null,"ET",null,null,"Pour un joueur étranger"]
[null,null,null,null,null,{"$f":"SUM(F6:F28)","v":0},{"$f":"SUM(G6:G28)","v":0},null,null,null,null,null,null,null,null,"FID",null,null,"Pour un joueur fidèle"]
[null,null,null,null,null,null,null,null,null,null,null,null,null,null,null,"N",null,null,"Pour tous joueurs sans symbole sur la carte de classification"]

{"sheet":"GRAVELINES","index":33,"n_rows":32,"n_cols":29,"rows_kept":32,"cut":false,"hidden":false,"merged":[[31,15,31,17],[24,15,24,17],[25,15,25,17],[26,15,26,17],[28,15,28,29],[30,15,30,17],[15,15,15,29],[19,15,21,17],[19,18,21,21],[22,18,22,21],[23,15,23,29],[16,15,18,17],[16,18,18,21],[22,15,22,17],[13,20,13,21],[13,26,13,27],[13,28,13,29],[14,20,14,21],[14,26,14,27],[14,28,14,29],[7,15,8,17],[7,18,8,19],[7,22,8,22],[7,23,8,23],[7,24,8,24],[7,20,7,21],[8,20,8,21],[0,15,0,29],[1,22,3,22],[1,23,3,23],[1,24,3,24],[1,25,3,25],[1,26,3,27],[1,28,3,29],[29,0,29,4],[26,0,26,4],[27,0,27,4],[27,15,27,17],[28,0,28,4],[29,15,29,17],[11,15,14,17],[11,18,11,19],[11,22,14,22],[10,26,10,27],[11,20,11,21],[11,26,11,27],[9,22,10,22],[9,23,10,23],[9,24,10,24],[9,25,10,25],[10,20,10,21],[9,15,10,17],[9,18,10,19],[9,20,9,21],[12,18,14,19],[12,20,12,21],[10,28,10,29],[11,23,14,23],[11,24,14,24],[11,25,14,25],[11,28,11,29],[12,26,12,27],[12,28,12,29],[6,26,6,27],[5,22,6,22],[5,23,6,23],[5,24,6,24],[9,28,9,29],[9,26,9,27],[5,28,6,29],[7,28,7,29],[8,28,8,29],[7,26,7,27],[8,26,8,27],[5,26,5,27],[1,0,2,0],[1,1,2,3],[1,9,1,13],[2,9,2,13],[6,20,6,21],[5,15,6,17],[5,18,6,19],[5,20,5,21]]}
["GRAVELINES",null,null,null,null,null,null,null,null,null,null,null,null,null,null,"Saison 2023-2024"]
[null,"Joueur(es) participant à la rencontre",null,null,null,null,null,null,null,"Saisir votre liste complète en MAJUSCULES ",null,null,null,null,null,null,null,null,null,null,null,null,"Carte Verte","Carte Jaune","Carte Rose","Carte Bleue","5,0 Val",null,"Non Sélectionnables en EDF (hors Fidet)"]
[null,null,null,null,null,null,null,null,null,"Joueurs(es) qualifié(es) saison 2023 -2024",null,null,null,null,null,null,null,null,"Avec une date de validité"]
[]
["Statuts","Classif.","          Noms      /    Prénoms",null,"Numéros","ET","VALID","",null,"Statuts","Classif.","          Noms      /    Prénoms",null,"Numéros"]
[null,null,null,null,null,{"$f":"IF(A6=\"ET\",1,\"\")","v":""},{"$f":"IF(B6=5,1,\"\")","v":""},"",null,null,null,null,null,4,null,"Elite Nationale Bastide Médical",null,null,14.5,null,"Maxi 17,5 pts",null,"+  1 ","+  2","+  1,5",null,"1 sur la feuille",null,"Pas de limite"]
[null,null,null,null,null,{"$f":"IF(A7=\"ET\",1,\"\")","v":""},{"$f":"IF(B7=5,1,\"\")","v":""},null,null,"ET",3.5,"BEN YAHI","A",5,null,null,null,null,null,null,"si cartes de couleurs",null,null,null,null,null,"et terrain"]
[null,null,null,null,null,{"$f":"IF(A8=\"ET\",1,\"\")","v":""},{"$f":"IF(B8=5,1,\"\")","v":""},"",null,"ET",1,"SIX","T",6,null," Nationale 1",null,null,14.5,null,"Maxi 17,5 pts",null,"+  1 ,5","+  2,5","+  1,5",null,"1 sur la feuille",null,"4  Maxi / terrain     "]
[null,null,null,null,null,"","",null,null,null,null,null,null,7,null,null,null,null,null,null,"si cartes de couleurs",null,null,null,null,null,"et terrain",null," (5 sur la feuille)"]
[null,null,null,null,null,"","","",null,"F",3,"BRICQUET","L",8,null," Nationale 2",null,null,15,null,"Maxi 19 pts",null,"+  1,5","+  2,5","+  1,5","+  0,5","2 sur la feuille",null,"4  Maxi / terrain     "]
[null,null,null,null,null,"","","",null,"N",3,"DESAOUTTER","G",9,null,null,null,null,null,null,"si cartes de couleurs",null,null,null,null,null,"2 sur le terrain",null," (5 sur la feuille)"]
[null,null,null,null,null,"","","",null,"S",4,"CHAMBRIN","D",10,null," Nationale 3",null,null,15.5,null,null,null,"+  1,5","+  2,5","+  1,5","+  0,5"]
[null,null,null,null,null,"","","",null,"ET",4,"SENADJI","M",11,null,null,null,null,"Si 16pts début match-handicap de 10pts",null,"Maxi 19 pts",null,null,null,null,null,"2 sur la feuille",null,"4 Maxi / terrain"]
[null,null,null,null,null,"","","",null,"ET",3.5,"DLAMINI","S",12,null,null,null,null,null,null,"si cartes de couleurs",null,null,null,null,null,"2 sur le terrain",null," (5 sur la feuille)"]
[null,null,null,null,null,"","","",null,null,null,null,null,13]
[null,null,null,null,null,"","","",null,"S",1,"GIACOMELLI","P",14,null,"Inscrire dans la colonne de gauche les \"Statuts\" des joueurs de l'équipe"]
[null,null,null,null,null,"","","",null,"N",1.5,"HOUAT","M",15,null,"J",null,null,"Pour les cartes Vertes",null,null,null,"Jeune joueur (U19 en Elite Nationale Bastide Médical)"]
[null,null,null,null,null,"","","",null,null,null,null,null,null,null,null,null,null,null,null,null,null,"Joueur débutant, sélectionnable en Equipe de France"]
[null,null,null,null,null,"","","",null,null,null,null,null,null,null,null,null,null,null,null,null,null,"seulement (attention à la date de validité juqu'à 22 ans révolu)"]
[null,null,null,null,null,"","",null,null,null,null,null,null,null,null,"JF",null,null,"Pour les cartes Jaunes",null,null,null,"Jeune joueuse (U19 en Elite Nationale Bastide Médical)"]
[null,null,null,null,null,"","","",null,null,null,null,null,null,null,null,null,null,null,null,null,null,"Joueuse débutante, sélectionnable en Equipe de France"]
[null,null,null,null,null,"","",null,null,null,null,null,null,null,null,null,null,null,null,null,null,null,"seulement (attention à la date de validité juqu' à 22 ans révolu)"]
[null,null,null,null,null,"","",null,null,null,null,null,null,null,null,"F ou FET",null,null,"Pour les cartes roses",null,null,null,"Pour les femmes ou femmes étrangères <5pts  (Bonus 1,5 pts)"]
[null,null,null,null,null,"","",null,null,null,null,null,null,null,null,"En Nationale 2 et 3 uniquement (joueuses et joueurs de plus de 55 ans)"]
[null,null,null,null,null,"","",null,null,null,null,null,null,null,null,"S",null,null,"Pour les hommes séniors",null,null,null," Français ou Etrangers (Bonus de 0,5pt)"]
[null,null,null,null,null,"","",null,null,null,null,null,null,null,null,"FS",null,null,"   Pour les femmes seniors",null,null,null," (Bonus 2pts)      "]
[" Joueurs-joueuses valides de l'équipe (5 points)",null,null,null,null,"","",null,null,null,null,null,null,null,null,"JS",null,null," Pour les jeunes hommes séniors",null,null,null," Débutants  (Bonus 2pts)  validité (<3pts 2ans)       ( > 3pts 1 an)"]
[{"$f":"IF(G31=0,\"\",IF(G31>2,\"Trop de valides sur le terrain\",\"OK\"))","v":""},null,null,null,null,"","",null,null,null,null,null,null,null,null,"JFS",null,null," Pour les jeunes femmes séniors",null,null,null," Débutantes  (Bonus 3pts)  validité (<3pts 2ans)     ( > 3pts 1 an)"]
["Joueurs étrangers ",null,null,null,null,"","",null,null,null,null,null,null,null,null,"Autres possibilités (sans Bonus)"]
[{"$f":"IF(F31=0,\"\",IF(F31>5,\"Trop de joueurs étrangers sur la feuille\",\"OK\"))","v":""},null,null,null,null,"","",null,null,null,null,null,null,null,null,"ET",null,null,"Pour un joueur étranger"]
[null,null,null,null,null,{"$f":"SUM(F6:F28)","v":0},{"$f":"SUM(G6:G28)","v":0},null,null,null,null,null,null,null,null,"FID",null,null,"Pour un joueur fidèle"]
[null,null,null,null,null,null,null,null,null,null,null,null,null,null,null,"N",null,null,"Pour tous joueurs sans symbole sur la carte de classification"]

{"sheet":"LE PUY 2","index":34,"n_rows":32,"n_cols":29,"rows_kept":32,"cut":false,"hidden":false,"merged":[[31,15,31,17],[24,15,24,17],[25,15,25,17],[26,15,26,17],[28,15,28,29],[30,15,30,17],[15,15,15,29],[19,15,21,17],[19,18,21,21],[22,18,22,21],[23,15,23,29],[16,15,18,17],[16,18,18,21],[22,15,22,17],[13,20,13,21],[13,26,13,27],[13,28,13,29],[14,20,14,21],[14,26,14,27],[14,28,14,29],[7,15,8,17],[7,18,8,19],[7,22,8,22],[7,23,8,23],[7,24,8,24],[7,20,7,21],[8,20,8,21],[0,15,0,29],[1,22,3,22],[1,23,3,23],[1,24,3,24],[1,25,3,25],[1,26,3,27],[1,28,3,29],[29,0,29,4],[26,0,26,4],[27,0,27,4],[27,15,27,17],[28,0,28,4],[29,15,29,17],[11,15,14,17],[11,18,11,19],[11,22,14,22],[10,26,10,27],[11,20,11,21],[11,26,11,27],[9,22,10,22],[9,23,10,23],[9,24,10,24],[9,25,10,25],[10,20,10,21],[9,15,10,17],[9,18,10,19],[9,20,9,21],[12,18,14,19],[12,20,12,21],[10,28,10,29],[11,23,14,23],[11,24,14,24],[11,25,14,25],[11,28,11,29],[12,26,12,27],[12,28,12,29],[6,26,6,27],[5,22,6,22],[5,23,6,23],[5,24,6,24],[9,28,9,29],[9,26,9,27],[5,28,6,29],[7,28,7,29],[8,28,8,29],[7,26,7,27],[8,26,8,27],[5,26,5,27],[1,0,2,0],[1,1,2,3],[1,9,1,13],[2,9,2,13],[6,20,6,21],[5,15,6,17],[5,18,6,19],[5,20,5,21]]}
["LE PUY 2",null,null,null,null,null,null,null,null,null,null,null,null,null,null,"Saison 2023-2024"]
[null,"Joueur(es) participant à la rencontre",null,null,null,null,null,null,null,"Saisir votre liste complète en MAJUSCULES ",null,null,null,null,null,null,null,null,null,null,null,null,"Carte Verte","Carte Jaune","Carte Rose","Carte Bleue","5,0 Val",null,"Non Sélectionnables en EDF (hors Fidet)"]
[null,null,null,null,null,null,null,null,null,"Joueurs(es) qualifié(es) saison 2023 -2024",null,null,null,null,null,null,null,null,"Avec une date de validité"]
[]
["Statuts","Classif.","          Noms      /    Prénoms",null,"Numéros","ET","VALID","",null,"Statuts","Classif.","          Noms      /    Prénoms",null,"Numéros"]
[null,null,null,null,null,{"$f":"IF(A6=\"ET\",1,\"\")","v":""},{"$f":"IF(B6=5,1,\"\")","v":""},"",null,"N",5,"GASTON","F",4,null,"Elite Nationale Bastide Médical",null,null,14.5,null,"Maxi 17,5 pts",null,"+  1 ","+  2","+  1,5",null,"1 sur la feuille",null,"Pas de limite"]
[null,null,null,null,null,"",{"$f":"IF(B7=5,1,\"\")","v":""},null,null,"N",1.5,"CHAMARD","D",5,null,null,null,null,null,null,"si cartes de couleurs",null,null,null,null,null,"et terrain"]
[null,null,null,null,null,"","","",null,"N",1.5,"MARTINEZ","JC",6,null," Nationale 1",null,null,14.5,null,"Maxi 17,5 pts",null,"+  1 ,5","+  2,5","+  1,5",null,"1 sur la feuille",null,"4  Maxi / terrain     "]
[null,null,null,null,null,"","",null,null,null,null,null,null,7,null,null,null,null,null,null,"si cartes de couleurs",null,null,null,null,null,"et terrain",null," (5 sur la feuille)"]
[null,null,null,null,null,"","","",null,null,null,null,null,8,null," Nationale 2",null,null,15,null,"Maxi 19 pts",null,"+  1,5","+  2,5","+  1,5","+  0,5","2 sur la feuille",null,"4  Maxi / terrain     "]
[null,null,null,null,null,"","","",null,"N",4,"SAVARY","JC",9,null,null,null,null,null,null,"si cartes de couleurs",null,null,null,null,null,"2 sur le terrain",null," (5 sur la feuille)"]
[null,null,null,null,null,{"$f":"IF(A12=\"ET\",1,\"\")","v":""},"","",null,"ET",4.5,"CONTRERAS","A",10,null," Nationale 3",null,null,15.5,null,null,null,"+  1,5","+  2,5","+  1,5","+  0,5"]
[null,null,null,null,null,"","","",null,"N",4,"CHANCELADE","F",11,null,null,null,null,"Si 16pts début match-handicap de 10pts",null,"Maxi 19 pts",null,null,null,null,null,"2 sur la feuille",null,"4 Maxi / terrain"]
[null,null,null,null,null,"","","",null,"F",2,"DORGET","S",12,null,null,null,null,null,null,"si cartes de couleurs",null,null,null,null,null,"2 sur le terrain",null," (5 sur la feuille)"]
[null,null,null,null,null,"","","",null,"N",5,"DORGET","C",13]
[null,null,null,null,null,"","","",null,"J",2,"PERSET","Y",14,null,"Inscrire dans la colonne de gauche les \"Statuts\" des joueurs de l'équipe"]
[null,null,null,null,null,"","","",null,"N",3,"MARIANI","A",15,null,"J",null,null,"Pour les cartes Vertes",null,null,null,"Jeune joueur (U19 en Elite Nationale Bastide Médical)"]
[null,null,null,null,null,"","","",null,null,null,null,null,16,null,null,null,null,null,null,null,null,"Joueur débutant, sélectionnable en Equipe de France"]
[null,null,null,null,null,"","","",null,null,null,null,null,17,null,null,null,null,null,null,null,null,"seulement (attention à la date de validité juqu'à 22 ans révolu)"]
[null,null,null,null,null,"","",null,null,null,null,null,null,18,null,"JF",null,null,"Pour les cartes Jaunes",null,null,null,"Jeune joueuse (U19 en Elite Nationale Bastide Médical)"]
[null,null,null,null,null,"","","",null,null,null,null,null,19,null,null,null,null,null,null,null,null,"Joueuse débutante, sélectionnable en Equipe de France"]
[null,null,null,null,null,"","",null,null,null,null,null,null,20,null,null,null,null,null,null,null,null,"seulement (attention à la date de validité juqu' à 22 ans révolu)"]
[null,null,null,null,null,"","",null,null,null,null,null,null,null,null,"F ou FET",null,null,"Pour les cartes roses",null,null,null,"Pour les femmes ou femmes étrangères <5pts  (Bonus 1,5 pts)"]
[null,null,null,null,null,"","",null,null,null,null,null,null,null,null,"En Nationale 2 et 3 uniquement (joueuses et joueurs de plus de 55 ans)"]
[null,null,null,null,null,"","",null,null,null,null,null,null,null,null,"S",null,null,"Pour les hommes séniors",null,null,null," Français ou Etrangers (Bonus de 0,5pt)"]
[null,null,null,null,null,null,null,null,null,null,null,null,null,null,null,"FS",null,null,"   Pour les femmes seniors",null,null,null," (Bonus 2pts)      "]
[" Joueurs-joueuses valides de l'équipe (5 points)",null,null,null,null,null,null,null,null,null,null,null,null,null,null,"JS",null,null," Pour les jeunes hommes séniors",null,null,null," Débutants  (Bonus 2pts)  validité (<3pts 2ans)       ( > 3pts 1 an)"]
[{"$f":"IF($G$31=0,\"\",IF($G$31>2,\"Trop de valides sur le terrain\",\"OK\"))","v":""},null,null,null,null,null,null,null,null,null,null,null,null,null,null,"JFS",null,null," Pour les jeunes femmes séniors",null,null,null," Débutantes  (Bonus 3pts)  validité (<3pts 2ans)     ( > 3pts 1 an)"]
["Joueurs étrangers ",null,null,null,null,null,null,null,null,null,null,null,null,null,null,"Autres possibilités (sans Bonus)"]
[{"$f":"IF($F$31=0,\"\",IF($F$31>5,\"Trop de joueurs étrangers sur la feuille\",\"OK\"))","v":""},null,null,null,null,null,null,null,null,null,null,null,null,null,null,"ET",null,null,"Pour un joueur étranger"]
[null,null,null,null,null,{"$f":"SUM(F6:F25)","v":0},{"$f":"SUM(G6:G25)","v":0},null,null,null,null,null,null,null,null,"FID",null,null,"Pour un joueur fidèle"]
[null,null,null,null,null,null,null,null,null,null,null,null,null,null,null,"N",null,null,"Pour tous joueurs sans symbole sur la carte de classification"]

{"sheet":"LYON","index":35,"n_rows":32,"n_cols":29,"rows_kept":32,"cut":false,"hidden":false,"merged":[[31,15,31,17],[24,15,24,17],[25,15,25,17],[26,15,26,17],[28,15,28,29],[30,15,30,17],[15,15,15,29],[19,15,21,17],[19,18,21,21],[22,18,22,21],[23,15,23,29],[16,15,18,17],[16,18,18,21],[22,15,22,17],[13,20,13,21],[13,26,13,27],[13,28,13,29],[14,20,14,21],[14,26,14,27],[14,28,14,29],[7,15,8,17],[7,18,8,19],[7,22,8,22],[7,23,8,23],[7,24,8,24],[7,20,7,21],[8,20,8,21],[0,15,0,29],[1,22,3,22],[1,23,3,23],[1,24,3,24],[1,25,3,25],[1,26,3,27],[1,28,3,29],[29,0,29,4],[26,0,26,4],[27,0,27,4],[27,15,27,17],[28,0,28,4],[29,15,29,17],[11,15,14,17],[11,18,11,19],[11,22,14,22],[10,26,10,27],[11,20,11,21],[11,26,11,27],[9,22,10,22],[9,23,10,23],[9,24,10,24],[9,25,10,25],[10,20,10,21],[9,15,10,17],[9,18,10,19],[9,20,9,21],[12,18,14,19],[12,20,12,21],[10,28,10,29],[11,23,14,23],[11,24,14,24],[11,25,14,25],[11,28,11,29],[12,26,12,27],[12,28,12,29],[6,26,6,27],[5,22,6,22],[5,23,6,23],[5,24,6,24],[9,28,9,29],[9,26,9,27],[5,28,6,29],[7,28,7,29],[8,28,8,29],[7,26,7,27],[8,26,8,27],[5,26,5,27],[1,0,2,0],[1,1,2,3],[1,9,1,13],[2,9,2,13],[6,20,6,21],[5,15,6,17],[5,18,6,19],[5,20,5,21]]}
["LYON",null,null,null,null,null,null,null,null,null,null,null,null,null,null,"Saison 2023-2024"]
[null,"Joueur(es) participant à la rencontre",null,null,null,null,null,null,null,"Saisir votre liste complète en MAJUSCULES ",null,null,null,null,null,null,null,null,null,null,null,null,"Carte Verte","Carte Jaune","Carte Rose","Carte Bleue","5,0 Val",null,"Non Sélectionnables en EDF (hors Fidet)"]
[null,null,null,null,null,null,null,null,null,"Joueurs(es) qualifié(es) saison 2023 -2024",null,null,null,null,null,null,null,null,"Avec une date de validité"]
[]
["Statuts","Classif.","          Noms      /    Prénoms",null,"Numéros","ET","VALID","",null,"Statuts","Classif.","          Noms      /    Prénoms",null,"Numéros"]
[null,null,null,null,null,{"$f":"IF(A6=\"ET\",1,\"\")","v":""},{"$f":"IF(B6=5,1,\"\")","v":""},"",null,"N",1,"AIT OUFEROUKH","K",3,null,"Elite Nationale Bastide Médical",null,null,14.5,null,"Maxi 17,5 pts",null,"+  1 ","+  2","+  1,5",null,"1 sur la feuille",null,"Pas de limite"]
[null,null,null,null,null,{"$f":"IF(A7=\"ET\",1,\"\")","v":""},{"$f":"IF(B7=5,1,\"\")","v":""},null,null,"N",1.5,"BISCAINO","Y",4,null,null,null,null,null,null,"si cartes de couleurs",null,null,null,null,null,"et terrain"]
[null,null,null,null,null,{"$f":"IF(A8=\"ET\",1,\"\")","v":""},{"$f":"IF(B8=5,1,\"\")","v":""},"",null,"FID",3,"BADARA","S",5,null," Nationale 1",null,null,14.5,null,"Maxi 17,5 pts",null,"+  1 ,5","+  2,5","+  1,5",null,"1 sur la feuille",null,"4  Maxi / terrain     "]
[null,null,null,null,null,"","",null,null,"ET",4,"GAYE","M",6,null,null,null,null,null,null,"si cartes de couleurs",null,null,null,null,null,"et terrain",null," (5 sur la feuille)"]
[null,null,null,null,null,"","","",null,"F",2.5,"FALL","O",7,null," Nationale 2",null,null,15,null,"Maxi 19 pts",null,"+  1,5","+  2,5","+  1,5","+  0,5","2 sur la feuille",null,"4  Maxi / terrain     "]
[null,null,null,null,null,"","","",null,"ET",3,"BANGOURA","O",8,null,null,null,null,null,null,"si cartes de couleurs",null,null,null,null,null,"2 sur le terrain",null," (5 sur la feuille)"]
[null,null,null,null,null,"","","",null,"N",2,"DJALALI","A",9,null," Nationale 3",null,null,15.5,null,null,null,"+  1,5","+  2,5","+  1,5","+  0,5"]
[null,null,null,null,null,"","","",null,"N",2,"BENSALEM","K",10,null,null,null,null,"Si 16pts début match-handicap de 10pts",null,"Maxi 19 pts",null,null,null,null,null,"2 sur la feuille",null,"4 Maxi / terrain"]
[null,null,null,null,null,"","","",null,"F",1.5,"DRAME","F",11,null,null,null,null,null,null,"si cartes de couleurs",null,null,null,null,null,"2 sur le terrain",null," (5 sur la feuille)"]
[null,null,null,null,null,"","","",null,null,null,null,null,12]
[null,null,null,null,null,"","","",null,"N",5,"JOUVENCEAU","A",13,null,"Inscrire dans la colonne de gauche les \"Statuts\" des joueurs de l'équipe"]
[null,null,null,null,null,"","","",null,null,null,null,null,14,null,"J",null,null,"Pour les cartes Vertes",null,null,null,"Jeune joueur (U19 en Elite Nationale Bastide Médical)"]
[null,null,null,null,null,"","","",null,"N",2.5,"JOUVENCEAU","L",15,null,null,null,null,null,null,null,null,"Joueur débutant, sélectionnable en Equipe de France"]
[null,null,null,null,null,"","","",null,null,null,null,null,20,null,null,null,null,null,null,null,null,"seulement (attention à la date de validité juqu'à 22 ans révolu)"]
[null,null,null,null,null,"","",null,null,"N",2.5,"DRAME","A",69,null,"JF",null,null,"Pour les cartes Jaunes",null,null,null,"Jeune joueuse (U19 en Elite Nationale Bastide Médical)"]
[null,null,null,null,null,"","","",null,null,null,null,null,null,null,null,null,null,null,null,null,null,"Joueuse débutante, sélectionnable en Equipe de France"]
[null,null,null,null,null,"","",null,null,null,null,null,null,null,null,null,null,null,null,null,null,null,"seulement (attention à la date de validité juqu' à 22 ans révolu)"]
[null,null,null,null,null,"","",null,null,null,null,null,null,null,null,"F ou FET",null,null,"Pour les cartes roses",null,null,null,"Pour les femmes ou femmes étrangères <5pts  (Bonus 1,5 pts)"]
[null,null,null,null,null,"","",null,null,null,null,null,null,null,null,"En Nationale 2 et 3 uniquement (joueuses et joueurs de plus de 55 ans)"]
[null,null,null,null,null,"","",null,null,null,null,null,null,null,null,"S",null,null,"Pour les hommes séniors",null,null,null," Français ou Etrangers (Bonus de 0,5pt)"]
[null,null,null,null,null,"","",null,null,null,null,null,null,null,null,"FS",null,null,"   Pour les femmes seniors",null,null,null," (Bonus 2pts)      "]
[" Joueurs-joueuses valides de l'équipe (5 points)",null,null,null,null,"","",null,null,null,null,null,null,null,null,"JS",null,null," Pour les jeunes hommes séniors",null,null,null," Débutants  (Bonus 2pts)  validité (<3pts 2ans)       ( > 3pts 1 an)"]
[{"$f":"IF(G31=0,\"\",IF(G31>2,\"Trop de valides sur le terrain\",\"OK\"))","v":""},null,null,null,null,"","",null,null,null,null,null,null,null,null,"JFS",null,null," Pour les jeunes femmes séniors",null,null,null," Débutantes  (Bonus 3pts)  validité (<3pts 2ans)     ( > 3pts 1 an)"]
["Joueurs étrangers ",null,null,null,null,"","",null,null,null,null,null,null,null,null,"Autres possibilités (sans Bonus)"]
[{"$f":"IF(F31=0,\"\",IF(F31>5,\"Trop de joueurs étrangers sur la feuille\",\"OK\"))","v":""},null,null,null,null,"","",null,null,null,null,null,null,null,null,"ET",null,null,"Pour un joueur étranger"]
[null,null,null,null,null,{"$f":"SUM(F6:F28)","v":0},{"$f":"SUM(G6:G28)","v":0},null,null,null,null,null,null,null,null,"FID",null,null,"Pour un joueur fidèle"]
[null,null,null,null,null,null,null,null,null,null,null,null,null,null,null,"N",null,null,"Pour tous joueurs sans symbole sur la carte de classification"]

{"sheet":"VANDOEUVRE","index":36,"n_rows":32,"n_cols":29,"rows_kept":32,"cut":false,"hidden":false,"merged":[[30,15,30,17],[31,15,31,17],[15,15,15,29],[19,15,21,17],[19,18,21,21],[22,18,22,21],[23,15,23,29],[24,15,24,17],[25,15,25,17],[26,15,26,17],[28,15,28,29],[11,25,14,25],[11,28,11,29],[12,18,14,19],[12,20,12,21],[12,26,12,27],[12,28,12,29],[13,20,13,21],[13,26,13,27],[13,28,13,29],[14,20,14,21],[14,26,14,27],[14,28,14,29],[0,15,0,29],[1,22,3,22],[1,23,3,23],[1,24,3,24],[1,25,3,25],[1,26,3,27],[1,28,3,29],[5,15,6,17],[5,18,6,19],[5,22,6,22],[5,23,6,23],[5,24,6,24],[5,28,6,29],[29,32,29,34],[22,32,22,34],[23,32,23,34],[25,32,26,46],[27,32,27,34],[28,32,28,34],[19,32,19,34],[19,35,19,38],[20,32,20,34],[20,35,20,38],[21,32,21,34],[21,35,21,38],[12,32,12,46],[13,32,15,34],[13,35,15,38],[16,32,18,34],[16,35,18,38],[10,41,11,41],[10,42,11,42],[10,43,10,44],[10,45,11,46],[11,37,11,38],[11,43,11,44],[10,32,11,34],[10,35,11,36],[10,37,10,38],[10,39,11,39],[10,40,11,40],[8,41,9,41],[8,42,9,42],[8,43,8,44],[8,45,9,46],[9,37,9,38],[9,43,9,44],[8,32,9,34],[8,35,9,36],[8,37,8,38],[8,39,9,39],[8,40,9,40],[6,41,7,41],[6,43,6,44],[6,45,7,46],[7,37,7,38],[7,43,7,44],[6,32,7,34],[6,35,7,36],[6,37,6,38],[6,39,7,39],[6,40,7,40],[4,41,5,41],[4,43,4,44],[4,45,5,46],[5,37,5,38],[5,43,5,44],[4,32,5,34],[4,35,5,36],[4,37,4,38],[4,39,5,39],[4,40,5,40],[29,0,29,4],[26,0,26,4],[27,0,27,4],[27,15,27,17],[28,0,28,4],[29,15,29,17],[22,15,22,17],[10,26,10,27],[11,20,11,21],[11,26,11,27],[16,15,18,17],[16,18,18,21],[10,20,10,21],[9,15,10,17],[9,20,9,21],[9,26,9,27],[9,23,10,23],[9,24,10,24],[9,25,10,25],[11,15,14,17],[11,18,11,19],[11,22,14,22],[11,23,14,23],[11,24,14,24],[7,28,7,29],[8,28,8,29],[9,18,10,19],[9,22,10,22],[1,0,2,0],[1,1,2,3],[1,9,1,13],[2,9,2,13],[5,20,5,21],[5,26,5,27],[8,20,8,21],[6,26,6,27],[7,20,7,21],[7,26,7,27],[8,26,8,27],[6,20,6,21],[7,15,8,17],[7,18,8,19],[7,22,8,22],[7,23,8,23],[7,24,8,24],[9,28,9,29],[10,28,10,29]]}
["VANDOEUVRE",null,null,null,null,null,null,null,null,null,null,null,null,null,null,"Saison 2023-2024"]
[null,"Joueur(es) participant à la rencontre",null,null,null,null,null,null,null,"Saisir votre liste complète en MAJUSCULES ",null,null,null,null,null,null,null,null,null,null,null,null,"Carte Verte","Carte Jaune","Carte Rose","Carte Bleue","5,0 Val",null,"Non Sélectionnables en EDF (hors Fidet)"]
[null,null,null,null,null,null,null,null,null,"Joueurs(es) qualifié(es) saison 2023 -2024",null,null,null,null,null,null,null,null,"Avec une date de validité"]
[]
["Statuts","Classif.","          Noms      /    Prénoms",null,"Numéros","ET","VALID","",null,"Statuts","Classif.","          Noms      /    Prénoms",null,"Numéros"]
[null,null,null,null,null,{"$f":"IF(A6=\"ET\",1,\"\")","v":""},{"$f":"IF(B6=5,1,\"\")","v":""},"",null,"N",4,"TOMBOIS","G",0,null,"Elite Nationale Bastide Médical",null,null,14.5,null,"Maxi 17,5 pts",null,"+  1 ","+  2","+  1,5",null,"1 sur la feuille",null,"Pas de limite"]
[null,null,null,null,null,{"$f":"IF(A7=\"ET\",1,\"\")","v":""},{"$f":"IF(B7=5,1,\"\")","v":""},null,null,"ET",2.5,"HAMMANA","A",2,null,null,null,null,null,null,"si cartes de couleurs",null,null,null,null,null,"et terrain"]
[null,null,null,null,null,{"$f":"IF(A8=\"ET\",1,\"\")","v":""},{"$f":"IF(B8=5,1,\"\")","v":""},"",null,null,null,null,null,3,null," Nationale 1",null,null,14.5,null,"Maxi 17,5 pts",null,"+  1 ,5","+  2,5","+  1,5",null,"1 sur la feuille",null,"4  Maxi / terrain     "]
[null,null,null,null,null,"","",null,null,"F ",1,"HOSTE","A",4,null,null,null,null,null,null,"si cartes de couleurs",null,null,null,null,null,"et terrain",null," (5 sur la feuille)"]
[null,null,null,null,null,"","","",null,"N",2,"HECHT","V",5,null," Nationale 2",null,null,15,null,"Maxi 19 pts",null,"+  1,5","+  2,5","+  1,5","+  0,5","2 sur la feuille",null,"4  Maxi / terrain     "]
[null,null,null,null,null,"","","",null,"ET",2.5,"KHAN","A",6,null,null,null,null,null,null,"si cartes de couleurs",null,null,null,null,null,"2 sur le terrain",null," (5 sur la feuille)"]
[null,null,null,null,null,"","","",null,null,null,null,null,7,null," Nationale 3",null,null,15.5,null,null,null,"+  1,5","+  2,5","+  1,5","+  0,5"]
[null,null,null,null,null,"","","",null,null,null,null,null,8,null,null,null,null,"Si 16pts début match-handicap de 10pts",null,"Maxi 19 pts",null,null,null,null,null,"2 sur la feuille",null,"4 Maxi / terrain"]
[null,null,null,null,null,"","","",null,null,null,null,null,9,null,null,null,null,null,null,"si cartes de couleurs",null,null,null,null,null,"2 sur le terrain",null," (5 sur la feuille)"]
[null,null,null,null,null,"","","",null,"S",4,"ROBIN","P",10]
[null,null,null,null,null,"","","",null,"N","2?5","COUGOUILLE","V",9,null,"Inscrire dans la colonne de gauche les \"Statuts\" des joueurs de l'équipe"]
[null,null,null,null,null,"","","",null,"J",4.5,"DEMONGEOT","F",10,null,"J",null,null,"Pour les cartes Vertes",null,null,null,"Jeune joueur (U19 en Elite Nationale Bastide Médical)"]
[null,null,null,null,null,"","","",null,"N",4,"AKRIM","M",11,null,null,null,null,null,null,null,null,"Joueur débutant, sélectionnable en Equipe de France"]
[null,null,null,null,null,"","","",null,"F ",4.5,"CLAUSSE","C",17,null,null,null,null,null,null,null,null,"seulement (attention à la date de validité juqu'à 22 ans révolu)"]
[null,null,null,null,null,"","",null,null,"N",2,"BOQUEL","C",20,null,"JF",null,null,"Pour les cartes Jaunes",null,null,null,"Jeune joueuse (U19 en Elite Nationale Bastide Médical)"]
[null,null,null,null,null,"","","",null,"N",5,"KAJGANIC","F",34,null,null,null,null,null,null,null,null,"Joueuse débutante, sélectionnable en Equipe de France"]
[null,null,null,null,null,"","",null,null,"N",5,"BAYARD","A",15,null,null,null,null,null,null,null,null,"seulement (attention à la date de validité juqu' à 22 ans révolu)"]
[null,null,null,null,null,"","",null,null,null,null,null,null,null,null,"F ou FET",null,null,"Pour les cartes roses",null,null,null,"Pour les femmes ou femmes étrangères <5pts  (Bonus 1,5 pts)"]
[null,null,null,null,null,"","",null,null,null,null,null,null,null,null,"En Nationale 2 et 3 uniquement (joueuses et joueurs de plus de 55 ans)"]
[null,null,null,null,null,"","",null,null,null,null,null,null,null,null,"S",null,null,"Pour les hommes séniors",null,null,null," Français ou Etrangers (Bonus de 0,5pt)"]
[null,null,null,null,null,"","",null,null,null,null,null,null,null,null,"FS",null,null,"   Pour les femmes seniors",null,null,null," (Bonus 2pts)      "]
[" Joueurs-joueuses valides de l'équipe (5 points)",null,null,null,null,"","",null,null,null,null,null,null,null,null,"JS",null,null," Pour les jeunes hommes séniors",null,null,null," Débutants  (Bonus 2pts)  validité (<3pts 2ans)       ( > 3pts 1 an)"]
[{"$f":"IF(G31=0,\"\",IF(G31>2,\"Trop de valides sur le terrain\",\"OK\"))","v":""},null,null,null,null,"","",null,null,null,null,null,null,null,null,"JFS",null,null," Pour les jeunes femmes séniors",null,null,null," Débutantes  (Bonus 3pts)  validité (<3pts 2ans)     ( > 3pts 1 an)"]
["Joueurs étrangers ",null,null,null,null,"","",null,null,null,null,null,null,null,null,"Autres possibilités (sans Bonus)"]
[{"$f":"IF(F31=0,\"\",IF(F31>5,\"Trop de joueurs étrangers sur la feuille\",\"OK\"))","v":""},null,null,null,null,"","",null,null,null,null,null,null,null,null,"ET",null,null,"Pour un joueur étranger"]
[null,null,null,null,null,{"$f":"SUM(F6:F28)","v":0},{"$f":"SUM(G6:G28)","v":0},null,null,null,null,null,null,null,null,"FID",null,null,"Pour un joueur fidèle"]
[null,null,null,null,null,null,null,null,null,null,null,null,null,null,null,"N",null,null,"Pour tous joueurs sans symbole sur la carte de classification"]

{"sheet":"AMIENS","index":37,"n_rows":32,"n_cols":29,"rows_kept":32,"cut":false,"hidden":false,"merged":[[31,15,31,17],[24,15,24,17],[25,15,25,17],[26,15,26,17],[28,15,28,29],[30,15,30,17],[15,15,15,29],[19,15,21,17],[19,18,21,21],[22,18,22,21],[23,15,23,29],[16,15,18,17],[16,18,18,21],[22,15,22,17],[11,28,11,29],[12,18,14,19],[12,20,12,21],[12,26,12,27],[12,28,12,29],[13,20,13,21],[13,26,13,27],[13,28,13,29],[14,20,14,21],[14,26,14,27],[14,28,14,29],[11,18,11,19],[11,22,14,22],[11,23,14,23],[11,24,14,24],[11,25,14,25],[5,28,6,29],[7,15,8,17],[7,18,8,19],[7,22,8,22],[7,23,8,23],[7,24,8,24],[7,28,7,29],[8,28,8,29],[5,15,6,17],[5,18,6,19],[5,22,6,22],[5,23,6,23],[5,24,6,24],[8,20,8,21],[8,26,8,27],[0,15,0,29],[1,22,3,22],[1,23,3,23],[1,24,3,24],[1,25,3,25],[1,26,3,27],[1,28,3,29],[47,18,47,20],[47,21,47,24],[48,18,48,20],[48,21,48,24],[49,18,49,20],[49,21,49,24],[57,18,57,20],[50,18,50,20],[51,18,51,20],[53,18,54,32],[55,18,55,20],[56,18,56,20],[40,18,40,32],[41,18,43,20],[41,21,43,24],[44,18,46,20],[44,21,46,24],[9,24,10,24],[9,25,10,25],[2,9,2,13],[6,20,6,21],[6,26,6,27],[7,20,7,21],[7,26,7,27],[5,26,5,27],[5,20,5,21],[9,28,9,29],[10,28,10,29],[11,15,14,17],[1,0,2,0],[1,1,2,3],[1,9,1,13],[9,20,9,21],[9,26,9,27],[10,26,10,27],[11,26,11,27],[9,15,10,17],[9,18,10,19],[9,22,10,22],[9,23,10,23],[10,20,10,21],[11,20,11,21],[29,0,29,4],[26,0,26,4],[27,0,27,4],[28,0,28,4],[29,15,29,17],[27,15,27,17]]}
["AMIENS",null,null,null,null,null,null,null,null,null,null,null,null,null,null,"Saison 2023-2024"]
[null,"Joueur(es) participant à la rencontre",null,null,null,null,null,null,null,"Saisir votre liste complète en MAJUSCULES ",null,null,null,null,null,null,null,null,null,null,null,null,"Carte Verte","Carte Jaune","Carte Rose","Carte Bleue","5,0 Val",null,"Non Sélectionnables en EDF (hors Fidet)"]
[null,null,null,null,null,null,null,null,null,"Joueurs(es) qualifié(es) saison 2023 -2024",null,null,null,null,null,null,null,null,"Avec une date de validité"]
[]
["Statuts","Classif.","          Noms      /    Prénoms",null,"Numéros","ET","VALID","",null,"Statuts","Classif.","          Noms      /    Prénoms",null,"Numéros"]
[null,null,null,null,null,{"$f":"IF(A6=\"ET\",1,\"\")","v":""},{"$f":"IF(B6=5,1,\"\")","v":""},"",null,"N",1.5,"LAMY","E",4,null,"Elite Nationale Bastide Médical",null,null,14.5,null,"Maxi 17,5 pts",null,"+  1 ","+  2","+  1,5",null,"1 sur la feuille",null,"Pas de limite"]
[null,null,null,null,null,{"$f":"IF(A7=\"ET\",1,\"\")","v":""},{"$f":"IF(B7=5,1,\"\")","v":""},null,null,"J",3,"MAGNIER","E",5,null,null,null,null,null,null,"si cartes de couleurs",null,null,null,null,null,"et terrain"]
[null,null,null,null,null,{"$f":"IF(A8=\"ET\",1,\"\")","v":""},{"$f":"IF(B8=5,1,\"\")","v":""},"",null,"F",4.5,"FONTAINE","E",6,null," Nationale 1",null,null,14.5,null,"Maxi 17,5 pts",null,"+  1 ,5","+  2,5","+  1,5",null,"1 sur la feuille",null,"4  Maxi / terrain     "]
[null,null,null,null,null,"","",null,null,"N",2,"DAVELUY","R",7,null,null,null,null,null,null,"si cartes de couleurs",null,null,null,null,null,"et terrain",null," (5 sur la feuille)"]
[null,null,null,null,null,"","","",null,"N",4,"JOLY","R",8,null," Nationale 2",null,null,15,null,"Maxi 19 pts",null,"+  1,5","+  2,5","+  1,5","+  0,5","2 sur la feuille",null,"4  Maxi / terrain     "]
[null,null,null,null,null,"","","",null,null,null,null,null,9,null,null,null,null,null,null,"si cartes de couleurs",null,null,null,null,null,"2 sur le terrain",null," (5 sur la feuille)"]
[null,null,null,null,null,"","","",null,"JF",4,"DIJOUX","M",10,null," Nationale 3",null,null,15.5,null,null,null,"+  1,5","+  2,5","+  1,5","+  0,5"]
[null,null,null,null,null,"","","",null,null,null,null,null,11,null,null,null,null,"Si 16pts début match-handicap de 10pts",null,"Maxi 19 pts",null,null,null,null,null,"2 sur la feuille",null,"4 Maxi / terrain"]
[null,null,null,null,null,"","","",null,"N",4.5,"SECHERESSE","N",12,null,null,null,null,null,null,"si cartes de couleurs",null,null,null,null,null,"2 sur le terrain",null," (5 sur la feuille)"]
[null,null,null,null,null,"","","",null,"N",2,"TERNISSIEN","R",13]
[null,null,null,null,null,"","","",null,null,null,null,null,14,null,"Inscrire dans la colonne de gauche les \"Statuts\" des joueurs de l'équipe"]
[null,null,null,null,null,"","","",null,null,null,null,null,15,null,"J",null,null,"Pour les cartes Vertes",null,null,null,"Jeune joueur (U19 en Elite Nationale Bastide Médical)"]
[null,null,null,null,null,"","","",null,"N",2,"LECLERCQ","T",16,null,null,null,null,null,null,null,null,"Joueur débutant, sélectionnable en Equipe de France"]
[null,null,null,null,null,"","","",null,null,null,null,null,null,null,null,null,null,null,null,null,null,"seulement (attention à la date de validité juqu'à 22 ans révolu)"]
[null,null,null,null,null,"","",null,null,"N",5,"LITTIERE","J",20,null,"JF",null,null,"Pour les cartes Jaunes",null,null,null,"Jeune joueuse (U19 en Elite Nationale Bastide Médical)"]
[null,null,null,null,null,"","","",null,null,null,null,null,null,null,null,null,null,null,null,null,null,"Joueuse débutante, sélectionnable en Equipe de France"]
[null,null,null,null,null,"","",null,null,"N",3,"CORDONNIER","J",27,null,null,null,null,null,null,null,null,"seulement (attention à la date de validité juqu' à 22 ans révolu)"]
[null,null,null,null,null,"","",null,null,null,null,null,null,null,null,"F ou FET",null,null,"Pour les cartes roses",null,null,null,"Pour les femmes ou femmes étrangères <5pts  (Bonus 1,5 pts)"]
[null,null,null,null,null,"","",null,null,null,null,null,null,null,null,"En Nationale 2 et 3 uniquement (joueuses et joueurs de plus de 55 ans)"]
[null,null,null,null,null,"","",null,null,null,null,null,null,null,null,"S",null,null,"Pour les hommes séniors",null,null,null," Français ou Etrangers (Bonus de 0,5pt)"]
[null,null,null,null,null,"","",null,null,null,null,null,null,null,null,"FS",null,null,"   Pour les femmes seniors",null,null,null," (Bonus 2pts)      "]
[" Joueurs-joueuses valides de l'équipe (5 points)",null,null,null,null,"","",null,null,null,null,null,null,null,null,"JS",null,null," Pour les jeunes hommes séniors",null,null,null," Débutants  (Bonus 2pts)  validité (<3pts 2ans)       ( > 3pts 1 an)"]
[{"$f":"IF(G31=0,\"\",IF(G31>2,\"Trop de valides sur le terrain\",\"OK\"))","v":""},null,null,null,null,"","",null,null,null,null,null,null,null,null,"JFS",null,null," Pour les jeunes femmes séniors",null,null,null," Débutantes  (Bonus 3pts)  validité (<3pts 2ans)     ( > 3pts 1 an)"]
["Joueurs étrangers ",null,null,null,null,"","",null,null,null,null,null,null,null,null,"Autres possibilités (sans Bonus)"]
[{"$f":"IF(F31=0,\"\",IF(F31>5,\"Trop de joueurs étrangers sur la feuille\",\"OK\"))","v":""},null,null,null,null,"","",null,null,null,null,null,null,null,null,"ET",null,null,"Pour un joueur étranger"]
[null,null,null,null,null,{"$f":"SUM(F6:F28)","v":0},{"$f":"SUM(G6:G28)","v":0},null,null,null,null,null,null,null,null,"FID",null,null,"Pour un joueur fidèle"]
[null,null,null,null,null,null,null,null,null,null,null,null,null,null,null,"N",null,null,"Pour tous joueurs sans symbole sur la carte de classification"]

{"sheet":"AULNOYE","index":38,"n_rows":32,"n_cols":29,"rows_kept":32,"cut":false,"hidden":false,"merged":[[30,15,30,17],[31,15,31,17],[23,15,23,29],[24,15,24,17],[25,15,25,17],[26,15,26,17],[28,15,28,29],[2,9,2,13],[5,20,5,21],[5,26,5,27],[0,15,0,29],[1,22,3,22],[1,23,3,23],[1,24,3,24],[1,25,3,25],[1,26,3,27],[1,28,3,29],[5,15,6,17],[5,18,6,19],[5,22,6,22],[5,23,6,23],[5,24,6,24],[5,28,6,29],[7,15,8,17],[7,18,8,19],[7,22,8,22],[7,23,8,23],[6,26,6,27],[7,20,7,21],[7,26,7,27],[7,24,8,24],[6,20,6,21],[7,28,7,29],[8,28,8,29],[8,20,8,21],[9,15,10,17],[9,18,10,19],[9,22,10,22],[9,23,10,23],[10,20,10,21],[8,26,8,27],[9,20,9,21],[9,26,9,27],[9,24,10,24],[9,25,10,25],[9,28,9,29],[10,28,10,29],[10,26,10,27],[11,15,14,17],[11,18,11,19],[11,22,14,22],[11,23,14,23],[12,18,14,19],[12,20,12,21],[13,20,13,21],[14,20,14,21],[11,20,11,21],[11,26,11,27],[11,24,14,24],[11,25,14,25],[11,28,11,29],[12,26,12,27],[12,28,12,29],[13,26,13,27],[13,28,13,29],[14,26,14,27],[14,28,14,29],[15,15,15,29],[1,0,2,0],[1,1,2,3],[1,9,1,13],[29,0,29,4],[26,0,26,4],[27,0,27,4],[27,15,27,17],[28,0,28,4],[29,15,29,17],[22,15,22,17],[19,15,21,17],[19,18,21,21],[22,18,22,21],[16,15,18,17],[16,18,18,21]]}
["AULNOYE",null,null,null,null,null,null,null,null,null,null,null,null,null,null,"Saison 2023-2024"]
[null,"Joueur(es) participant à la rencontre",null,null,null,null,null,null,null,"Saisir votre liste complète en MAJUSCULES ",null,null,null,null,null,null,null,null,null,null,null,null,"Carte Verte","Carte Jaune","Carte Rose","Carte Bleue","5,0 Val",null,"Non Sélectionnables en EDF (hors Fidet)"]
[null,null,null,null,null,null,null,null,null,"Joueurs(es) qualifié(es) saison 2023 -2024",null,null,null,null,null,null,null,null,"Avec une date de validité"]
[]
["Statuts","Classif.","          Noms      /    Prénoms",null,"Numéros","ET","VALID","",null,"Statuts","Classif.","          Noms      /    Prénoms",null,"Numéros"]
[null,null,null,null,null,{"$f":"IF(A6=\"ET\",1,\"\")","v":""},{"$f":"IF(B6=5,1,\"\")","v":""},"",null,null,null,null,null,4,null,"Elite Nationale Bastide Médical",null,null,14.5,null,"Maxi 17,5 pts",null,"+  1 ","+  2","+  1,5",null,"1 sur la feuille",null,"Pas de limite"]
[null,null,null,null,null,{"$f":"IF(A7=\"ET\",1,\"\")","v":""},{"$f":"IF(B7=5,1,\"\")","v":""},null,null,null,null,null,null,5,null,null,null,null,null,null,"si cartes de couleurs",null,null,null,null,null,"et terrain"]
[null,null,null,null,null,{"$f":"IF(A8=\"ET\",1,\"\")","v":""},{"$f":"IF(B8=5,1,\"\")","v":""},"",null,"J",1,"MAIRESSE","D",6,null," Nationale 1",null,null,14.5,null,"Maxi 17,5 pts",null,"+  1 ,5","+  2,5","+  1,5",null,"1 sur la feuille",null,"4  Maxi / terrain     "]
[null,null,null,null,null,"","",null,null,"ET",1,"WEEMAELS","T",7,null,null,null,null,null,null,"si cartes de couleurs",null,null,null,null,null,"et terrain",null," (5 sur la feuille)"]
[null,null,null,null,null,"","","",null,"N",3.5,"SOMME","C",8,null," Nationale 2",null,null,15,null,"Maxi 19 pts",null,"+  1,5","+  2,5","+  1,5","+  0,5","2 sur la feuille",null,"4  Maxi / terrain     "]
[null,null,null,null,null,"","","",null,"N",1,"ROUSIES","S",9,null,null,null,null,null,null,"si cartes de couleurs",null,null,null,null,null,"2 sur le terrain",null," (5 sur la feuille)"]
[null,null,null,null,null,"","","",null,"S",3.5,"CLADEL","P",10,null," Nationale 3",null,null,15.5,null,null,null,"+  1,5","+  2,5","+  1,5","+  0,5"]
[null,null,null,null,null,"","","",null,"S",4.5,"PIECHOWIAK","T",11,null,null,null,null,"Si 16pts début match-handicap de 10pts",null,"Maxi 19 pts",null,null,null,null,null,"2 sur la feuille",null,"4 Maxi / terrain"]
[null,null,null,null,null,"","","",null,"ET",4,"DOKAEV","I",12,null,null,null,null,null,null,"si cartes de couleurs",null,null,null,null,null,"2 sur le terrain",null," (5 sur la feuille)"]
[null,null,null,null,null,"","","",null,"S",1.5,"BENNAI","A",13]
[null,null,null,null,null,"","","",null,"N",5,"COURTIN","M",14,null,"Inscrire dans la colonne de gauche les \"Statuts\" des joueurs de l'équipe"]
[null,null,null,null,null,"","","",null,"N",4,"BAIJOT","L",15,null,"J",null,null,"Pour les cartes Vertes",null,null,null,"Jeune joueur (U19 en Elite Nationale Bastide Médical)"]
[null,null,null,null,null,"","","",null,null,null,null,null,null,null,null,null,null,null,null,null,null,"Joueur débutant, sélectionnable en Equipe de France"]
[null,null,null,null,null,"","","",null,null,null,null,null,null,null,null,null,null,null,null,null,null,"seulement (attention à la date de validité juqu'à 22 ans révolu)"]
[null,null,null,null,null,"","",null,null,null,null,null,null,null,null,"JF",null,null,"Pour les cartes Jaunes",null,null,null,"Jeune joueuse (U19 en Elite Nationale Bastide Médical)"]
[null,null,null,null,null,"","","",null,null,null,null,null,null,null,null,null,null,null,null,null,null,"Joueuse débutante, sélectionnable en Equipe de France"]
[null,null,null,null,null,"","",null,null,null,null,null,null,null,null,null,null,null,null,null,null,null,"seulement (attention à la date de validité juqu' à 22 ans révolu)"]
[null,null,null,null,null,"","",null,null,null,null,null,null,null,null,"F ou FET",null,null,"Pour les cartes roses",null,null,null,"Pour les femmes ou femmes étrangères <5pts  (Bonus 1,5 pts)"]
[null,null,null,null,null,"","",null,null,null,null,null,null,null,null,"En Nationale 2 et 3 uniquement (joueuses et joueurs de plus de 55 ans)"]
[null,null,null,null,null,"","",null,null,null,null,null,null,null,null,"S",null,null,"Pour les hommes séniors",null,null,null," Français ou Etrangers (Bonus de 0,5pt)"]
[null,null,null,null,null,"","",null,null,null,null,null,null,null,null,"FS",null,null,"   Pour les femmes seniors",null,null,null," (Bonus 2pts)      "]
[" Joueurs-joueuses valides de l'équipe (5 points)",null,null,null,null,"","",null,null,null,null,null,null,null,null,"JS",null,null," Pour les jeunes hommes séniors",null,null,null," Débutants  (Bonus 2pts)  validité (<3pts 2ans)       ( > 3pts 1 an)"]
[{"$f":"IF(G31=0,\"\",IF(G31>2,\"Trop de valides sur le terrain\",\"OK\"))","v":""},null,null,null,null,"","",null,null,null,null,null,null,null,null,"JFS",null,null," Pour les jeunes femmes séniors",null,null,null," Débutantes  (Bonus 3pts)  validité (<3pts 2ans)     ( > 3pts 1 an)"]
["Joueurs étrangers ",null,null,null,null,"","",null,null,null,null,null,null,null,null,"Autres possibilités (sans Bonus)"]
[{"$f":"IF(F31=0,\"\",IF(F31>5,\"Trop de joueurs étrangers sur la feuille\",\"OK\"))","v":""},null,null,null,null,"","",null,null,null,null,null,null,null,null,"ET",null,null,"Pour un joueur étranger"]
[null,null,null,null,null,{"$f":"SUM(F6:F28)","v":0},{"$f":"SUM(G6:G28)","v":0},null,null,null,null,null,null,null,null,"FID",null,null,"Pour un joueur fidèle"]
[null,null,null,null,null,null,null,null,null,null,null,null,null,null,null,"N",null,null,"Pour tous joueurs sans symbole sur la carte de classification"]

{"sheet":"BLANQUEFORT","index":39,"n_rows":32,"n_cols":29,"rows_kept":32,"cut":false,"hidden":false,"merged":[[31,15,31,17],[22,18,22,21],[23,15,23,29],[24,15,24,17],[25,15,25,17],[26,15,26,17],[15,15,15,29],[19,15,21,17],[19,18,21,21],[16,18,18,21],[30,15,30,17],[16,15,18,17],[28,15,28,29],[5,28,6,29],[7,15,8,17],[7,18,8,19],[7,22,8,22],[7,23,8,23],[7,24,8,24],[7,28,7,29],[8,28,8,29],[5,15,6,17],[5,18,6,19],[5,22,6,22],[5,23,6,23],[5,24,6,24],[5,20,5,21],[6,20,6,21],[7,20,7,21],[0,15,0,29],[1,22,3,22],[1,23,3,23],[1,24,3,24],[1,25,3,25],[1,26,3,27],[1,28,3,29],[8,20,8,21],[9,20,9,21],[9,18,10,19],[2,9,2,13],[5,26,5,27],[6,26,6,27],[7,26,7,27],[8,26,8,27],[9,26,9,27],[10,26,10,27],[10,20,10,21],[1,0,2,0],[1,1,2,3],[1,9,1,13],[22,15,22,17],[13,26,13,27],[11,20,11,21],[9,15,10,17],[11,15,14,17],[11,18,11,19],[12,18,14,19],[12,20,12,21],[13,20,13,21],[14,20,14,21],[14,26,14,27],[9,23,10,23],[9,24,10,24],[9,28,9,29],[10,28,10,29],[11,22,14,22],[11,23,14,23],[11,24,14,24],[11,25,14,25],[11,28,11,29],[11,26,11,27],[9,22,10,22],[12,28,12,29],[13,28,13,29],[14,28,14,29],[9,25,10,25],[12,26,12,27],[29,0,29,4],[26,0,26,4],[27,0,27,4],[27,15,27,17],[29,15,29,17],[28,0,28,4]]}
["BLANQUEFORT",null,null,null,null,null,null,null,null,null,null,null,null,null,null,"Saison 2023-2024"]
[null,"Joueur(es) participant à la rencontre",null,null,null,null,null,null,null,"Saisir votre liste complète en MAJUSCULES ",null,null,null,null,null,null,null,null,null,null,null,null,"Carte Verte","Carte Jaune","Carte Rose","Carte Bleue","5,0 Val",null,"Non Sélectionnables en EDF (hors Fidet)"]
[null,null,null,null,null,null,null,null,null,"Joueurs(es) qualifié(es) saison 2023 -2024",null,null,null,null,null,null,null,null,"Avec une date de validité"]
[]
["Statuts","Classif.","          Noms      /    Prénoms",null,"Numéros","ET","VALIDE",null,null,"Statuts","Classif.","          Noms      /    Prénoms",null,"Numéros"]
[null,null,null,null,null,{"$f":"IF(A6=\"ET\",1,\"\")","v":""},{"$f":"IF(B6=5,1,\"\")","v":""},null,null,"N",3.5,"BENTRAT","R",4,null,"Elite Nationale Bastide Médical",null,null,14.5,null,"Maxi 17,5 pts",null,"+  1 ","+  2","+  1,5",null,"1 sur la feuille",null,"Pas de limite"]
[null,null,null,null,null,{"$f":"IF(A7=\"ET\",1,\"\")","v":""},{"$f":"IF(B7=5,1,\"\")","v":""},null,null,"N",4,"NIETO","D",5,null,null,null,null,null,null,"si cartes de couleurs",null,null,null,null,null,"et terrain"]
[null,null,null,null,null,{"$f":"IF(A8=\"ET\",1,\"\")","v":""},{"$f":"IF(B8=5,1,\"\")","v":""},null,null,null,null,null,null,6,null," Nationale 1",null,null,14.5,null,"Maxi 17,5 pts",null,"+  1 ,5","+  2,5","+  1,5",null,"1 sur la feuille",null,"4  Maxi / terrain     "]
[null,null,null,null,null,"","",null,null,"N",4.5,"MALLET","S",7,null,null,null,null,null,null,"si cartes de couleurs",null,null,null,null,null,"et terrain",null," (5 sur la feuille)"]
[null,null,null,null,null,"","",null,null,"N",1,"BODY","E",8,null," Nationale 2",null,null,15,null,"Maxi 19 pts",null,"+  1,5","+  2,5","+  1,5","+  0,5","2 sur la feuille",null,"4  Maxi / terrain     "]
[null,null,null,null,null,"","",null,null,null,null,null,null,9,null,null,null,null,null,null,"si cartes de couleurs",null,null,null,null,null,"2 sur le terrain",null," (5 sur la feuille)"]
[null,null,null,null,null,"","",null,null,"J",1.5,"VAYSSET","JN",10,null," Nationale 3",null,null,15.5,null,null,null,"+  1,5","+  2,5","+  1,5","+  0,5"]
[null,null,null,null,null,"","",null,null,"N",1,"TEIXERA","J",12,null,null,null,null,"Si 16pts début match-handicap de 10pts",null,"Maxi 19 pts",null,null,null,null,null,"2 sur la feuille",null,"4 Maxi / terrain"]
[null,null,null,null,null,"","",null,null,"N",2,"BANNES","P",22,null,null,null,null,null,null,"si cartes de couleurs",null,null,null,null,null,"2 sur le terrain",null," (5 sur la feuille)"]
[null,null,null,null,null,"","",null,null,"N",2.5,"COUREAU","T",24]
[null,null,null,null,null,"","",null,null,"N",4.5,"SIMEON","E",20,null,"Inscrire dans la colonne de gauche les \"Statuts\" des joueurs de l'équipe"]
[null,null,null,null,null,"","","",null,"N",5,"DANIEL LACOMB","A",27,null,"J",null,null,"Pour les cartes Vertes",null,null,null,"Jeune joueur (U19 en Elite Nationale Bastide Médical)"]
[null,null,null,null,null,"","","",null,"N",2.5,"LEPAPE","A",92,null,null,null,null,null,null,null,null,"Joueur débutant, sélectionnable en Equipe de France"]
[null,null,null,null,null,"","","",null,"N",3.5,"BERREGRAGUE","S",99,null,null,null,null,null,null,null,null,"seulement (attention à la date de validité juqu'à 22 ans révolu)"]
[null,null,null,null,null,"","",null,null,null,null,null,null,18,null,"JF",null,null,"Pour les cartes Jaunes",null,null,null,"Jeune joueuse (U19 en Elite Nationale Bastide Médical)"]
[null,null,null,null,null,"","","",null,null,null,null,null,19,null,null,null,null,null,null,null,null,"Joueuse débutante, sélectionnable en Equipe de France"]
[null,null,null,null,null,"","",null,null,null,null,null,null,20,null,null,null,null,null,null,null,null,"seulement (attention à la date de validité juqu' à 22 ans révolu)"]
[null,null,null,null,null,"","",null,null,null,null,null,null,null,null,"F ou FET",null,null,"Pour les cartes roses",null,null,null,"Pour les femmes ou femmes étrangères <5pts  (Bonus 1,5 pts)"]
[null,null,null,null,null,"","",null,null,null,null,null,null,null,null,"En Nationale 2 et 3 uniquement (joueuses et joueurs de plus de 55 ans)"]
[null,null,null,null,null,"","",null,null,null,null,null,null,null,null,"S",null,null,"Pour les hommes séniors",null,null,null," Français ou Etrangers (Bonus de 0,5pt)"]
[null,null,null,null,null,null,null,null,null,null,null,null,null,null,null,"FS",null,null,"   Pour les femmes seniors",null,null,null," (Bonus 2pts)      "]
[" Joueurs-joueuses valides de l'équipe (5 points)",null,null,null,null,null,null,null,null,null,null,null,null,null,null,"JS",null,null," Pour les jeunes hommes séniors",null,null,null," Débutants  (Bonus 2pts)  validité (<3pts 2ans)       ( > 3pts 1 an)"]
[{"$f":"IF(G31=0,\"\",IF(G31>2,\"Trop de valides sur le terrain\",\"OK\"))","v":""},null,null,null,null,null,null,null,null,null,null,null,null,null,null,"JFS",null,null," Pour les jeunes femmes séniors",null,null,null," Débutantes  (Bonus 3pts)  validité (<3pts 2ans)     ( > 3pts 1 an)"]
["Joueurs étrangers ",null,null,null,null,null,null,null,null,null,null,null,null,null,null,"Autres possibilités (sans Bonus)"]
[{"$f":"IF(F31=0,\"\",IF(F31>5,\"Trop de joueurs étrangers sur la feuille\",\"OK\"))","v":""},null,null,null,null,null,null,null,null,null,null,null,null,null,null,"ET",null,null,"Pour un joueur étranger"]
[null,null,null,null,null,{"$f":"SUM(F6:F28)","v":0},{"$f":"SUM(G6:G30)","v":0},null,null,null,null,null,null,null,null,"FID",null,null,"Pour un joueur fidèle"]
[null,null,null,null,null,null,null,null,null,null,null,null,null,null,null,"N",null,null,"Pour tous joueurs sans symbole sur la carte de classification"]

{"sheet":"CAMBRAI","index":40,"n_rows":32,"n_cols":29,"rows_kept":32,"cut":false,"hidden":false,"merged":[[30,15,30,17],[31,15,31,17],[23,15,23,29],[24,15,24,17],[25,15,25,17],[26,15,26,17],[28,15,28,29],[2,9,2,13],[5,20,5,21],[5,26,5,27],[0,15,0,29],[1,22,3,22],[1,23,3,23],[1,24,3,24],[1,25,3,25],[1,26,3,27],[1,28,3,29],[5,15,6,17],[5,18,6,19],[5,22,6,22],[5,23,6,23],[5,24,6,24],[5,28,6,29],[7,15,8,17],[7,18,8,19],[7,22,8,22],[7,23,8,23],[6,26,6,27],[7,20,7,21],[7,26,7,27],[7,24,8,24],[6,20,6,21],[7,28,7,29],[8,28,8,29],[8,20,8,21],[9,15,10,17],[9,18,10,19],[9,22,10,22],[9,23,10,23],[10,20,10,21],[8,26,8,27],[9,20,9,21],[9,26,9,27],[9,24,10,24],[9,25,10,25],[9,28,9,29],[10,28,10,29],[10,26,10,27],[11,15,14,17],[11,18,11,19],[11,22,14,22],[11,23,14,23],[12,18,14,19],[12,20,12,21],[13,20,13,21],[14,20,14,21],[11,20,11,21],[11,26,11,27],[11,24,14,24],[11,25,14,25],[11,28,11,29],[12,26,12,27],[12,28,12,29],[13,26,13,27],[13,28,13,29],[14,26,14,27],[14,28,14,29],[15,15,15,29],[1,0,2,0],[1,1,2,3],[1,9,1,13],[29,0,29,4],[26,0,26,4],[27,0,27,4],[27,15,27,17],[28,0,28,4],[29,15,29,17],[22,15,22,17],[19,15,21,17],[19,18,21,21],[22,18,22,21],[16,15,18,17],[16,18,18,21]]}
["CAMBRAI",null,null,null,null,null,null,null,null,null,null,null,null,null,null,"Saison 2023-2024"]
[null,"Joueur(es) participant à la rencontre",null,null,null,null,null,null,null,"Saisir votre liste complète en MAJUSCULES ",null,null,null,null,null,null,null,null,null,null,null,null,"Carte Verte","Carte Jaune","Carte Rose","Carte Bleue","5,0 Val",null,"Non Sélectionnables en EDF (hors Fidet)"]
[null,null,null,null,null,null,null,null,null,"Joueurs(es) qualifié(es) saison 2023 -2024",null,null,null,null,null,null,null,null,"Avec une date de validité"]
[]
["Statuts","Classif.","          Noms      /    Prénoms",null,"Numéros","ET","VALID","",null,"Statuts","Classif.","          Noms      /    Prénoms",null,"Numéros"]
[null,null,null,null,null,{"$f":"IF(A6=\"ET\",1,\"\")","v":""},{"$f":"IF(B6=5,1,\"\")","v":""},"",null,"ET",1,"KANIA","Y",4,null,"Elite Nationale Bastide Médical",null,null,14.5,null,"Maxi 17,5 pts",null,"+  1 ","+  2","+  1,5",null,"1 sur la feuille",null,"Pas de limite"]
[null,null,null,null,null,{"$f":"IF(A7=\"ET\",1,\"\")","v":""},{"$f":"IF(B7=5,1,\"\")","v":""},null,null,null,null,null,null,5,null,null,null,null,null,null,"si cartes de couleurs",null,null,null,null,null,"et terrain"]
[null,null,null,null,null,{"$f":"IF(A8=\"ET\",1,\"\")","v":""},{"$f":"IF(B8=5,1,\"\")","v":""},"",null,"N",2,"HONORE","B",6,null," Nationale 1",null,null,14.5,null,"Maxi 17,5 pts",null,"+  1 ,5","+  2,5","+  1,5",null,"1 sur la feuille",null,"4  Maxi / terrain     "]
[null,null,null,null,null,"","",null,null,null,null,null,null,7,null,null,null,null,null,null,"si cartes de couleurs",null,null,null,null,null,"et terrain",null," (5 sur la feuille)"]
[null,null,null,null,null,"","","",null,"ET",1,"JAEGERS","K",8,null," Nationale 2",null,null,15,null,"Maxi 19 pts",null,"+  1,5","+  2,5","+  1,5","+  0,5","2 sur la feuille",null,"4  Maxi / terrain     "]
[null,null,null,null,null,"","","",null,"N",1.5,"RESZEL","R",9,null,null,null,null,null,null,"si cartes de couleurs",null,null,null,null,null,"2 sur le terrain",null," (5 sur la feuille)"]
[null,null,null,null,null,"","","",null,"N",5,"CARPENTIER","T",10,null," Nationale 3",null,null,15.5,null,null,null,"+  1,5","+  2,5","+  1,5","+  0,5"]
[null,null,null,null,null,"","","",null,"ET",2.5,"ETAOUKIL","L",11,null,null,null,null,"Si 16pts début match-handicap de 10pts",null,"Maxi 19 pts",null,null,null,null,null,"2 sur la feuille",null,"4 Maxi / terrain"]
[null,null,null,null,null,"","","",null,"N",2.5,"NYBELEN","M",12,null,null,null,null,null,null,"si cartes de couleurs",null,null,null,null,null,"2 sur le terrain",null," (5 sur la feuille)"]
[null,null,null,null,null,"","","",null,"ET",4,"BAYNE","Y",13]
[null,null,null,null,null,"","","",null,"N",2.5,"HAMELIN","D",14,null,"Inscrire dans la colonne de gauche les \"Statuts\" des joueurs de l'équipe"]
[null,null,null,null,null,"","","",null,"N",5,"BOURGUEUF","T",15,null,"J",null,null,"Pour les cartes Vertes",null,null,null,"Jeune joueur (U19 en Elite Nationale Bastide Médical)"]
[null,null,null,null,null,"","","",null,null,null,null,null,16,null,null,null,null,null,null,null,null,"Joueur débutant, sélectionnable en Equipe de France"]
[null,null,null,null,null,"","","",null,null,null,null,null,17,null,null,null,null,null,null,null,null,"seulement (attention à la date de validité juqu'à 22 ans révolu)"]
[null,null,null,null,null,"","",null,null,null,null,null,null,18,null,"JF",null,null,"Pour les cartes Jaunes",null,null,null,"Jeune joueuse (U19 en Elite Nationale Bastide Médical)"]
[null,null,null,null,null,"","","",null,null,null,null,null,19,null,null,null,null,null,null,null,null,"Joueuse débutante, sélectionnable en Equipe de France"]
[null,null,null,null,null,"","",null,null,null,null,null,null,20,null,null,null,null,null,null,null,null,"seulement (attention à la date de validité juqu' à 22 ans révolu)"]
[null,null,null,null,null,"","",null,null,"N",4.5,"DEREGNAUCOURT","S",23,null,"F ou FET",null,null,"Pour les cartes roses",null,null,null,"Pour les femmes ou femmes étrangères <5pts  (Bonus 1,5 pts)"]
[null,null,null,null,null,"","",null,null,null,null,null,null,null,null,"En Nationale 2 et 3 uniquement (joueuses et joueurs de plus de 55 ans)"]
[null,null,null,null,null,"","",null,null,null,null,null,null,null,null,"S",null,null,"Pour les hommes séniors",null,null,null," Français ou Etrangers (Bonus de 0,5pt)"]
[null,null,null,null,null,"","",null,null,null,null,null,null,null,null,"FS",null,null,"   Pour les femmes seniors",null,null,null," (Bonus 2pts)      "]
[" Joueurs-joueuses valides de l'équipe (5 points)",null,null,null,null,"","",null,null,null,null,null,null,null,null,"JS",null,null," Pour les jeunes hommes séniors",null,null,null," Débutants  (Bonus 2pts)  validité (<3pts 2ans)       ( > 3pts 1 an)"]
[{"$f":"IF(G31=0,\"\",IF(G31>2,\"Trop de valides sur le terrain\",\"OK\"))","v":""},null,null,null,null,"","",null,null,null,null,null,null,null,null,"JFS",null,null," Pour les jeunes femmes séniors",null,null,null," Débutantes  (Bonus 3pts)  validité (<3pts 2ans)     ( > 3pts 1 an)"]
["Joueurs étrangers ",null,null,null,null,"","",null,null,null,null,null,null,null,null,"Autres possibilités (sans Bonus)"]
[{"$f":"IF(F31=0,\"\",IF(F31>5,\"Trop de joueurs étrangers sur la feuille\",\"OK\"))","v":""},null,null,null,null,"","",null,null,null,null,null,null,null,null,"ET",null,null,"Pour un joueur étranger"]
[null,null,null,null,null,{"$f":"SUM(F6:F28)","v":0},{"$f":"SUM(G6:G28)","v":0},null,null,null,null,null,null,null,null,"FID",null,null,"Pour un joueur fidèle"]
[null,null,null,null,null,null,null,null,null,null,null,null,null,null,null,"N",null,null,"Pour tous joueurs sans symbole sur la carte de classification"]

{"sheet":"BASKET FAUTEUIL FEMININ","index":41,"n_rows":32,"n_cols":29,"rows_kept":32,"cut":false,"hidden":false,"merged":[[15,15,15,29],[19,15,21,17],[19,18,21,21],[22,18,22,21],[16,15,18,17],[16,18,18,21],[22,15,22,17],[31,15,31,17],[23,15,23,29],[24,15,24,17],[25,15,25,17],[26,15,26,17],[28,15,28,29],[29,15,29,17],[30,15,30,17],[9,28,9,29],[10,28,10,29],[7,15,8,17],[7,18,8,19],[7,22,8,22],[7,23,8,23],[7,24,8,24],[9,15,10,17],[9,18,10,19],[9,22,10,22],[9,23,10,23],[9,24,10,24],[9,26,9,27],[10,20,10,21],[9,20,9,21],[10,26,10,27],[7,28,7,29],[8,28,8,29],[6,26,6,27],[7,26,7,27],[7,20,7,21],[8,20,8,21],[8,26,8,27],[5,22,6,22],[5,23,6,23],[5,24,6,24],[6,20,6,21],[5,28,6,29],[5,20,5,21],[5,26,5,27],[27,0,27,4],[28,0,28,4],[29,0,29,4],[26,0,26,4],[27,15,27,17],[11,28,11,29],[14,28,14,29],[11,24,14,24],[11,25,14,25],[12,18,14,19],[12,28,12,29],[11,18,11,19],[11,22,14,22],[11,23,14,23],[13,26,13,27],[13,28,13,29],[14,20,14,21],[14,26,14,27],[0,15,0,29],[1,22,3,22],[1,23,3,23],[1,24,3,24],[1,26,3,27],[1,28,3,29],[9,25,10,25],[12,20,12,21],[12,26,12,27],[13,20,13,21],[5,15,6,17],[5,18,6,19],[11,20,11,21],[11,26,11,27],[11,15,14,17],[1,0,2,0],[1,1,2,3],[1,9,1,13],[2,9,2,13],[1,25,3,25]]}
["BASKET FAUTEUIL FEMININ",null,null,null,null,null,null,null,null,null,null,null,null,null,null,"Saison 2023-2024"]
[null,"Joueur(es) participant à la rencontre",null,null,null,null,null,null,null,"Saisir votre liste complète en MAJUSCULES ",null,null,null,null,null,null,null,null,null,null,null,null,"Carte Verte","Carte Jaune","Carte Rose","Carte Bleue","5,0 Val",null,"Non Sélectionnables en EDF (hors Fidet)"]
[null,null,null,null,null,null,null,null,null,"Joueurs(es) qualifié(es) saison 2023 -2024",null,null,null,null,null,null,null,null,"Avec une date de validité"]
[]
["Statuts","Classif.","          Noms      /    Prénoms",null,"Numéros","ET","VALID","",null,"Statuts","Classif.","          Noms      /    Prénoms",null,"Numéros"]
[null,null,null,null,null,{"$f":"IF(A6=\"ET\",1,\"\")","v":""},{"$f":"IF(B6=5,1,\"\")","v":""},"",null,"F",4.5,"BLAIS","M",2,null,"Elite Nationale Bastide Médical",null,null,14.5,null,"Maxi 17,5 pts",null,"+  1 ","+  2","+  1,5",null,"1 sur la feuille",null,"Pas de limite"]
[null,null,null,null,null,{"$f":"IF(A7=\"ET\",1,\"\")","v":""},{"$f":"IF(B7=5,1,\"\")","v":""},null,null,null,null,null,null,3,null,null,null,null,null,null,"si cartes de couleurs",null,null,null,null,null,"et terrain"]
[null,null,null,null,null,{"$f":"IF(A8=\"ET\",1,\"\")","v":""},{"$f":"IF(B8=5,1,\"\")","v":""},"",null,"F",2,"ITA","V",4,null," Nationale 1",null,null,14.5,null,"Maxi 17,5 pts",null,"+  1 ,5","+  2,5","+  1,5",null,"1 sur la feuille",null,"4  Maxi / terrain     "]
[null,null,null,null,null,"","",null,null,"F",4.5,"DAVID","E",5,null,null,null,null,null,null,"si cartes de couleurs",null,null,null,null,null,"et terrain",null," (5 sur la feuille)"]
[null,null,null,null,null,"","","",null,"F",4.5,"BUSO","M",6,null," Nationale 2",null,null,15,null,"Maxi 19 pts",null,"+  1,5","+  2,5","+  1,5","+  0,5","2 sur la feuille",null,"4  Maxi / terrain     "]
[null,null,null,null,null,"","","",null,"F",1,"COATENTIEC","C",7,null,null,null,null,null,null,"si cartes de couleurs",null,null,null,null,null,"2 sur le terrain",null," (5 sur la feuille)"]
[null,null,null,null,null,"","","",null,"F",4.5,"FONTAINE","E",8,null," Nationale 3",null,null,15.5,null,null,null,"+  1,5","+  2,5","+  1,5","+  0,5"]
[null,null,null,null,null,"","","",null,"F",1,"DOUMESCHE","F",9,null,null,null,null,"Si 16pts début match-handicap de 10pts",null,"Maxi 19 pts",null,null,null,null,null,"2 sur la feuille",null,"4 Maxi / terrain"]
[null,null,null,null,null,"","","",null,"F",2,"RUBLER","AS",10,null,null,null,null,null,null,"si cartes de couleurs",null,null,null,null,null,"2 sur le terrain",null," (5 sur la feuille)"]
[null,null,null,null,null,"","","",null,null,null,null,null,11]
[null,null,null,null,null,"","","",null,null,null,null,null,12,null,"Inscrire dans la colonne de gauche les \"Statuts\" des joueurs de l'équipe"]
[null,null,null,null,null,"","","",null,"F",1,"D'ACREMONT","AE",13,null,"J",null,null,"Pour les cartes Vertes",null,null,null,"Jeune joueur (U19 en Elite Nationale Bastide Médical)"]
[null,null,null,null,null,"","","",null,"F",2.5,"CLARY","L",14,null,null,null,null,null,null,null,null,"Joueur débutant, sélectionnable en Equipe de France"]
[null,null,null,null,null,"","","",null,null,null,null,null,15,null,null,null,null,null,null,null,null,"seulement (attention à la date de validité juqu'à 22 ans révolu)"]
[null,null,null,null,null,"","",null,null,null,null,null,null,null,null,"JF",null,null,"Pour les cartes Jaunes",null,null,null,"Jeune joueuse (U19 en Elite Nationale Bastide Médical)"]
[null,null,null,null,null,"","","",null,"F",3.5,"CLAVIER","M",null,null,null,null,null,null,null,null,null,"Joueuse débutante, sélectionnable en Equipe de France"]
[null,null,null,null,null,"","",null,null,null,null,null,null,null,null,null,null,null,null,null,null,null,"seulement (attention à la date de validité juqu' à 22 ans révolu)"]
[null,null,null,null,null,"","",null,null,null,null,null,null,null,null,"F ou FET",null,null,"Pour les cartes roses",null,null,null,"Pour les femmes ou femmes étrangères <5pts  (Bonus 1,5 pts)"]
[null,null,null,null,null,"","",null,null,null,null,null,null,null,null,"En Nationale 2 et 3 uniquement (joueuses et joueurs de plus de 55 ans)"]
[null,null,null,null,null,"","",null,null,null,null,null,null,null,null,"S",null,null,"Pour les hommes séniors",null,null,null," Français ou Etrangers (Bonus de 0,5pt)"]
[null,null,null,null,null,"","",null,null,null,null,null,null,null,null,"FS",null,null,"   Pour les femmes seniors",null,null,null," (Bonus 2pts)      "]
[" Joueurs-joueuses valides de l'équipe (5 points)",null,null,null,null,"","",null,null,null,null,null,null,null,null,"JS",null,null," Pour les jeunes hommes séniors",null,null,null," Débutants  (Bonus 2pts)  validité (<3pts 2ans)       ( > 3pts 1 an)"]
[{"$f":"IF(G31=0,\"\",IF(G31>2,\"Trop de valides sur le terrain\",\"OK\"))","v":""},null,null,null,null,"","",null,null,null,null,null,null,null,null,"JFS",null,null," Pour les jeunes femmes séniors",null,null,null," Débutantes  (Bonus 3pts)  validité (<3pts 2ans)     ( > 3pts 1 an)"]
["Joueurs étrangers ",null,null,null,null,"","",null,null,null,null,null,null,null,null,"Autres possibilités (sans Bonus)"]
[{"$f":"IF(F31=0,\"\",IF(F31>5,\"Trop de joueurs étrangers sur la feuille\",\"OK\"))","v":""},null,null,null,null,"","",null,null,null,null,null,null,null,null,"ET",null,null,"Pour un joueur étranger"]
[null,null,null,null,null,{"$f":"SUM(F6:F28)","v":0},{"$f":"SUM(G6:G28)","v":0},null,null,null,null,null,null,null,null,"FID",null,null,"Pour un joueur fidèle"]
[null,null,null,null,null,null,null,null,null,null,null,null,null,null,null,"N",null,null,"Pour tous joueurs sans symbole sur la carte de classification"]

{"sheet":"LANNION 2","index":42,"n_rows":32,"n_cols":29,"rows_kept":32,"cut":false,"hidden":false,"merged":[[30,15,30,17],[31,15,31,17],[23,15,23,29],[24,15,24,17],[25,15,25,17],[26,15,26,17],[28,15,28,29],[2,9,2,13],[5,20,5,21],[5,26,5,27],[0,15,0,29],[1,22,3,22],[1,23,3,23],[1,24,3,24],[1,25,3,25],[1,26,3,27],[1,28,3,29],[5,15,6,17],[5,18,6,19],[5,22,6,22],[5,23,6,23],[5,24,6,24],[5,28,6,29],[7,15,8,17],[7,18,8,19],[7,22,8,22],[7,23,8,23],[6,26,6,27],[7,20,7,21],[7,26,7,27],[7,24,8,24],[6,20,6,21],[7,28,7,29],[8,28,8,29],[8,20,8,21],[9,15,10,17],[9,18,10,19],[9,22,10,22],[9,23,10,23],[10,20,10,21],[8,26,8,27],[9,20,9,21],[9,26,9,27],[9,24,10,24],[9,25,10,25],[9,28,9,29],[10,28,10,29],[10,26,10,27],[11,15,14,17],[11,18,11,19],[11,22,14,22],[11,23,14,23],[12,18,14,19],[12,20,12,21],[13,20,13,21],[14,20,14,21],[11,20,11,21],[11,26,11,27],[11,24,14,24],[11,25,14,25],[11,28,11,29],[12,26,12,27],[12,28,12,29],[13,26,13,27],[13,28,13,29],[14,26,14,27],[14,28,14,29],[15,15,15,29],[1,0,2,0],[1,1,2,3],[1,9,1,13],[29,0,29,4],[26,0,26,4],[27,0,27,4],[27,15,27,17],[28,0,28,4],[29,15,29,17],[22,15,22,17],[19,15,21,17],[19,18,21,21],[22,18,22,21],[16,15,18,17],[16,18,18,21]]}
["LANNION 2",null,null,null,null,null,null,null,null,null,null,null,null,null,null,"Saison 2023-2024"]
[null,"Joueur(es) participant à la rencontre",null,null,null,null,null,null,null,"Saisir votre liste complète en MAJUSCULES ",null,null,null,null,null,null,null,null,null,null,null,null,"Carte Verte","Carte Jaune","Carte Rose","Carte Bleue","5,0 Val",null,"Non Sélectionnables en EDF (hors Fidet)"]
[null,null,null,null,null,null,null,null,null,"Joueurs(es) qualifié(es) saison 2023 -2024",null,null,null,null,null,null,null,null,"Avec une date de validité"]
[]
["Statuts","Classif.","          Noms      /    Prénoms",null,"Numéros","ET","VALID","",null,"Statuts","Classif.","          Noms      /    Prénoms",null,"Numéros"]
[null,null,null,null,null,{"$f":"IF(A6=\"ET\",1,\"\")","v":""},{"$f":"IF(B6=5,1,\"\")","v":""},"",null,null,null,null,null,4,null,"Elite Nationale Bastide Médical",null,null,14.5,null,"Maxi 17,5 pts",null,"+  1 ","+  2","+  1,5",null,"1 sur la feuille",null,"Pas de limite"]
[null,null,null,null,null,{"$f":"IF(A7=\"ET\",1,\"\")","v":""},{"$f":"IF(B7=5,1,\"\")","v":""},null,null,"N",2.5,"OUAR","N",5,null,null,null,null,null,null,"si cartes de couleurs",null,null,null,null,null,"et terrain"]
[null,null,null,null,null,{"$f":"IF(A8=\"ET\",1,\"\")","v":""},{"$f":"IF(B8=5,1,\"\")","v":""},"",null,"F",1,"ETAVARD-GLEMP","A",6,null," Nationale 1",null,null,14.5,null,"Maxi 17,5 pts",null,"+  1 ,5","+  2,5","+  1,5",null,"1 sur la feuille",null,"4  Maxi / terrain     "]
[null,null,null,null,null,"","",null,null,null,null,null,null,7,null,null,null,null,null,null,"si cartes de couleurs",null,null,null,null,null,"et terrain",null," (5 sur la feuille)"]
[null,null,null,null,null,"","","",null,null,null,null,null,8,null," Nationale 2",null,null,15,null,"Maxi 19 pts",null,"+  1,5","+  2,5","+  1,5","+  0,5","2 sur la feuille",null,"4  Maxi / terrain     "]
[null,null,null,null,null,"","","",null,"N",3,"BOLMONT","Y",9,null,null,null,null,null,null,"si cartes de couleurs",null,null,null,null,null,"2 sur le terrain",null," (5 sur la feuille)"]
[null,null,null,null,null,"","","",null,null,null,null,null,10,null," Nationale 3",null,null,15.5,null,null,null,"+  1,5","+  2,5","+  1,5","+  0,5"]
[null,null,null,null,null,"","","",null,"N",1,"LEJEUNE","T",11,null,null,null,null,"Si 16pts début match-handicap de 10pts",null,"Maxi 19 pts",null,null,null,null,null,"2 sur la feuille",null,"4 Maxi / terrain"]
[null,null,null,null,null,"","","",null,"N",2,"CAROFF","C",12,null,null,null,null,null,null,"si cartes de couleurs",null,null,null,null,null,"2 sur le terrain",null," (5 sur la feuille)"]
[null,null,null,null,null,"","","",null,"N",4,"ETAVARD-GLEMP","F",13]
[null,null,null,null,null,"","","",null,null,null,null,null,14,null,"Inscrire dans la colonne de gauche les \"Statuts\" des joueurs de l'équipe"]
[null,null,null,null,null,"","","",null,"N",5,"CHAMBAUDIE","F",15,null,"J",null,null,"Pour les cartes Vertes",null,null,null,"Jeune joueur (U19 en Elite Nationale Bastide Médical)"]
[null,null,null,null,null,"","","",null,null,null,null,null,null,null,null,null,null,null,null,null,null,"Joueur débutant, sélectionnable en Equipe de France"]
[null,null,null,null,null,"","","",null,null,null,null,null,null,null,null,null,null,null,null,null,null,"seulement (attention à la date de validité juqu'à 22 ans révolu)"]
[null,null,null,null,null,"","",null,null,null,null,null,null,null,null,"JF",null,null,"Pour les cartes Jaunes",null,null,null,"Jeune joueuse (U19 en Elite Nationale Bastide Médical)"]
[null,null,null,null,null,"","","",null,null,null,null,null,null,null,null,null,null,null,null,null,null,"Joueuse débutante, sélectionnable en Equipe de France"]
[null,null,null,null,null,"","",null,null,null,null,null,null,null,null,null,null,null,null,null,null,null,"seulement (attention à la date de validité juqu' à 22 ans révolu)"]
[null,null,null,null,null,"","",null,null,null,null,null,null,null,null,"F ou FET",null,null,"Pour les cartes roses",null,null,null,"Pour les femmes ou femmes étrangères <5pts  (Bonus 1,5 pts)"]
[null,null,null,null,null,"","",null,null,null,null,null,null,null,null,"En Nationale 2 et 3 uniquement (joueuses et joueurs de plus de 55 ans)"]
[null,null,null,null,null,"","",null,null,null,null,null,null,null,null,"S",null,null,"Pour les hommes séniors",null,null,null," Français ou Etrangers (Bonus de 0,5pt)"]
[null,null,null,null,null,"","",null,null,null,null,null,null,null,null,"FS",null,null,"   Pour les femmes seniors",null,null,null," (Bonus 2pts)      "]
[" Joueurs-joueuses valides de l'équipe (5 points)",null,null,null,null,"","",null,null,null,null,null,null,null,null,"JS",null,null," Pour les jeunes hommes séniors",null,null,null," Débutants  (Bonus 2pts)  validité (<3pts 2ans)       ( > 3pts 1 an)"]
[{"$f":"IF(G31=0,\"\",IF(G31>2,\"Trop de valides sur le terrain\",\"OK\"))","v":""},null,null,null,null,"","",null,null,null,null,null,null,null,null,"JFS",null,null," Pour les jeunes femmes séniors",null,null,null," Débutantes  (Bonus 3pts)  validité (<3pts 2ans)     ( > 3pts 1 an)"]
["Joueurs étrangers ",null,null,null,null,"","",null,null,null,null,null,null,null,null,"Autres possibilités (sans Bonus)"]
[{"$f":"IF(F31=0,\"\",IF(F31>5,\"Trop de joueurs étrangers sur la feuille\",\"OK\"))","v":""},null,null,null,null,"","",null,null,null,null,null,null,null,null,"ET",null,null,"Pour un joueur étranger"]
[null,null,null,null,null,{"$f":"SUM(F6:F28)","v":0},{"$f":"SUM(G6:G28)","v":0},null,null,null,null,null,null,null,null,"FID",null,null,"Pour un joueur fidèle"]
[null,null,null,null,null,null,null,null,null,null,null,null,null,null,null,"N",null,null,"Pour tous joueurs sans symbole sur la carte de classification"]

{"sheet":"SAINT HERBLAIN","index":43,"n_rows":32,"n_cols":29,"rows_kept":32,"cut":false,"hidden":false,"merged":[[30,15,30,17],[31,15,31,17],[23,15,23,29],[24,15,24,17],[25,15,25,17],[26,15,26,17],[28,15,28,29],[2,9,2,13],[5,20,5,21],[5,26,5,27],[0,15,0,29],[1,22,3,22],[1,23,3,23],[1,24,3,24],[1,25,3,25],[1,26,3,27],[1,28,3,29],[5,15,6,17],[5,18,6,19],[5,22,6,22],[5,23,6,23],[5,24,6,24],[5,28,6,29],[7,15,8,17],[7,18,8,19],[7,22,8,22],[7,23,8,23],[6,26,6,27],[7,20,7,21],[7,26,7,27],[7,24,8,24],[6,20,6,21],[7,28,7,29],[8,28,8,29],[8,20,8,21],[9,15,10,17],[9,18,10,19],[9,22,10,22],[9,23,10,23],[10,20,10,21],[8,26,8,27],[9,20,9,21],[9,26,9,27],[9,24,10,24],[9,25,10,25],[9,28,9,29],[10,28,10,29],[10,26,10,27],[11,15,14,17],[11,18,11,19],[11,22,14,22],[11,23,14,23],[12,18,14,19],[12,20,12,21],[13,20,13,21],[14,20,14,21],[11,20,11,21],[11,26,11,27],[11,24,14,24],[11,25,14,25],[11,28,11,29],[12,26,12,27],[12,28,12,29],[13,26,13,27],[13,28,13,29],[14,26,14,27],[14,28,14,29],[15,15,15,29],[1,0,2,0],[1,1,2,3],[1,9,1,13],[29,0,29,4],[26,0,26,4],[27,0,27,4],[27,15,27,17],[28,0,28,4],[29,15,29,17],[22,15,22,17],[19,15,21,17],[19,18,21,21],[22,18,22,21],[16,15,18,17],[16,18,18,21]]}
["SAINT HERBLAIN",null,null,null,null,null,null,null,null,null,null,null,null,null,null,"Saison 2023-2024"]
[null,"Joueur(es) participant à la rencontre",null,null,null,null,null,null,null,"Saisir votre liste complète en MAJUSCULES ",null,null,null,null,null,null,null,null,null,null,null,null,"Carte Verte","Carte Jaune","Carte Rose","Carte Bleue","5,0 Val",null,"Non Sélectionnables en EDF (hors Fidet)"]
[null,null,null,null,null,null,null,null,null,"Joueurs(es) qualifié(es) saison 2023 -2024",null,null,null,null,null,null,null,null,"Avec une date de validité"]
[]
["Statuts","Classif.","          Noms      /    Prénoms",null,"Numéros","ET","VALID","",null,"Statuts","Classif.","          Noms      /    Prénoms",null,"Numéros"]
[null,null,null,null,null,{"$f":"IF(A6=\"ET\",1,\"\")","v":""},{"$f":"IF(B6=5,1,\"\")","v":""},"",null,null,null,null,null,4,null,"Elite Nationale Bastide Médical",null,null,14.5,null,"Maxi 17,5 pts",null,"+  1 ","+  2","+  1,5",null,"1 sur la feuille",null,"Pas de limite"]
[null,null,null,null,null,{"$f":"IF(A7=\"ET\",1,\"\")","v":""},{"$f":"IF(B7=5,1,\"\")","v":""},null,null,"F",1,"MARCHAND","J",5,null,null,null,null,null,null,"si cartes de couleurs",null,null,null,null,null,"et terrain"]
[null,null,null,null,null,{"$f":"IF(A8=\"ET\",1,\"\")","v":""},{"$f":"IF(B8=5,1,\"\")","v":""},"",null,"F",4.5,"GIBERT","L",6,null," Nationale 1",null,null,14.5,null,"Maxi 17,5 pts",null,"+  1 ,5","+  2,5","+  1,5",null,"1 sur la feuille",null,"4  Maxi / terrain     "]
[null,null,null,null,null,"","",null,null,"N",4.5,"JUSSO","J",7,null,null,null,null,null,null,"si cartes de couleurs",null,null,null,null,null,"et terrain",null," (5 sur la feuille)"]
[null,null,null,null,null,"","","",null,"N",1,"PASANAU","JF",8,null," Nationale 2",null,null,15,null,"Maxi 19 pts",null,"+  1,5","+  2,5","+  1,5","+  0,5","2 sur la feuille",null,"4  Maxi / terrain     "]
[null,null,null,null,null,"","","",null,"N",1,"GIBERT","L",9,null,null,null,null,null,null,"si cartes de couleurs",null,null,null,null,null,"2 sur le terrain",null," (5 sur la feuille)"]
[null,null,null,null,null,"","","",null,"F",4.5,"DAVID","E",10,null," Nationale 3",null,null,15.5,null,null,null,"+  1,5","+  2,5","+  1,5","+  0,5"]
[null,null,null,null,null,"","","",null,"N",4,"ROUAT","M",11,null,null,null,null,"Si 16pts début match-handicap de 10pts",null,"Maxi 19 pts",null,null,null,null,null,"2 sur la feuille",null,"4 Maxi / terrain"]
[null,null,null,null,null,"","","",null,"N",4.5,"LE  MEUR","D",12,null,null,null,null,null,null,"si cartes de couleurs",null,null,null,null,null,"2 sur le terrain",null," (5 sur la feuille)"]
[null,null,null,null,null,"","","",null,"N",5,"CAROFF","D",13]
[null,null,null,null,null,"","","",null,"N",3,"ROBIN","B",14,null,"Inscrire dans la colonne de gauche les \"Statuts\" des joueurs de l'équipe"]
[null,null,null,null,null,"","","",null,"ET",2,"MBAYE","J",15,null,"J",null,null,"Pour les cartes Vertes",null,null,null,"Jeune joueur (U19 en Elite Nationale Bastide Médical)"]
[null,null,null,null,null,"","","",null,null,null,null,null,null,null,null,null,null,null,null,null,null,"Joueur débutant, sélectionnable en Equipe de France"]
[null,null,null,null,null,"","","",null,null,null,null,null,null,null,null,null,null,null,null,null,null,"seulement (attention à la date de validité juqu'à 22 ans révolu)"]
[null,null,null,null,null,"","",null,null,null,null,null,null,null,null,"JF",null,null,"Pour les cartes Jaunes",null,null,null,"Jeune joueuse (U19 en Elite Nationale Bastide Médical)"]
[null,null,null,null,null,"","","",null,null,null,null,null,null,null,null,null,null,null,null,null,null,"Joueuse débutante, sélectionnable en Equipe de France"]
[null,null,null,null,null,"","",null,null,null,null,null,null,null,null,null,null,null,null,null,null,null,"seulement (attention à la date de validité juqu' à 22 ans révolu)"]
[null,null,null,null,null,"","",null,null,null,null,null,null,null,null,"F ou FET",null,null,"Pour les cartes roses",null,null,null,"Pour les femmes ou femmes étrangères <5pts  (Bonus 1,5 pts)"]
[null,null,null,null,null,"","",null,null,null,null,null,null,null,null,"En Nationale 2 et 3 uniquement (joueuses et joueurs de plus de 55 ans)"]
[null,null,null,null,null,"","",null,null,null,null,null,null,null,null,"S",null,null,"Pour les hommes séniors",null,null,null," Français ou Etrangers (Bonus de 0,5pt)"]
[null,null,null,null,null,"","",null,null,null,null,null,null,null,null,"FS",null,null,"   Pour les femmes seniors",null,null,null," (Bonus 2pts)      "]
[" Joueurs-joueuses valides de l'équipe (5 points)",null,null,null,null,"","",null,null,null,null,null,null,null,null,"JS",null,null," Pour les jeunes hommes séniors",null,null,null," Débutants  (Bonus 2pts)  validité (<3pts 2ans)       ( > 3pts 1 an)"]
[{"$f":"IF(G31=0,\"\",IF(G31>2,\"Trop de valides sur le terrain\",\"OK\"))","v":""},null,null,null,null,"","",null,null,null,null,null,null,null,null,"JFS",null,null," Pour les jeunes femmes séniors",null,null,null," Débutantes  (Bonus 3pts)  validité (<3pts 2ans)     ( > 3pts 1 an)"]
["Joueurs étrangers ",null,null,null,null,"","",null,null,null,null,null,null,null,null,"Autres possibilités (sans Bonus)"]
[{"$f":"IF(F31=0,\"\",IF(F31>5,\"Trop de joueurs étrangers sur la feuille\",\"OK\"))","v":""},null,null,null,null,"","",null,null,null,null,null,null,null,null,"ET",null,null,"Pour un joueur étranger"]
[null,null,null,null,null,{"$f":"SUM(F6:F28)","v":0},{"$f":"SUM(G6:G28)","v":0},null,null,null,null,null,null,null,null,"FID",null,null,"Pour un joueur fidèle"]
[null,null,null,null,null,null,null,null,null,null,null,null,null,null,null,"N",null,null,"Pour tous joueurs sans symbole sur la carte de classification"]

{"sheet":"BERCK","index":44,"n_rows":32,"n_cols":29,"rows_kept":32,"cut":false,"hidden":false,"merged":[[5,28,6,29],[7,28,7,29],[8,28,8,29],[9,25,10,25],[11,18,11,19],[9,28,9,29],[10,28,10,29],[5,26,5,27],[9,24,10,24],[9,20,9,21],[10,20,10,21],[5,15,6,17],[5,18,6,19],[5,22,6,22],[5,23,6,23],[5,24,6,24],[6,20,6,21],[5,20,5,21],[1,26,3,27],[1,28,3,29],[1,22,3,22],[1,23,3,23],[1,24,3,24],[1,25,3,25],[31,15,31,17],[24,15,24,17],[25,15,25,17],[26,15,26,17],[28,15,28,29],[30,15,30,17],[27,15,27,17],[29,15,29,17],[22,18,22,21],[23,15,23,29],[16,15,18,17],[16,18,18,21],[22,15,22,17],[14,20,14,21],[14,26,14,27],[14,28,14,29],[15,15,15,29],[19,15,21,17],[19,18,21,21],[11,15,14,17],[11,28,11,29],[12,20,12,21],[12,26,12,27],[12,28,12,29],[12,18,14,19],[11,22,14,22],[11,23,14,23],[11,24,14,24],[11,25,14,25],[13,20,13,21],[13,26,13,27],[13,28,13,29],[8,20,8,21],[9,15,10,17],[9,18,10,19],[9,22,10,22],[9,23,10,23],[1,0,2,0],[1,1,2,3],[1,9,1,13],[29,0,29,4],[26,0,26,4],[27,0,27,4],[28,0,28,4],[2,9,2,13],[4,40,6,41],[4,42,6,43],[0,15,0,29],[11,20,11,21],[6,26,6,27],[8,26,8,27],[9,26,9,27],[10,26,10,27],[11,26,11,27],[7,26,7,27],[7,15,8,17],[7,18,8,19],[7,22,8,22],[7,23,8,23],[7,24,8,24],[7,20,7,21]]}
["BERCK",null,null,null,null,null,null,null,null,null,null,null,null,null,null,"Saison 2023-2024"]
[null,"Joueur(es) participant à la rencontre",null,null,null,null,null,null,null,"Saisir votre liste complète en MAJUSCULES ",null,null,null,null,null,null,null,null,null,null,null,null,"Carte Verte","Carte Jaune","Carte Rose","Carte Bleue","5,0 Val",null,"Non Sélectionnables en EDF (hors Fidet)"]
[null,null,null,null,null,null,null,null,null,"Joueurs(es) qualifié(es) saison 2023 -2024",null,null,null,null,null,null,null,null,"Avec une date de validité"]
[]
["Statuts","Classif.","          Noms      /    Prénoms",null,"Numéros","ET","VALIDE",null,null,"Statuts","Classif.","          Noms      /    Prénoms",null,"Numéros"]
[null,null,null,null,null,{"$f":"IF(A6=\"ET\",1,\"\")","v":""},{"$f":"IF(B6=5,1,\"\")","v":""},null,null,"N",2.5,"JOCALAZ","A",4,null,"Elite Nationale Bastide Médical",null,null,14.5,null,"Maxi 17,5 pts",null,"+  1 ","+  2","+  1,5",null,"1 sur la feuille",null,"Pas de limite"]
[null,null,null,null,null,{"$f":"IF(A7=\"ET\",1,\"\")","v":""},{"$f":"IF(B7=5,1,\"\")","v":""},null,null,"N",2.5,"LARRIEU","Q",5,null,null,null,null,null,null,"si cartes de couleurs",null,null,null,null,null,"et terrain"]
[null,null,null,null,null,{"$f":"IF(A8=\"ET\",1,\"\")","v":""},{"$f":"IF(B8=5,1,\"\")","v":""},null,null,"N",1,"DANIEL","A",6,null," Nationale 1",null,null,14.5,null,"Maxi 17,5 pts",null,"+  1 ,5","+  2,5","+  1,5",null,"1 sur la feuille",null,"4  Maxi / terrain     "]
[null,null,null,null,null,"","",null,null,null,null,null,null,7,null,null,null,null,null,null,"si cartes de couleurs",null,null,null,null,null,"et terrain",null," (5 sur la feuille)"]
[null,null,null,null,null,"","",null,null,null,null,null,null,8,null," Nationale 2",null,null,15,null,"Maxi 19 pts",null,"+  1,5","+  2,5","+  1,5","+  0,5","2 sur la feuille",null,"4  Maxi / terrain     "]
[null,null,null,null,null,"","",null,null,"N",4.5,"BENAULT","E",9,null,null,null,null,null,null,"si cartes de couleurs",null,null,null,null,null,"2 sur le terrain",null," (5 sur la feuille)"]
[null,null,null,null,null,"","",null,null,"N",5,"JOLY","B",10,null," Nationale 3",null,null,15.5,null,null,null,"+  1,5","+  2,5","+  1,5","+  0,5"]
[null,null,null,null,null,"","",null,null,"N",4,"DA COSTA","G",11,null,null,null,null,"Si 16pts début match-handicap de 10pts",null,"Maxi 19 pts",null,null,null,null,null,"2 sur la feuille",null,"4 Maxi / terrain"]
[null,null,null,null,null,"","",null,null,"N",4.5,"PLANCKE","R",12,null,null,null,null,null,null,"si cartes de couleurs",null,null,null,null,null,"2 sur le terrain",null," (5 sur la feuille)"]
[null,null,null,null,null,"","",null,null,"N",2,"HECQUET","H",13]
[null,null,null,null,null,"","",null,null,null,null,null,null,14,null,"Inscrire dans la colonne de gauche les \"Statuts\" des joueurs de l'équipe"]
[null,null,null,null,null,"","","",null,"F",3,"MAURIZOT","V",15,null,"J",null,null,"Pour les cartes Vertes",null,null,null,"Jeune joueur (U19 en Elite Nationale Bastide Médical)"]
[null,null,null,null,null,"","","",null,null,null,null,null,16,null,null,null,null,null,null,null,null,"Joueur débutant, sélectionnable en Equipe de France"]
[null,null,null,null,null,"","","",null,null,null,null,null,17,null,null,null,null,null,null,null,null,"seulement (attention à la date de validité juqu'à 22 ans révolu)"]
[null,null,null,null,null,"","",null,null,null,null,null,null,18,null,"JF",null,null,"Pour les cartes Jaunes",null,null,null,"Jeune joueuse (U19 en Elite Nationale Bastide Médical)"]
[null,null,null,null,null,"","","",null,null,null,null,null,19,null,null,null,null,null,null,null,null,"Joueuse débutante, sélectionnable en Equipe de France"]
[null,null,null,null,null,"","",null,null,null,null,null,null,20,null,null,null,null,null,null,null,null,"seulement (attention à la date de validité juqu' à 22 ans révolu)"]
[null,null,null,null,null,"","",null,null,null,null,null,null,null,null,"F ou FET",null,null,"Pour les cartes roses",null,null,null,"Pour les femmes ou femmes étrangères <5pts  (Bonus 1,5 pts)"]
[null,null,null,null,null,"","",null,null,null,null,null,null,null,null,"En Nationale 2 et 3 uniquement (joueuses et joueurs de plus de 55 ans)"]
[null,null,null,null,null,"","",null,null,null,null,null,null,null,null,"S",null,null,"Pour les hommes séniors",null,null,null," Français ou Etrangers (Bonus de 0,5pt)"]
[null,null,null,null,null,null,null,null,null,null,null,null,null,null,null,"FS",null,null,"   Pour les femmes seniors",null,null,null," (Bonus 2pts)      "]
[" Joueurs-joueuses valides de l'équipe (5 points)",null,null,null,null,null,null,null,null,null,null,null,null,null,null,"JS",null,null," Pour les jeunes hommes séniors",null,null,null," Débutants  (Bonus 2pts)  validité (<3pts 2ans)       ( > 3pts 1 an)"]
[{"$f":"IF(G31=0,\"\",IF(G31>2,\"Trop de valides sur le terrain\",\"OK\"))","v":""},null,null,null,null,null,null,null,null,null,null,null,null,null,null,"JFS",null,null," Pour les jeunes femmes séniors",null,null,null," Débutantes  (Bonus 3pts)  validité (<3pts 2ans)     ( > 3pts 1 an)"]
["Joueurs étrangers ",null,null,null,null,null,null,null,null,null,null,null,null,null,null,"Autres possibilités (sans Bonus)"]
[{"$f":"IF(F31=0,\"\",IF(F31>5,\"Trop de joueurs étrangers sur la feuille\",\"OK\"))","v":""},null,null,null,null,null,null,null,null,null,null,null,null,null,null,"ET",null,null,"Pour un joueur étranger"]
[null,null,null,null,null,{"$f":"SUM(F6:F28)","v":0},{"$f":"SUM(G6:G30)","v":0},null,null,null,null,null,null,null,null,"FID",null,null,"Pour un joueur fidèle"]
[null,null,null,null,null,null,null,null,null,null,null,null,null,null,null,"N",null,null,"Pour tous joueurs sans symbole sur la carte de classification"]

{"sheet":"CAPSAAA 2","index":45,"n_rows":32,"n_cols":29,"rows_kept":32,"cut":false,"hidden":false,"merged":[[30,15,30,17],[31,15,31,17],[0,15,0,29],[1,22,3,22],[1,23,3,23],[1,24,3,24],[1,25,3,25],[1,26,3,27],[1,28,3,29],[5,15,6,17],[5,18,6,19],[5,22,6,22],[5,23,6,23],[5,24,6,24],[5,28,6,29],[10,28,10,29],[12,26,12,27],[12,28,12,29],[10,26,10,27],[11,20,11,21],[11,26,11,27],[9,25,10,25],[11,22,14,22],[11,23,14,23],[11,24,14,24],[11,25,14,25],[13,26,13,27],[13,28,13,29],[9,28,9,29],[14,28,14,29],[9,26,9,27],[9,22,10,22],[1,0,2,0],[1,1,2,3],[1,9,1,13],[28,0,28,4],[7,15,8,17],[15,15,15,29],[19,15,21,17],[19,18,21,21],[22,18,22,21],[23,15,23,29],[8,28,8,29],[11,15,14,17],[11,18,11,19],[12,18,14,19],[14,26,14,27],[7,28,7,29],[9,23,10,23],[9,24,10,24],[29,0,29,4],[22,15,22,17],[26,0,26,4],[27,0,27,4],[27,15,27,17],[29,15,29,17],[24,15,24,17],[25,15,25,17],[26,15,26,17],[28,15,28,29],[11,28,11,29],[12,20,12,21],[16,15,18,17],[16,18,18,21],[2,9,2,13],[5,26,5,27],[5,20,5,21],[7,18,8,19],[7,22,8,22],[7,23,8,23],[7,24,8,24],[8,20,8,21],[8,26,8,27],[7,26,7,27],[6,20,6,21],[6,26,6,27],[7,20,7,21],[9,15,10,17],[10,20,10,21],[9,18,10,19],[13,20,13,21],[14,20,14,21],[9,20,9,21]]}
["CAPSAAA 2",null,null,null,null,null,null,null,null,null,null,null,null,null,null,"Saison 2023-2024"]
[null,"Joueur(es) participant à la rencontre",null,null,null,null,null,null,null,"Saisir votre liste complète en MAJUSCULES ",null,null,null,null,null,null,null,null,null,null,null,null,"Carte Verte","Carte Jaune","Carte Rose","Carte Bleue","5,0 Val",null,"Non Sélectionnables en EDF (hors Fidet)"]
[null,null,null,null,null,null,null,null,null,"Joueurs(es) qualifié(es) saison 2023 -2024",null,null,null,null,null,null,null,null,"Avec une date de validité"]
[]
["Statuts","Classif.","          Noms      /    Prénoms",null,"Numéros","ET","VALIDE",null,null,"Statuts","Classif.","          Noms      /    Prénoms",null,"Numéros"]
[null,null,null,null,null,{"$f":"IF(A6=\"ET\",1,\"\")","v":""},{"$f":"IF(B6=5,1,\"\")","v":""},null,null,"J",1,"JACOTTIN","M",0,null,"Elite Nationale Bastide Médical",null,null,14.5,null,"Maxi 17,5 pts",null,"+  1 ","+  2","+  1,5",null,"1 sur la feuille",null,"Pas de limite"]
[null,null,null,null,null,{"$f":"IF(A7=\"ET\",1,\"\")","v":""},{"$f":"IF(B7=5,1,\"\")","v":""},null,null,"N",2.5,"HADDOU","S",2,null,null,null,null,null,null,"si cartes de couleurs",null,null,null,null,null,"et terrain"]
[null,null,null,null,null,{"$f":"IF(A8=\"ET\",1,\"\")","v":""},{"$f":"IF(B8=5,1,\"\")","v":""},null,null,"N",3.5,"VIGNEAU","C",4,null," Nationale 1",null,null,14.5,null,"Maxi 17,5 pts",null,"+  1 ,5","+  2,5","+  1,5",null,"1 sur la feuille",null,"4  Maxi / terrain     "]
[null,null,null,null,null,"","",null,null,"F",1,"PORET","A",7,null,null,null,null,null,null,"si cartes de couleurs",null,null,null,null,null,"et terrain",null," (5 sur la feuille)"]
[null,null,null,null,null,"","",null,null,"J",2.5,"FREVOST","N",8,null," Nationale 2",null,null,15,null,"Maxi 19 pts",null,"+  1,5","+  2,5","+  1,5","+  0,5","2 sur la feuille",null,"4  Maxi / terrain     "]
[null,null,null,null,null,"","",null,null,null,null,null,null,9,null,null,null,null,null,null,"si cartes de couleurs",null,null,null,null,null,"2 sur le terrain",null," (5 sur la feuille)"]
[null,null,null,null,null,"","",null,null,null,null,null,null,10,null," Nationale 3",null,null,15.5,null,null,null,"+  1,5","+  2,5","+  1,5","+  0,5"]
[null,null,null,null,null,"","",null,null,"J",3.5,"CHOUASNARD","V",11,null,null,null,null,"Si 16pts début match-handicap de 10pts",null,"Maxi 19 pts",null,null,null,null,null,"2 sur la feuille",null,"4 Maxi / terrain"]
[null,null,null,null,null,"","",null,null,null,null,null,null,12,null,null,null,null,null,null,"si cartes de couleurs",null,null,null,null,null,"2 sur le terrain",null," (5 sur la feuille)"]
[null,null,null,null,null,"","",null,null,"N",4,"JALABERT","F",13]
[null,null,null,null,null,"","",null,null,"N",2.5,"YOYOTTE","M",14,null,"Inscrire dans la colonne de gauche les \"Statuts\" des joueurs de l'équipe"]
[null,null,null,null,null,"","","",null,null,null,null,null,15,null,"J",null,null,"Pour les cartes Vertes",null,null,null,"Jeune joueur (U19 en Elite Nationale Bastide Médical)"]
[null,null,null,null,null,"","","",null,null,null,null,null,16,null,null,null,null,null,null,null,null,"Joueur débutant, sélectionnable en Equipe de France"]
[null,null,null,null,null,"","","",null,"N",5,"JULVE","M",17,null,null,null,null,null,null,null,null,"seulement (attention à la date de validité juqu'à 22 ans révolu)"]
[null,null,null,null,null,"","",null,null,null,null,null,null,18,null,"JF",null,null,"Pour les cartes Jaunes",null,null,null,"Jeune joueuse (U19 en Elite Nationale Bastide Médical)"]
[null,null,null,null,null,"","","",null,"ET",2,"APOLLON","JP",50,null,null,null,null,null,null,null,null,"Joueuse débutante, sélectionnable en Equipe de France"]
[null,null,null,null,null,"","",null,null,"N",3,"MIMOUNI","K",75,null,null,null,null,null,null,null,null,"seulement (attention à la date de validité juqu' à 22 ans révolu)"]
[null,null,null,null,null,"","",null,null,"F",1,"D'ACREMONT","A",98,null,"F ou FET",null,null,"Pour les cartes roses",null,null,null,"Pour les femmes ou femmes étrangères <5pts  (Bonus 1,5 pts)"]
[null,null,null,null,null,"","",null,null,null,null,null,null,null,null,"En Nationale 2 et 3 uniquement (joueuses et joueurs de plus de 55 ans)"]
[null,null,null,null,null,"","",null,null,null,null,null,null,null,null,"S",null,null,"Pour les hommes séniors",null,null,null," Français ou Etrangers (Bonus de 0,5pt)"]
[null,null,null,null,null,null,null,null,null,null,null,null,null,null,null,"FS",null,null,"   Pour les femmes seniors",null,null,null," (Bonus 2pts)      "]
[" Joueurs-joueuses valides de l'équipe (5 points)",null,null,null,null,null,null,null,null,null,null,null,null,null,null,"JS",null,null," Pour les jeunes hommes séniors",null,null,null," Débutants  (Bonus 2pts)  validité (<3pts 2ans)       ( > 3pts 1 an)"]
[{"$f":"IF(G31=0,\"\",IF(G31>2,\"Trop de valides sur le terrain\",\"OK\"))","v":""},null,null,null,null,null,null,null,null,null,null,null,null,null,null,"JFS",null,null," Pour les jeunes femmes séniors",null,null,null," Débutantes  (Bonus 3pts)  validité (<3pts 2ans)     ( > 3pts 1 an)"]
["Joueurs étrangers ",null,null,null,null,null,null,null,null,null,null,null,null,null,null,"Autres possibilités (sans Bonus)"]
[{"$f":"IF(F31=0,\"\",IF(F31>5,\"Trop de joueurs étrangers sur la feuille\",\"OK\"))","v":""},null,null,null,null,null,null,null,null,null,null,null,null,null,null,"ET",null,null,"Pour un joueur étranger"]
[null,null,null,null,null,{"$f":"SUM(F6:F28)","v":0},{"$f":"SUM(G6:G30)","v":0},null,null,null,null,null,null,null,null,"FID",null,null,"Pour un joueur fidèle"]
[null,null,null,null,null,null,null,null,null,null,null,null,null,null,null,"N",null,null,"Pour tous joueurs sans symbole sur la carte de classification"]

{"sheet":"SUD OISE SPORTS ET HANDICAPS","index":46,"n_rows":32,"n_cols":29,"rows_kept":32,"cut":false,"hidden":false,"merged":[[30,15,30,17],[31,15,31,17],[0,15,0,29],[1,22,3,22],[1,23,3,23],[1,24,3,24],[1,25,3,25],[1,26,3,27],[1,28,3,29],[5,15,6,17],[5,18,6,19],[5,22,6,22],[5,23,6,23],[5,24,6,24],[5,28,6,29],[10,28,10,29],[12,26,12,27],[12,28,12,29],[10,26,10,27],[11,20,11,21],[11,26,11,27],[9,25,10,25],[11,22,14,22],[11,23,14,23],[11,24,14,24],[11,25,14,25],[13,26,13,27],[13,28,13,29],[9,28,9,29],[14,28,14,29],[9,26,9,27],[9,22,10,22],[1,0,2,0],[1,1,2,3],[1,9,1,13],[28,0,28,4],[7,15,8,17],[15,15,15,29],[19,15,21,17],[19,18,21,21],[22,18,22,21],[23,15,23,29],[8,28,8,29],[11,15,14,17],[11,18,11,19],[12,18,14,19],[14,26,14,27],[7,28,7,29],[9,23,10,23],[9,24,10,24],[29,0,29,4],[22,15,22,17],[26,0,26,4],[27,0,27,4],[27,15,27,17],[29,15,29,17],[24,15,24,17],[25,15,25,17],[26,15,26,17],[28,15,28,29],[11,28,11,29],[12,20,12,21],[16,15,18,17],[16,18,18,21],[2,9,2,13],[5,26,5,27],[5,20,5,21],[7,18,8,19],[7,22,8,22],[7,23,8,23],[7,24,8,24],[8,20,8,21],[8,26,8,27],[7,26,7,27],[6,20,6,21],[6,26,6,27],[7,20,7,21],[9,15,10,17],[10,20,10,21],[9,18,10,19],[13,20,13,21],[14,20,14,21],[9,20,9,21]]}
["SUD OISE SPORTS ET HANDICAPS",null,null,null,null,null,null,null,null,null,null,null,null,null,null,"Saison 2023-2024"]
[null,"Joueur(es) participant à la rencontre",null,null,null,null,null,null,null,"Saisir votre liste complète en MAJUSCULES ",null,null,null,null,null,null,null,null,null,null,null,null,"Carte Verte","Carte Jaune","Carte Rose","Carte Bleue","5,0 Val",null,"Non Sélectionnables en EDF (hors Fidet)"]
[null,null,null,null,null,null,null,null,null,"Joueurs(es) qualifié(es) saison 2023 -2024",null,null,null,null,null,null,null,null,"Avec une date de validité"]
[]
["Statuts","Classif.","          Noms      /    Prénoms",null,"Numéros","ET","VALIDE",null,null,"Statuts","Classif.","          Noms      /    Prénoms",null,"Numéros"]
[null,null,null,null,null,{"$f":"IF(A6=\"ET\",1,\"\")","v":""},{"$f":"IF(B6=5,1,\"\")","v":""},null,null,"F",2,"TRAGER","S",4,null,"Elite Nationale Bastide Médical",null,null,14.5,null,"Maxi 17,5 pts",null,"+  1 ","+  2","+  1,5",null,"1 sur la feuille",null,"Pas de limite"]
[null,null,null,null,null,{"$f":"IF(A7=\"ET\",1,\"\")","v":""},{"$f":"IF(B7=5,1,\"\")","v":""},null,null,"N",2.5,"LEMAIRE","B",5,null,null,null,null,null,null,"si cartes de couleurs",null,null,null,null,null,"et terrain"]
[null,null,null,null,null,{"$f":"IF(A8=\"ET\",1,\"\")","v":""},{"$f":"IF(B8=5,1,\"\")","v":""},null,null,"N",2,"JOLY","C",6,null," Nationale 1",null,null,14.5,null,"Maxi 17,5pts",null,"+  1 ,5","+  2,5","+  1,5",null,"1 sur la feuille",null,"4  Maxi / terrain     "]
[null,null,null,null,null,"","",null,null,"N",2.5,"DE BARROS","P",7,null,null,null,null,null,null,"si cartes de couleurs",null,null,null,null,null,"et terrain",null," (5 sur la feuille)"]
[null,null,null,null,null,"","",null,null,null,null,null,null,8,null," Nationale 2",null,null,15,null,"Maxi 19 pts",null,"+  1,5","+  2,5","+  1,5","+  0,5","2 sur la feuille",null,"4  Maxi / terrain     "]
[null,null,null,null,null,"","",null,null,"N",5,"NOIRAULT","C",9,null,null,null,null,null,null,"si cartes de couleurs",null,null,null,null,null,"2 sur le terrain",null," (5 sur la feuille)"]
[null,null,null,null,null,"","",null,null,"N",1.5,"DELVOYE","R",10,null," Nationale 3",null,null,15.5,null,null,null,"+  1,5","+  2,5","+  1,5","+  0,5"]
[null,null,null,null,null,"","",null,null,"N ",4.5,"FOULON ","G",11,null,null,null,null,"Si 16pts début match-handicap de 10pts",null,"Maxi 19 pts",null,null,null,null,null,"2 sur la feuille",null,"4 Maxi / terrain"]
[null,null,null,null,null,"","",null,null,"N",5,"MABILLE","M",12,null,null,null,null,null,null,"si cartes de couleurs",null,null,null,null,null,"2 sur le terrain",null," (5 sur la feuille)"]
[null,null,null,null,null,"","",null,null,"N",1.5,"DESAINT","G",13]
[null,null,null,null,null,"","",null,null,null,null,null,null,14,null,"Inscrire dans la colonne de gauche les \"Statuts\" des joueurs de l'équipe"]
[null,null,null,null,null,"","","",null,null,null,null,null,15,null,"J",null,null,"Pour les cartes Vertes",null,null,null,"Jeune joueur (U19 en Elite Nationale Bastide Médical)"]
[null,null,null,null,null,"","","",null,null,null,null,null,16,null,null,null,null,null,null,null,null,"Joueur débutant, sélectionnable en Equipe de France"]
[null,null,null,null,null,"","","",null,null,null,null,null,17,null,null,null,null,null,null,null,null,"seulement (attention à la date de validité juqu'à 22 ans révolu)"]
[null,null,null,null,null,"","",null,null,null,null,null,null,18,null,"JF",null,null,"Pour les cartes Jaunes",null,null,null,"Jeune joueuse (U19 en Elite Nationale Bastide Médical)"]
[null,null,null,null,null,"","","",null,null,null,null,null,19,null,null,null,null,null,null,null,null,"Joueuse débutante, sélectionnable en Equipe de France"]
[null,null,null,null,null,"","",null,null,null,null,null,null,20,null,null,null,null,null,null,null,null,"seulement (attention à la date de validité juqu' à 22 ans révolu)"]
[null,null,null,null,null,"","",null,null,null,null,null,null,null,null,"F ou FET",null,null,"Pour les cartes roses",null,null,null,"Pour les femmes ou femmes étrangères <5pts  (Bonus 1,5 pts)"]
[null,null,null,null,null,"","",null,null,null,null,null,null,null,null,"En Nationale 2 et 3 uniquement (joueuses et joueurs de plus de 55 ans)"]
[null,null,null,null,null,"","",null,null,null,null,null,null,null,null,"S",null,null,"Pour les hommes séniors",null,null,null," Français ou Etrangers (Bonus de 0,5pt)"]
[null,null,null,null,null,null,null,null,null,null,null,null,null,null,null,"FS",null,null,"   Pour les femmes seniors",null,null,null," (Bonus 2pts)      "]
[" Joueurs-joueuses valides de l'équipe (5 points)",null,null,null,null,null,null,null,null,null,null,null,null,null,null,"JS",null,null," Pour les jeunes hommes séniors",null,null,null," Débutants  (Bonus 2pts)  validité (<3pts 2ans)       ( > 3pts 1 an)"]
[{"$f":"IF(G31=0,\"\",IF(G31>2,\"Trop de valides sur le terrain\",\"OK\"))","v":""},null,null,null,null,null,null,null,null,null,null,null,null,null,null,"JFS",null,null," Pour les jeunes femmes séniors",null,null,null," Débutantes  (Bonus 3pts)  validité (<3pts 2ans)     ( > 3pts 1 an)"]
["Joueurs étrangers ",null,null,null,null,null,null,null,null,null,null,null,null,null,null,"Autres possibilités (sans Bonus)"]
[{"$f":"IF(F31=0,\"\",IF(F31>5,\"Trop de joueurs étrangers sur la feuille\",\"OK\"))","v":""},null,null,null,null,null,null,null,null,null,null,null,null,null,null,"ET",null,null,"Pour un joueur étranger"]
[null,null,null,null,null,{"$f":"SUM(F6:F28)","v":0},{"$f":"SUM(G6:G30)","v":0},null,null,null,null,null,null,null,null,"FID",null,null,"Pour un joueur fidèle"]
[null,null,null,null,null,null,null,null,null,null,null,null,null,null,null,"N",null,null,"Pour tous joueurs sans symbole sur la carte de classification"]

{"sheet":"CERGY PONTOISE","index":47,"n_rows":32,"n_cols":29,"rows_kept":32,"cut":false,"hidden":false,"merged":[[14,26,14,27],[14,28,14,29],[11,22,14,22],[11,23,14,23],[11,24,14,24],[11,25,14,25],[5,23,6,23],[5,24,6,24],[12,18,14,19],[14,20,14,21],[5,28,6,29],[5,20,5,21],[5,26,5,27],[7,28,7,29],[8,28,8,29],[11,28,11,29],[12,20,12,21],[12,26,12,27],[12,28,12,29],[11,20,11,21],[10,26,10,27],[11,26,11,27],[30,15,30,17],[31,15,31,17],[5,15,6,17],[5,18,6,19],[5,22,6,22],[19,15,21,17],[19,18,21,21],[22,18,22,21],[23,15,23,29],[24,15,24,17],[11,15,14,17],[11,18,11,19],[16,15,18,17],[15,15,15,29],[9,28,9,29],[10,28,10,29],[1,0,2,0],[1,1,2,3],[1,9,1,13],[9,15,10,17],[9,18,10,19],[7,15,8,17],[2,9,2,13],[29,0,29,4],[22,15,22,17],[26,0,26,4],[27,0,27,4],[27,15,27,17],[29,15,29,17],[28,0,28,4],[25,15,25,17],[26,15,26,17],[28,15,28,29],[16,18,18,21],[13,20,13,21],[13,26,13,27],[13,28,13,29],[6,26,6,27],[7,26,7,27],[6,20,6,21],[7,20,7,21],[7,18,8,19],[7,22,8,22],[7,24,8,24],[8,20,8,21],[9,20,9,21],[8,26,8,27],[9,26,9,27],[9,22,10,22],[9,23,10,23],[9,24,10,24],[10,20,10,21],[9,25,10,25],[7,23,8,23],[0,15,0,29],[1,22,3,22],[1,23,3,23],[1,24,3,24],[1,25,3,25],[1,26,3,27],[1,28,3,29]]}
["CERGY PONTOISE",null,null,null,null,null,null,null,null,null,null,null,null,null,null,"Saison 2023-2024"]
[null,"Joueur(es) participant à la rencontre",null,null,null,null,null,null,null,"Saisir votre liste complète en MAJUSCULES ",null,null,null,null,null,null,null,null,null,null,null,null,"Carte Verte","Carte Jaune","Carte Rose","Carte Bleue","5,0 Val",null,"Non Sélectionnables en EDF (hors Fidet)"]
[null,null,null,null,null,null,null,null,null,"Joueurs(es) qualifié(es) saison 2023 -2024",null,null,null,null,null,null,null,null,"Avec une date de validité"]
[]
["Statuts","Classif.","          Noms      /    Prénoms",null,"Numéros","ET","VALID","",null,"Statuts","Classif.","          Noms      /    Prénoms",null,"Numéros"]
[null,null,null,null,null,{"$f":"IF(A6=\"ET\",1,\"\")","v":""},{"$f":"IF(B6=5,1,\"\")","v":""},"",null,null,null,null,null,1,null,"Elite Nationale Bastide Médical",null,null,14.5,null,"Maxi 17,5 pts",null,"+  1 ","+  2","+  1,5",null,"1 sur la feuille",null,"Pas de limite"]
[null,null,null,null,null,{"$f":"IF(A7=\"ET\",1,\"\")","v":""},{"$f":"IF(B7=5,1,\"\")","v":""},null,null,null,null,null,null,3,null,null,null,null,null,null,"si cartes de couleurs",null,null,null,null,null,"et terrain"]
[null,null,null,null,null,{"$f":"IF(A8=\"ET\",1,\"\")","v":""},"","",null,null,null,null,null,5,null," Nationale 1",null,null,14.5,null,"Maxi 17,5 pts",null,"+  1 ,5","+  2,5","+  1,5",null,"1 sur la feuille",null,"4  Maxi / terrain     "]
[null,null,null,null,null,"","",null,null,null,null,null,null,6,null,null,null,null,null,null,"si cartes de couleurs",null,null,null,null,null,"et terrain",null," (5 sur la feuille)"]
[null,null,null,null,null,"","","",null,null,null,null,null,7,null," Nationale 2",null,null,15,null,"Maxi 19 pts",null,"+  1,5","+  2,5","+  1,5","+  0,5","2 sur la feuille",null,"4  Maxi / terrain     "]
[null,null,null,null,null,"","","",null,null,null,null,null,8,null,null,null,null,null,null,"si cartes de couleurs",null,null,null,null,null,"2 sur le terrain",null," (5 sur la feuille)"]
[null,null,null,null,null,"","","",null,null,null,null,null,10,null," Nationale 3",null,null,15.5,null,null,null,"+  1,5","+  2,5","+  1,5","+  0,5"]
[null,null,null,null,null,"","","",null,null,null,null,null,11,null,null,null,null,"Si 16pts début match-handicap de 10pts",null,"Maxi 19 pts",null,null,null,null,null,"2 sur la feuille",null,"4 Maxi / terrain"]
[null,null,null,null,null,"","","",null,null,null,null,null,12,null,null,null,null,null,null,"si cartes de couleurs",null,null,null,null,null,"2 sur le terrain",null," (5 sur la feuille)"]
[null,null,null,null,null,"","","",null,null,null,null,null,13]
[null,null,null,null,null,"","","",null,null,null,null,null,14,null,"Inscrire dans la colonne de gauche les \"Statuts\" des joueurs de l'équipe"]
[null,null,null,null,null,"","","",null,null,null,null,null,15,null,"J",null,null,"Pour les cartes Vertes",null,null,null,"Jeune joueur (U19 en Elite Nationale Bastide Médical)"]
[null,null,null,null,null,"","","",null,null,null,null,null,16,null,null,null,null,null,null,null,null,"Joueur débutant, sélectionnable en Equipe de France"]
[null,null,null,null,null,"","","",null,null,null,null,null,17,null,null,null,null,null,null,null,null,"seulement (attention à la date de validité juqu'à 22 ans révolu)"]
[null,null,null,null,null,"","",null,null,null,null,null,null,18,null,"JF",null,null,"Pour les cartes Jaunes",null,null,null,"Jeune joueuse (U19 en Elite Nationale Bastide Médical)"]
[null,null,null,null,null,"","","",null,null,null,null,null,19,null,null,null,null,null,null,null,null,"Joueuse débutante, sélectionnable en Equipe de France"]
[null,null,null,null,null,"","",null,null,null,null,null,null,20,null,null,null,null,null,null,null,null,"seulement (attention à la date de validité juqu' à 22 ans révolu)"]
[null,null,null,null,null,"","",null,null,null,null,null,null,null,null,"F ou FET",null,null,"Pour les cartes roses",null,null,null,"Pour les femmes ou femmes étrangères <5pts  (Bonus 1,5 pts)"]
[null,null,null,null,null,"","",null,null,null,null,null,null,null,null,"En Nationale 2 et 3 uniquement (joueuses et joueurs de plus de 55 ans)"]
[null,null,null,null,null,"","",null,null,null,null,null,null,null,null,"S",null,null,"Pour les hommes séniors",null,null,null," Français ou Etrangers (Bonus de 0,5pt)"]
[null,null,null,null,null,null,null,null,null,null,null,null,null,null,null,"FS",null,null,"   Pour les femmes seniors",null,null,null," (Bonus 2pts)      "]
[" Joueurs-joueuses valides de l'équipe (5 points)",null,null,null,null,null,null,null,null,null,null,null,null,null,null,"JS",null,null," Pour les jeunes hommes séniors",null,null,null," Débutants  (Bonus 2pts)  validité (<3pts 2ans)       ( > 3pts 1 an)"]
[{"$f":"IF($G$31=0,\"\",IF($G$31>2,\"Trop de valides sur le terrain\",\"OK\"))","v":""},null,null,null,null,null,null,null,null,null,null,null,null,null,null,"JFS",null,null," Pour les jeunes femmes séniors",null,null,null," Débutantes  (Bonus 3pts)  validité (<3pts 2ans)     ( > 3pts 1 an)"]
["Joueurs étrangers ",null,null,null,null,null,null,null,null,null,null,null,null,null,null,"Autres possibilités (sans Bonus)"]
[{"$f":"IF($F$31=0,\"\",IF($F$31>5,\"Trop de joueurs étrangers sur la feuille\",\"OK\"))","v":""},null,null,null,null,null,null,null,null,null,null,null,null,null,null,"ET",null,null,"Pour un joueur étranger"]
[null,null,null,null,null,{"$f":"SUM(F6:F25)","v":0},{"$f":"SUM(G6:G25)","v":0},null,null,null,null,null,null,null,null,"FID",null,null,"Pour un joueur fidèle"]
[null,null,null,null,null,null,null,null,null,null,null,null,null,null,null,"N",null,null,"Pour tous joueurs sans symbole sur la carte de classification"]

{"sheet":"ENT-HURRICANE-PBF","index":48,"n_rows":32,"n_cols":29,"rows_kept":32,"cut":false,"hidden":false,"merged":[[30,15,30,17],[31,15,31,17],[0,15,0,29],[1,22,3,22],[1,23,3,23],[1,24,3,24],[1,25,3,25],[1,26,3,27],[1,28,3,29],[5,15,6,17],[5,18,6,19],[5,22,6,22],[5,23,6,23],[5,24,6,24],[5,28,6,29],[10,28,10,29],[12,26,12,27],[12,28,12,29],[10,26,10,27],[11,20,11,21],[11,26,11,27],[9,25,10,25],[11,22,14,22],[11,23,14,23],[11,24,14,24],[11,25,14,25],[13,26,13,27],[13,28,13,29],[9,28,9,29],[14,28,14,29],[9,26,9,27],[9,22,10,22],[1,0,2,0],[1,1,2,3],[1,9,1,13],[28,0,28,4],[7,15,8,17],[15,15,15,29],[19,15,21,17],[19,18,21,21],[22,18,22,21],[23,15,23,29],[8,28,8,29],[11,15,14,17],[11,18,11,19],[12,18,14,19],[14,26,14,27],[7,28,7,29],[9,23,10,23],[9,24,10,24],[29,0,29,4],[22,15,22,17],[26,0,26,4],[27,0,27,4],[27,15,27,17],[29,15,29,17],[24,15,24,17],[25,15,25,17],[26,15,26,17],[28,15,28,29],[11,28,11,29],[12,20,12,21],[16,15,18,17],[16,18,18,21],[2,9,2,13],[5,26,5,27],[5,20,5,21],[7,18,8,19],[7,22,8,22],[7,23,8,23],[7,24,8,24],[8,20,8,21],[8,26,8,27],[7,26,7,27],[6,20,6,21],[6,26,6,27],[7,20,7,21],[9,15,10,17],[10,20,10,21],[9,18,10,19],[13,20,13,21],[14,20,14,21],[9,20,9,21]]}
["Ent HURRICANE-PBF",null,null,null,null,null,null,null,null,null,null,null,null,null,null,"Saison 2023-2024"]
[null,"Joueur(es) participant à la rencontre",null,null,null,null,null,null,null,"Saisir votre liste complète en MAJUSCULES ",null,null,null,null,null,null,null,null,null,null,null,null,"Carte Verte","Carte Jaune","Carte Rose","Carte Bleue","5,0 Val",null,"Non Sélectionnables en EDF (hors Fidet)"]
[null,null,null,null,null,null,null,null,null,"Joueurs(es) qualifié(es) saison 2023 -2024",null,null,null,null,null,null,null,null,"Avec une date de validité"]
[]
["Statuts","Classif.","          Noms      /    Prénoms",null,"Numéros","ET","VALIDE",null,null,"Statuts","Classif.","          Noms      /    Prénoms",null,"Numéros"]
[null,null,null,null,null,{"$f":"IF(A6=\"ET\",1,\"\")","v":""},{"$f":"IF(B6=5,1,\"\")","v":""},null,null,"ET",1,"BRAHMI",0,0,null,"Elite Nationale Bastide Médical",null,null,14.5,null,"Maxi 17,5 pts",null,"+  1 ","+  2","+  1,5",null,"1 sur la feuille",null,"Pas de limite"]
[null,null,null,null,null,{"$f":"IF(A7=\"ET\",1,\"\")","v":""},{"$f":"IF(B7=5,1,\"\")","v":""},null,null,"ET",2.5,"SYLLA","L",2,null,null,null,null,null,null,"si cartes de couleurs",null,null,null,null,null,"et terrain"]
[null,null,null,null,null,{"$f":"IF(A8=\"ET\",1,\"\")","v":""},{"$f":"IF(B8=5,1,\"\")","v":""},null,null,"N",2,"MBAYE","I",5,null," Nationale 1",null,null,14.5,null,"Maxi 17,5 pts",null,"+  1 ,5","+  2,5","+  1,5",null,"1 sur la feuille",null,"4  Maxi / terrain     "]
[null,null,null,null,null,"","",null,null,null,null,null,null,6,null,null,null,null,null,null,"si cartes de couleurs",null,null,null,null,null,"et terrain",null," (5 sur la feuille)"]
[null,null,null,null,null,"","",null,null,"FET",1,"SENNI","M",7,null," Nationale 2",null,null,15,null,"Maxi 19 pts",null,"+  1,5","+  2,5","+  1,5","+  0,5","2 sur la feuille",null,"4  Maxi / terrain     "]
[null,null,null,null,null,"","",null,null,null,null,null,null,8,null,null,null,null,null,null,"si cartes de couleurs",null,null,null,null,null,"2 sur le terrain",null," (5 sur la feuille)"]
[null,null,null,null,null,"","",null,null,"N",3.5,"ZARBAN","M",9,null," Nationale 3",null,null,15.5,null,null,null,"+  1,5","+  2,5","+  1,5","+  0,5"]
[null,null,null,null,null,"","",null,null,null,null,null,null,10,null,null,null,null,"Si 16pts début match-handicap de 10pts",null,"Maxi 19 pts",null,null,null,null,null,"2 sur la feuille",null,"4 Maxi / terrain"]
[null,null,null,null,null,"","",null,null,"ET",3.5,"COHAR","L",11,null,null,null,null,null,null,"si cartes de couleurs",null,null,null,null,null,"2 sur le terrain",null," (5 sur la feuille)"]
[null,null,null,null,null,"","",null,null,"J",3,"GASSANA","M",12]
[null,null,null,null,null,"","",null,null,null,null,null,null,13,null,"Inscrire dans la colonne de gauche les \"Statuts\" des joueurs de l'équipe"]
[null,null,null,null,null,"","","",null,null,null,null,null,14,null,"J",null,null,"Pour les cartes Vertes",null,null,null,"Jeune joueur (U19 en Elite Nationale Bastide Médical)"]
[null,null,null,null,null,"","","",null,"J",4,"DEMBELE","I",15,null,null,null,null,null,null,null,null,"Joueur débutant, sélectionnable en Equipe de France"]
[null,null,null,null,null,"","","",null,null,null,null,null,16,null,null,null,null,null,null,null,null,"seulement (attention à la date de validité juqu'à 22 ans révolu)"]
[null,null,null,null,null,"","",null,null,"N",4,"KEBE","M",17,null,"JF",null,null,"Pour les cartes Jaunes",null,null,null,"Jeune joueuse (U19 en Elite Nationale Bastide Médical)"]
[null,null,null,null,null,"","","",null,"J",1,"DELCOURT","L",18,null,null,null,null,null,null,null,null,"Joueuse débutante, sélectionnable en Equipe de France"]
[null,null,null,null,null,"","",null,null,"J",4,"COUVE DE MERVILLE","J",44,null,null,null,null,null,null,null,null,"seulement (attention à la date de validité juqu' à 22 ans révolu)"]
[null,null,null,null,null,"","",null,null,"ET",4,"AMER","A",null,null,"F ou FET",null,null,"Pour les cartes roses",null,null,null,"Pour les femmes ou femmes étrangères <5pts  (Bonus 1,5 pts)"]
[null,null,null,null,null,"","",null,null,"ET",3,"BAHA","L",null,null,"En Nationale 2 et 3 uniquement (joueuses et joueurs de plus de 55 ans)"]
[null,null,null,null,null,"","",null,null,null,null,null,null,null,null,"S",null,null,"Pour les hommes séniors",null,null,null," Français ou Etrangers (Bonus de 0,5pt)"]
[null,null,null,null,null,null,null,null,null,null,null,null,null,null,null,"FS",null,null,"   Pour les femmes seniors",null,null,null," (Bonus 2pts)      "]
[" Joueurs-joueuses valides de l'équipe (5 points)",null,null,null,null,null,null,null,null,null,null,null,null,null,null,"JS",null,null," Pour les jeunes hommes séniors",null,null,null," Débutants  (Bonus 2pts)  validité (<3pts 2ans)       ( > 3pts 1 an)"]
[{"$f":"IF(G31=0,\"\",IF(G31>2,\"Trop de valides sur le terrain\",\"OK\"))","v":""},null,null,null,null,null,null,null,null,null,null,null,null,null,null,"JFS",null,null," Pour les jeunes femmes séniors",null,null,null," Débutantes  (Bonus 3pts)  validité (<3pts 2ans)     ( > 3pts 1 an)"]
["Joueurs étrangers ",null,null,null,null,null,null,null,null,null,null,null,null,null,null,"Autres possibilités (sans Bonus)"]
[{"$f":"IF(F31=0,\"\",IF(F31>5,\"Trop de joueurs étrangers sur la feuille\",\"OK\"))","v":""},null,null,null,null,null,null,null,null,null,null,null,null,null,null,"ET",null,null,"Pour un joueur étranger"]
[null,null,null,null,null,{"$f":"SUM(F6:F28)","v":0},{"$f":"SUM(G6:G30)","v":0},null,null,null,null,null,null,null,null,"FID",null,null,"Pour un joueur fidèle"]
[null,null,null,null,null,null,null,null,null,null,null,null,null,null,null,"N",null,null,"Pour tous joueurs sans symbole sur la carte de classification"]

{"sheet":"LILLE 2","index":49,"n_rows":32,"n_cols":29,"rows_kept":32,"cut":false,"hidden":false,"merged":[[30,15,30,17],[31,15,31,17],[0,15,0,29],[1,22,3,22],[1,23,3,23],[1,24,3,24],[1,25,3,25],[1,26,3,27],[1,28,3,29],[5,15,6,17],[5,18,6,19],[5,22,6,22],[5,23,6,23],[5,24,6,24],[5,28,6,29],[10,28,10,29],[12,26,12,27],[12,28,12,29],[10,26,10,27],[11,20,11,21],[11,26,11,27],[9,25,10,25],[11,22,14,22],[11,23,14,23],[11,24,14,24],[11,25,14,25],[13,26,13,27],[13,28,13,29],[9,28,9,29],[14,28,14,29],[9,26,9,27],[9,22,10,22],[1,0,2,0],[1,1,2,3],[1,9,1,13],[28,0,28,4],[7,15,8,17],[15,15,15,29],[19,15,21,17],[19,18,21,21],[22,18,22,21],[23,15,23,29],[8,28,8,29],[11,15,14,17],[11,18,11,19],[12,18,14,19],[14,26,14,27],[7,28,7,29],[9,23,10,23],[9,24,10,24],[29,0,29,4],[22,15,22,17],[26,0,26,4],[27,0,27,4],[27,15,27,17],[29,15,29,17],[24,15,24,17],[25,15,25,17],[26,15,26,17],[28,15,28,29],[11,28,11,29],[12,20,12,21],[16,15,18,17],[16,18,18,21],[2,9,2,13],[5,26,5,27],[5,20,5,21],[7,18,8,19],[7,22,8,22],[7,23,8,23],[7,24,8,24],[8,20,8,21],[8,26,8,27],[7,26,7,27],[6,20,6,21],[6,26,6,27],[7,20,7,21],[9,15,10,17],[10,20,10,21],[9,18,10,19],[13,20,13,21],[14,20,14,21],[9,20,9,21]]}
["LILLE 2",null,null,null,null,null,null,null,null,null,null,null,null,null,null,"Saison 2023-2024"]
[null,"Joueur(es) participant à la rencontre",null,null,null,null,null,null,null,"Saisir votre liste complète en MAJUSCULES ",null,null,null,null,null,null,null,null,null,null,null,null,"Carte Verte","Carte Jaune","Carte Rose","Carte Bleue","5,0 Val",null,"Non Sélectionnables en EDF (hors Fidet)"]
[null,null,null,null,null,null,null,null,null,"Joueurs(es) qualifié(es) saison 2023 -2024",null,null,null,null,null,null,null,null,"Avec une date de validité"]
[]
["Statuts","Classif.","          Noms      /    Prénoms",null,"Numéros","ET","VALIDE",null,null,"Statuts","Classif.","          Noms      /    Prénoms",null,"Numéros"]
[null,null,null,null,null,{"$f":"IF(A6=\"ET\",1,\"\")","v":""},{"$f":"IF(B6=5,1,\"\")","v":""},null,null,"F",4,"FRANCOIS","K",4,null,"Elite Nationale Bastide Médical",null,null,14.5,null,"Maxi 17,5 pts",null,"+  1 ","+  2","+  1,5",null,"1 sur la feuille",null,"Pas de limite"]
[null,null,null,null,null,{"$f":"IF(A7=\"ET\",1,\"\")","v":""},{"$f":"IF(B7=5,1,\"\")","v":""},null,null,"JF",4.5,"CANNAT","J",5,null,null,null,null,null,null,"si cartes de couleurs",null,null,null,null,null,"et terrain"]
[null,null,null,null,null,{"$f":"IF(A8=\"ET\",1,\"\")","v":""},{"$f":"IF(B8=5,1,\"\")","v":""},null,null,"N",4.5,"BOULET","D",6,null," Nationale 1",null,null,14.5,null,"Maxi 17,5 pts",null,"+  1 ,5","+  2,5","+  1,5",null,"1 sur la feuille",null,"4  Maxi / terrain     "]
[null,null,null,null,null,"","",null,null,null,null,null,null,7,null,null,null,null,null,null,"si cartes de couleurs",null,null,null,null,null,"et terrain",null," (5 sur la feuille)"]
[null,null,null,null,null,"","",null,null,"J",3.5,"ELCABIRI",3.5,8,null," Nationale 2",null,null,15,null,"Maxi 19 pts",null,"+  1,5","+  2,5","+  1,5","+  0,5","2 sur la feuille",null,"4  Maxi / terrain     "]
[null,null,null,null,null,"","",null,null,null,null,null,null,9,null,null,null,null,null,null,"si cartes de couleurs",null,null,null,null,null,"2 sur le terrain",null," (5 sur la feuille)"]
[null,null,null,null,null,"","",null,null,"F",5,"LE BACQ","L",10,null," Nationale 3",null,null,15.5,null,null,null,"+  1,5","+  2,5","+  1,5","+  0,5"]
[null,null,null,null,null,"","",null,null,null,null,null,null,11,null,null,null,null,"Si 16pts début match-handicap de 10pts",null,"Maxi 19 pts",null,null,null,null,null,"2 sur la feuille",null,"4 Maxi / terrain"]
[null,null,null,null,null,"","",null,null,"N",2.5,"FARES","A",12,null,null,null,null,null,null,"si cartes de couleurs",null,null,null,null,null,"2 sur le terrain",null," (5 sur la feuille)"]
[null,null,null,null,null,"","",null,null,"N",5,"DURAND","P",13]
[null,null,null,null,null,"","",null,null,"N",1,"COISNE","A",14,null,"Inscrire dans la colonne de gauche les \"Statuts\" des joueurs de l'équipe"]
[null,null,null,null,null,"","","",null,null,null,null,null,15,null,"J",null,null,"Pour les cartes Vertes",null,null,null,"Jeune joueur (U19 en Elite Nationale Bastide Médical)"]
[null,null,null,null,null,"","","",null,null,null,null,null,16,null,null,null,null,null,null,null,null,"Joueur débutant, sélectionnable en Equipe de France"]
[null,null,null,null,null,"","","",null,null,null,null,null,17,null,null,null,null,null,null,null,null,"seulement (attention à la date de validité juqu'à 22 ans révolu)"]
[null,null,null,null,null,"","",null,null,null,null,null,null,18,null,"JF",null,null,"Pour les cartes Jaunes",null,null,null,"Jeune joueuse (U19 en Elite Nationale Bastide Médical)"]
[null,null,null,null,null,"","","",null,null,null,null,null,19,null,null,null,null,null,null,null,null,"Joueuse débutante, sélectionnable en Equipe de France"]
[null,null,null,null,null,"","",null,null,null,null,null,null,20,null,null,null,null,null,null,null,null,"seulement (attention à la date de validité juqu' à 22 ans révolu)"]
[null,null,null,null,null,"","",null,null,null,null,null,null,null,null,"F ou FET",null,null,"Pour les cartes roses",null,null,null,"Pour les femmes ou femmes étrangères <5pts  (Bonus 1,5 pts)"]
[null,null,null,null,null,"","",null,null,null,null,null,null,null,null,"En Nationale 2 et 3 uniquement (joueuses et joueurs de plus de 55 ans)"]
[null,null,null,null,null,"","",null,null,null,null,null,null,null,null,"S",null,null,"Pour les hommes séniors",null,null,null," Français ou Etrangers (Bonus de 0,5pt)"]
[null,null,null,null,null,null,null,null,null,null,null,null,null,null,null,"FS",null,null,"   Pour les femmes seniors",null,null,null," (Bonus 2pts)      "]
[" Joueurs-joueuses valides de l'équipe (5 points)",null,null,null,null,null,null,null,null,null,null,null,null,null,null,"JS",null,null," Pour les jeunes hommes séniors",null,null,null," Débutants  (Bonus 2pts)  validité (<3pts 2ans)       ( > 3pts 1 an)"]
[{"$f":"IF(G31=0,\"\",IF(G31>2,\"Trop de valides sur le terrain\",\"OK\"))","v":""},null,null,null,null,null,null,null,null,null,null,null,null,null,null,"JFS",null,null," Pour les jeunes femmes séniors",null,null,null," Débutantes  (Bonus 3pts)  validité (<3pts 2ans)     ( > 3pts 1 an)"]
["Joueurs étrangers ",null,null,null,null,null,null,null,null,null,null,null,null,null,null,"Autres possibilités (sans Bonus)"]
[{"$f":"IF(F31=0,\"\",IF(F31>5,\"Trop de joueurs étrangers sur la feuille\",\"OK\"))","v":""},null,null,null,null,null,null,null,null,null,null,null,null,null,null,"ET",null,null,"Pour un joueur étranger"]
[null,null,null,null,null,{"$f":"SUM(F6:F28)","v":0},{"$f":"SUM(G6:G30)","v":0},null,null,null,null,null,null,null,null,"FID",null,null,"Pour un joueur fidèle"]
[null,null,null,null,null,null,null,null,null,null,null,null,null,null,null,"N",null,null,"Pour tous joueurs sans symbole sur la carte de classification"]

{"sheet":"ORLEANS","index":50,"n_rows":32,"n_cols":29,"rows_kept":32,"cut":false,"hidden":false,"merged":[[30,15,30,17],[31,15,31,17],[0,15,0,29],[1,22,3,22],[1,23,3,23],[1,24,3,24],[1,25,3,25],[1,26,3,27],[1,28,3,29],[5,15,6,17],[5,18,6,19],[5,22,6,22],[5,23,6,23],[5,24,6,24],[5,28,6,29],[10,28,10,29],[12,26,12,27],[12,28,12,29],[10,26,10,27],[11,20,11,21],[11,26,11,27],[9,25,10,25],[11,22,14,22],[11,23,14,23],[11,24,14,24],[11,25,14,25],[13,26,13,27],[13,28,13,29],[9,28,9,29],[14,28,14,29],[9,26,9,27],[9,22,10,22],[1,0,2,0],[1,1,2,3],[1,9,1,13],[28,0,28,4],[7,15,8,17],[15,15,15,29],[19,15,21,17],[19,18,21,21],[22,18,22,21],[23,15,23,29],[8,28,8,29],[11,15,14,17],[11,18,11,19],[12,18,14,19],[14,26,14,27],[7,28,7,29],[9,23,10,23],[9,24,10,24],[29,0,29,4],[22,15,22,17],[26,0,26,4],[27,0,27,4],[27,15,27,17],[29,15,29,17],[24,15,24,17],[25,15,25,17],[26,15,26,17],[28,15,28,29],[11,28,11,29],[12,20,12,21],[16,15,18,17],[16,18,18,21],[2,9,2,13],[5,26,5,27],[5,20,5,21],[7,18,8,19],[7,22,8,22],[7,23,8,23],[7,24,8,24],[8,20,8,21],[8,26,8,27],[7,26,7,27],[6,20,6,21],[6,26,6,27],[7,20,7,21],[9,15,10,17],[10,20,10,21],[9,18,10,19],[13,20,13,21],[14,20,14,21],[9,20,9,21]]}
["ORLEANS",null,null,null,null,null,null,null,null,null,null,null,null,null,null,"Saison 2023-2024"]
[null,"Joueur(es) participant à la rencontre",null,null,null,null,null,null,null,"Saisir votre liste complète en MAJUSCULES ",null,null,null,null,null,null,null,null,null,null,null,null,"Carte Verte","Carte Jaune","Carte Rose","Carte Bleue","5,0 Val",null,"Non Sélectionnables en EDF (hors Fidet)"]
[null,null,null,null,null,null,null,null,null,"Joueurs(es) qualifié(es) saison 2023 -2024",null,null,null,null,null,null,null,null,"Avec une date de validité"]
[]
["Statuts","Classif.","          Noms      /    Prénoms",null,"Numéros","ET","VALIDE",null,null,"Statuts","Classif.","          Noms      /    Prénoms",null,"Numéros"]
[null,null,null,null,null,{"$f":"IF(A6=\"ET\",1,\"\")","v":""},{"$f":"IF(B6=5,1,\"\")","v":""},null,null,"N",5,"ROCHON","B",4,null,"Elite Nationale Bastide Médical",null,null,14.5,null,"Maxi 17,5 pts",null,"+  1 ","+  2","+  1,5",null,"1 sur la feuille",null,"Pas de limite"]
[null,null,null,null,null,{"$f":"IF(A7=\"ET\",1,\"\")","v":""},{"$f":"IF(B7=5,1,\"\")","v":""},null,null,null,null,null,null,5,null,null,null,null,null,null,"si cartes de couleurs",null,null,null,null,null,"et terrain"]
[null,null,null,null,null,{"$f":"IF(A8=\"ET\",1,\"\")","v":""},{"$f":"IF(B8=5,1,\"\")","v":""},null,null,null,null,null,null,6,null," Nationale 1",null,null,14.5,null,"Maxi 17,5 pts",null,"+  1 ,5","+  2,5","+  1,5",null,"1 sur la feuille",null,"4  Maxi / terrain     "]
[null,null,null,null,null,"","",null,null,null,null,null,null,7,null,null,null,null,null,null,"si cartes de couleurs",null,null,null,null,null,"et terrain",null," (5 sur la feuille)"]
[null,null,null,null,null,"","",null,null,"N",1.5,"ENG","V",8,null," Nationale 2",null,null,15,null,"Maxi 19 pts",null,"+  1,5","+  2,5","+  1,5","+  0,5","2 sur la feuille",null,"4  Maxi / terrain     "]
[null,null,null,null,null,"","",null,null,"N",2,"RAJOHNSON","T",9,null,null,null,null,null,null,"si cartes de couleurs",null,null,null,null,null,"2 sur le terrain",null," (5 sur la feuille)"]
[null,null,null,null,null,"","",null,null,null,null,null,null,10,null," Nationale 3",null,null,15.5,null,null,null,"+  1,5","+  2,5","+  1,5","+  0,5"]
[null,null,null,null,null,"","",null,null,null,null,null,null,11,null,null,null,null,"Si 16pts début match-handicap de 10pts",null,"Maxi 19 pts",null,null,null,null,null,"2 sur la feuille",null,"4 Maxi / terrain"]
[null,null,null,null,null,"","",null,null,null,null,null,null,12,null,null,null,null,null,null,"si cartes de couleurs",null,null,null,null,null,"2 sur le terrain",null," (5 sur la feuille)"]
[null,null,null,null,null,"","",null,null,"N",4.5,"MURIENTE","E",13]
[null,null,null,null,null,"","",null,null,"N",4,"MASRANE","S",14,null,"Inscrire dans la colonne de gauche les \"Statuts\" des joueurs de l'équipe"]
[null,null,null,null,null,"","","",null,"N",2,"LEBRETON","F",15,null,"J",null,null,"Pour les cartes Vertes",null,null,null,"Jeune joueur (U19 en Elite Nationale Bastide Médical)"]
[null,null,null,null,null,"","","",null,null,null,null,null,16,null,null,null,null,null,null,null,null,"Joueur débutant, sélectionnable en Equipe de France"]
[null,null,null,null,null,"","","",null,null,null,null,null,17,null,null,null,null,null,null,null,null,"seulement (attention à la date de validité juqu'à 22 ans révolu)"]
[null,null,null,null,null,"","",null,null,null,null,null,null,18,null,"JF",null,null,"Pour les cartes Jaunes",null,null,null,"Jeune joueuse (U19 en Elite Nationale Bastide Médical)"]
[null,null,null,null,null,"","","",null,null,null,null,null,19,null,null,null,null,null,null,null,null,"Joueuse débutante, sélectionnable en Equipe de France"]
[null,null,null,null,null,"","",null,null,null,null,null,null,20,null,null,null,null,null,null,null,null,"seulement (attention à la date de validité juqu' à 22 ans révolu)"]
[null,null,null,null,null,"","",null,null,null,null,null,null,null,null,"F ou FET",null,null,"Pour les cartes roses",null,null,null,"Pour les femmes ou femmes étrangères <5pts  (Bonus 1,5 pts)"]
[null,null,null,null,null,"","",null,null,null,null,null,null,null,null,"En Nationale 2 et 3 uniquement (joueuses et joueurs de plus de 55 ans)"]
[null,null,null,null,null,"","",null,null,null,null,null,null,null,null,"S",null,null,"Pour les hommes séniors",null,null,null," Français ou Etrangers (Bonus de 0,5pt)"]
[null,null,null,null,null,null,null,null,null,null,null,null,null,null,null,"FS",null,null,"   Pour les femmes seniors",null,null,null," (Bonus 2pts)      "]
[" Joueurs-joueuses valides de l'équipe (5 points)",null,null,null,null,null,null,null,null,null,null,null,null,null,null,"JS",null,null," Pour les jeunes hommes séniors",null,null,null," Débutants  (Bonus 2pts)  validité (<3pts 2ans)       ( > 3pts 1 an)"]
[{"$f":"IF(G31=0,\"\",IF(G31>2,\"Trop de valides sur le terrain\",\"OK\"))","v":""},null,null,null,null,null,null,null,null,null,null,null,null,null,null,"JFS",null,null," Pour les jeunes femmes séniors",null,null,null," Débutantes  (Bonus 3pts)  validité (<3pts 2ans)     ( > 3pts 1 an)"]
["Joueurs étrangers ",null,null,null,null,null,null,null,null,null,null,null,null,null,null,"Autres possibilités (sans Bonus)"]
[{"$f":"IF(F31=0,\"\",IF(F31>5,\"Trop de joueurs étrangers sur la feuille\",\"OK\"))","v":""},null,null,null,null,null,null,null,null,null,null,null,null,null,null,"ET",null,null,"Pour un joueur étranger"]
[null,null,null,null,null,{"$f":"SUM(F6:F28)","v":0},{"$f":"SUM(G6:G30)","v":0},null,null,null,null,null,null,null,null,"FID",null,null,"Pour un joueur fidèle"]
[null,null,null,null,null,null,null,null,null,null,null,null,null,null,null,"N",null,null,"Pour tous joueurs sans symbole sur la carte de classification"]

{"sheet":"SAINT OUEN","index":51,"n_rows":32,"n_cols":29,"rows_kept":32,"cut":false,"hidden":false,"merged":[[30,15,30,17],[31,15,31,17],[0,15,0,29],[1,22,3,22],[1,23,3,23],[1,24,3,24],[1,25,3,25],[1,26,3,27],[1,28,3,29],[5,15,6,17],[5,18,6,19],[5,22,6,22],[5,23,6,23],[5,24,6,24],[5,28,6,29],[10,28,10,29],[12,26,12,27],[12,28,12,29],[10,26,10,27],[11,20,11,21],[11,26,11,27],[9,25,10,25],[11,22,14,22],[11,23,14,23],[11,24,14,24],[11,25,14,25],[13,26,13,27],[13,28,13,29],[9,28,9,29],[14,28,14,29],[9,26,9,27],[9,22,10,22],[1,0,2,0],[1,1,2,3],[1,9,1,13],[28,0,28,4],[7,15,8,17],[15,15,15,29],[19,15,21,17],[19,18,21,21],[22,18,22,21],[23,15,23,29],[8,28,8,29],[11,15,14,17],[11,18,11,19],[12,18,14,19],[14,26,14,27],[7,28,7,29],[9,23,10,23],[9,24,10,24],[29,0,29,4],[22,15,22,17],[26,0,26,4],[27,0,27,4],[27,15,27,17],[29,15,29,17],[24,15,24,17],[25,15,25,17],[26,15,26,17],[28,15,28,29],[11,28,11,29],[12,20,12,21],[16,15,18,17],[16,18,18,21],[2,9,2,13],[5,26,5,27],[5,20,5,21],[7,18,8,19],[7,22,8,22],[7,23,8,23],[7,24,8,24],[8,20,8,21],[8,26,8,27],[7,26,7,27],[6,20,6,21],[6,26,6,27],[7,20,7,21],[9,15,10,17],[10,20,10,21],[9,18,10,19],[13,20,13,21],[14,20,14,21],[9,20,9,21]]}
["SAINT OUEN",null,null,null,null,null,null,null,null,null,null,null,null,null,null,"Saison 2023-2024"]
[null,"Joueur(es) participant à la rencontre",null,null,null,null,null,null,null,"Saisir votre liste complète en MAJUSCULES ",null,null,null,null,null,null,null,null,null,null,null,null,"Carte Verte","Carte Jaune","Carte Rose","Carte Bleue","5,0 Val",null,"Non Sélectionnables en EDF (hors Fidet)"]
[null,null,null,null,null,null,null,null,null,"Joueurs(es) qualifié(es) saison 2023 -2024",null,null,null,null,null,null,null,null,"Avec une date de validité"]
[]
["Statuts","Classif.","          Noms      /    Prénoms",null,"Numéros","ET","VALIDE",null,null,"Statuts","Classif.","          Noms      /    Prénoms",null,"Numéros"]
[null,null,null,null,null,{"$f":"IF(A6=\"ET\",1,\"\")","v":""},{"$f":"IF(B6=5,1,\"\")","v":""},null,null,"N",1.5,"GERAN","C",4,null,"Elite Nationale Bastide Médical",null,null,14.5,null,"Maxi 17,5 pts",null,"+  1 ","+  2","+  1,5",null,"1 sur la feuille",null,"Pas de limite"]
[null,null,null,null,null,{"$f":"IF(A7=\"ET\",1,\"\")","v":""},{"$f":"IF(B7=5,1,\"\")","v":""},null,null,"N",1,"SEMEDO  DEPINA","T",5,null,null,null,null,null,null,"si cartes de couleurs",null,null,null,null,null,"et terrain"]
[null,null,null,null,null,{"$f":"IF(A8=\"ET\",1,\"\")","v":""},{"$f":"IF(B8=5,1,\"\")","v":""},null,null,null,null,null,null,6,null," Nationale 1",null,null,14.5,null,"Maxi 17,5 pts",null,"+  1 ,5","+  2,5","+  1,5",null,"1 sur la feuille",null,"4  Maxi / terrain     "]
[null,null,null,null,null,"","",null,null,null,null,null,null,7,null,null,null,null,null,null,"si cartes de couleurs",null,null,null,null,null,"et terrain",null," (5 sur la feuille)"]
[null,null,null,null,null,"","",null,null,null,null,null,null,8,null," Nationale 2",null,null,15,null,"Maxi 19 pts",null,"+  1,5","+  2,5","+  1,5","+  0,5","2 sur la feuille",null,"4  Maxi / terrain     "]
[null,null,null,null,null,"","",null,null,"N",1,"LAMBERT","V",9,null,null,null,null,null,null,"si cartes de couleurs",null,null,null,null,null,"2 sur le terrain",null," (5 sur la feuille)"]
[null,null,null,null,null,"","",null,null,"N",3.5,"LAGHOUTI","A",10,null," Nationale 3",null,null,15.5,null,null,null,"+  1,5","+  2,5","+  1,5","+  0,5"]
[null,null,null,null,null,"","",null,null,null,null,null,null,11,null,null,null,null,"Si 16pts début match-handicap de 10pts",null,"Maxi 19 pts",null,null,null,null,null,"2 sur la feuille",null,"4 Maxi / terrain"]
[null,null,null,null,null,"","",null,null,null,null,null,null,12,null,null,null,null,null,null,"si cartes de couleurs",null,null,null,null,null,"2 sur le terrain",null," (5 sur la feuille)"]
[null,null,null,null,null,"","",null,null,null,null,null,null,13]
[null,null,null,null,null,"","",null,null,"N",3,"FOSSARD","D",14,null,"Inscrire dans la colonne de gauche les \"Statuts\" des joueurs de l'équipe"]
[null,null,null,null,null,"","","",null,null,null,null,null,15,null,"J",null,null,"Pour les cartes Vertes",null,null,null,"Jeune joueur (U19 en Elite Nationale Bastide Médical)"]
[null,null,null,null,null,"","","",null,null,null,null,null,16,null,null,null,null,null,null,null,null,"Joueur débutant, sélectionnable en Equipe de France"]
[null,null,null,null,null,"","","",null,"N",3.5,"ENNADI","K",24,null,null,null,null,null,null,null,null,"seulement (attention à la date de validité juqu'à 22 ans révolu)"]
[null,null,null,null,null,"","",null,null,null,null,null,null,18,null,"JF",null,null,"Pour les cartes Jaunes",null,null,null,"Jeune joueuse (U19 en Elite Nationale Bastide Médical)"]
[null,null,null,null,null,"","","",null,null,null,null,null,19,null,null,null,null,null,null,null,null,"Joueuse débutante, sélectionnable en Equipe de France"]
[null,null,null,null,null,"","",null,null,null,null,null,null,20,null,null,null,null,null,null,null,null,"seulement (attention à la date de validité juqu' à 22 ans révolu)"]
[null,null,null,null,null,"","",null,null,null,null,null,null,null,null,"F ou FET",null,null,"Pour les cartes roses",null,null,null,"Pour les femmes ou femmes étrangères <5pts  (Bonus 1,5 pts)"]
[null,null,null,null,null,"","",null,null,null,null,null,null,null,null,"En Nationale 2 et 3 uniquement (joueuses et joueurs de plus de 55 ans)"]
[null,null,null,null,null,"","",null,null,null,null,null,null,null,null,"S",null,null,"Pour les hommes séniors",null,null,null," Français ou Etrangers (Bonus de 0,5pt)"]
[null,null,null,null,null,null,null,null,null,null,null,null,null,null,null,"FS",null,null,"   Pour les femmes seniors",null,null,null," (Bonus 2pts)      "]
[" Joueurs-joueuses valides de l'équipe (5 points)",null,null,null,null,null,null,null,null,null,null,null,null,null,null,"JS",null,null," Pour les jeunes hommes séniors",null,null,null," Débutants  (Bonus 2pts)  validité (<3pts 2ans)       ( > 3pts 1 an)"]
[{"$f":"IF(G31=0,\"\",IF(G31>2,\"Trop de valides sur le terrain\",\"OK\"))","v":""},null,null,null,null,null,null,null,null,null,null,null,null,null,null,"JFS",null,null," Pour les jeunes femmes séniors",null,null,null," Débutantes  (Bonus 3pts)  validité (<3pts 2ans)     ( > 3pts 1 an)"]
["Joueurs étrangers ",null,null,null,null,null,null,null,null,null,null,null,null,null,null,"Autres possibilités (sans Bonus)"]
[{"$f":"IF(F31=0,\"\",IF(F31>5,\"Trop de joueurs étrangers sur la feuille\",\"OK\"))","v":""},null,null,null,null,null,null,null,null,null,null,null,null,null,null,"ET",null,null,"Pour un joueur étranger"]
[null,null,null,null,null,{"$f":"SUM(F6:F28)","v":0},{"$f":"SUM(G6:G30)","v":0},null,null,null,null,null,null,null,null,"FID",null,null,"Pour un joueur fidèle"]
[null,null,null,null,null,null,null,null,null,null,null,null,null,null,null,"N",null,null,"Pour tous joueurs sans symbole sur la carte de classification"]

{"sheet":"VALENCIENNES","index":52,"n_rows":32,"n_cols":29,"rows_kept":32,"cut":false,"hidden":false,"merged":[[24,15,24,17],[25,15,25,17],[26,15,26,17],[28,15,28,29],[30,15,30,17],[15,15,15,29],[19,15,21,17],[19,18,21,21],[22,18,22,21],[23,15,23,29],[16,15,18,17],[16,18,18,21],[22,15,22,17],[13,28,13,29],[14,20,14,21],[14,26,14,27],[14,28,14,29],[11,22,14,22],[11,23,14,23],[11,24,14,24],[11,25,14,25],[11,26,11,27],[11,28,11,29],[12,26,12,27],[12,28,12,29],[13,26,13,27],[12,20,12,21],[1,0,2,0],[1,1,2,3],[1,9,1,13],[2,9,2,13],[5,15,6,17],[5,28,6,29],[6,20,6,21],[7,15,8,17],[7,18,8,19],[7,22,8,22],[7,23,8,23],[5,18,6,19],[5,22,6,22],[5,23,6,23],[5,20,5,21],[5,26,5,27],[5,24,6,24],[6,26,6,27],[7,20,7,21],[7,26,7,27],[7,24,8,24],[0,15,0,29],[1,22,3,22],[1,23,3,23],[1,24,3,24],[1,25,3,25],[1,26,3,27],[1,28,3,29],[7,28,7,29],[8,28,8,29],[8,20,8,21],[8,26,8,27],[9,23,10,23],[10,20,10,21],[9,22,10,22],[9,26,9,27],[9,24,10,24],[9,28,9,29],[10,28,10,29],[9,25,10,25],[10,26,10,27],[11,15,14,17],[11,18,11,19],[9,20,9,21],[11,20,11,21],[13,20,13,21],[12,18,14,19],[9,15,10,17],[9,18,10,19],[31,15,31,17],[29,0,29,4],[26,0,26,4],[27,0,27,4],[27,15,27,17],[28,0,28,4],[29,15,29,17]]}
["VALENCIENNES",null,null,null,null,null,null,null,null,null,null,null,null,null,null,"Saison 2023-2024"]
[null,"Joueur(es) participant à la rencontre",null,null,null,null,null,null,null,"Saisir votre liste complète en MAJUSCULES ",null,null,null,null,null,null,null,null,null,null,null,null,"Carte Verte","Carte Jaune","Carte Rose","Carte Bleue","5,0 Val",null,"Non Sélectionnables en EDF (hors Fidet)"]
[null,null,null,null,null,null,null,null,null,"Joueurs(es) qualifié(es) saison 2023 -2024",null,null,null,null,null,null,null,null,"Avec une date de validité"]
[]
["Statuts","Classif.","          Noms      /    Prénoms",null,"Numéros","ET","VALID","",null,"Statuts","Classif.","          Noms      /    Prénoms",null,"Numéros"]
[null,null,null,null,null,{"$f":"IF(A6=\"ET\",1,\"\")","v":""},{"$f":"IF(B6=5,1,\"\")","v":""},"",null,null,null,null,null,4,null,"Elite Nationale Bastide Médical",null,null,14.5,null,"Maxi 17,5 pts",null,"+  1 ","+  2","+  1,5",null,"1 sur la feuille",null,"Pas de limite"]
[null,null,null,null,null,{"$f":"IF(A7=\"ET\",1,\"\")","v":""},{"$f":"IF(B7=5,1,\"\")","v":""},null,null,"N",4.5,"PARSY","C",5,null,null,null,null,null,null,"si cartes de couleurs",null,null,null,null,null,"et terrain"]
[null,null,null,null,null,{"$f":"IF(A8=\"ET\",1,\"\")","v":""},{"$f":"IF(B8=5,1,\"\")","v":""},"",null,"N",5,"MARCANT","A",6,null," Nationale 1",null,null,14.5,null,"Maxi 17,5 pts",null,"+  1 ,5","+  2,5","+  1,5",null,"1 sur la feuille",null,"4  Maxi / terrain     "]
[null,null,null,null,null,"","",null,null,"N",5,"FROMONT","T",7,null,null,null,null,null,null,"si cartes de couleurs",null,null,null,null,null,"et terrain",null," (5 sur la feuille)"]
[null,null,null,null,null,"","","",null,null,null,null,null,8,null," Nationale 2",null,null,15,null,"Maxi 19 pts",null,"+  1,5","+  2,5","+  1,5","+  0,5","2 sur la feuille",null,"4  Maxi / terrain     "]
[null,null,null,null,null,"","","",null,null,null,null,null,9,null,null,null,null,null,null,"si cartes de couleurs",null,null,null,null,null,"2 sur le terrain",null," (5 sur la feuille)"]
[null,null,null,null,null,"","","",null,"S",1,"HAMDAT","A",10,null," Nationale 3",null,null,15.5,null,null,null,"+  1,5","+  2,5","+  1,5","+  0,5"]
[null,null,null,null,null,"","","",null,null,null,null,null,11,null,null,null,null,"Si 16pts début match-handicap de 10pts",null,"Maxi 19 pts",null,null,null,null,null,"2 sur la feuille",null,"4 Maxi / terrain"]
[null,null,null,null,null,"","","",null,null,null,null,null,12,null,null,null,null,null,null,"si cartes de couleurs",null,null,null,null,null,"2 sur le terrain",null," (5 sur la feuille)"]
[null,null,null,null,null,"","","",null,"N",1,"MONNIER","V",13]
[null,null,null,null,null,"","","",null,"N",3,"GALAN","L",14,null,"Inscrire dans la colonne de gauche les \"Statuts\" des joueurs de l'équipe"]
[null,null,null,null,null,"","","",null,null,null,null,null,15,null,"J",null,null,"Pour les cartes Vertes",null,null,null,"Jeune joueur (U19 en Elite Nationale Bastide Médical)"]
[null,null,null,null,null,"","","",null,null,null,null,null,null,null,null,null,null,null,null,null,null,"Joueur débutant, sélectionnable en Equipe de France"]
[null,null,null,null,null,"","","",null,null,null,null,null,null,null,null,null,null,null,null,null,null,"seulement (attention à la date de validité juqu'à 22 ans révolu)"]
[null,null,null,null,null,"","",null,null,"N",2,"FAVRY","Y",18,null,"JF",null,null,"Pour les cartes Jaunes",null,null,null,"Jeune joueuse (U19 en Elite Nationale Bastide Médical)"]
[null,null,null,null,null,"","","",null,"S",1,"DESCAMP","A",null,null,null,null,null,null,null,null,null,"Joueuse débutante, sélectionnable en Equipe de France"]
[null,null,null,null,null,"","",null,null,"FID",2,"TASKIN","G",20,null,null,null,null,null,null,null,null,"seulement (attention à la date de validité juqu' à 22 ans révolu)"]
[null,null,null,null,null,"","",null,null,null,null,null,null,null,null,"F ou FET",null,null,"Pour les cartes roses",null,null,null,"Pour les femmes ou femmes étrangères <5pts  (Bonus 1,5 pts)"]
[null,null,null,null,null,"","",null,null,null,null,null,null,null,null,"En Nationale 2 et 3 uniquement (joueuses et joueurs de plus de 55 ans)"]
[null,null,null,null,null,"","",null,null,null,null,null,null,null,null,"S",null,null,"Pour les hommes séniors",null,null,null," Français ou Etrangers (Bonus de 0,5pt)"]
[null,null,null,null,null,"","",null,null,null,null,null,null,null,null,"FS",null,null,"   Pour les femmes seniors",null,null,null," (Bonus 2pts)      "]
[" Joueurs-joueuses valides de l'équipe (5 points)",null,null,null,null,"","",null,null,null,null,null,null,null,null,"JS",null,null," Pour les jeunes hommes séniors",null,null,null," Débutants  (Bonus 2pts)  validité (<3pts 2ans)       ( > 3pts 1 an)"]
[{"$f":"IF(G31=0,\"\",IF(G31>2,\"Trop de valides sur le terrain\",\"OK\"))","v":""},null,null,null,null,"","",null,null,null,null,null,null,null,null,"JFS",null,null," Pour les jeunes femmes séniors",null,null,null," Débutantes  (Bonus 3pts)  validité (<3pts 2ans)     ( > 3pts 1 an)"]
["Joueurs étrangers ",null,null,null,null,"","",null,null,null,null,null,null,null,null,"Autres possibilités (sans Bonus)"]
[{"$f":"IF(F31=0,\"\",IF(F31>5,\"Trop de joueurs étrangers sur la feuille\",\"OK\"))","v":""},null,null,null,null,"","",null,null,null,null,null,null,null,null,"ET",null,null,"Pour un joueur étranger"]
[null,null,null,null,null,{"$f":"SUM(F6:F28)","v":0},{"$f":"SUM(G6:G28)","v":0},null,null,null,null,null,null,null,null,"FID",null,null,"Pour un joueur fidèle"]
[null,null,null,null,null,null,null,null,null,null,null,null,null,null,null,"N",null,null,"Pour tous joueurs sans symbole sur la carte de classification"]

{"sheet":"AUXERRE","index":53,"n_rows":32,"n_cols":29,"rows_kept":32,"cut":false,"hidden":false,"merged":[[30,15,30,17],[31,15,31,17],[0,15,0,29],[1,22,3,22],[1,23,3,23],[1,24,3,24],[1,25,3,25],[1,26,3,27],[1,28,3,29],[5,15,6,17],[5,18,6,19],[5,22,6,22],[5,23,6,23],[5,24,6,24],[5,28,6,29],[7,28,7,29],[15,15,15,29],[19,15,21,17],[19,18,21,21],[11,15,14,17],[11,18,11,19],[11,22,14,22],[11,23,14,23],[11,24,14,24],[11,25,14,25],[12,18,14,19],[16,15,18,17],[16,18,18,21],[13,20,13,21],[13,26,13,27],[13,28,13,29],[14,20,14,21],[9,15,10,17],[9,18,10,19],[9,22,10,22],[9,23,10,23],[9,24,10,24],[7,15,8,17],[7,18,8,19],[7,22,8,22],[7,23,8,23],[7,24,8,24],[1,0,2,0],[1,1,2,3],[1,9,1,13],[26,0,26,4],[27,0,27,4],[2,9,2,13],[28,0,28,4],[29,0,29,4],[22,15,22,17],[27,15,27,17],[29,15,29,17],[28,15,28,29],[22,18,22,21],[23,15,23,29],[24,15,24,17],[25,15,25,17],[26,15,26,17],[12,20,12,21],[12,26,12,27],[12,28,12,29],[9,25,10,25],[9,20,9,21],[9,26,9,27],[10,26,10,27],[11,26,11,27],[10,20,10,21],[11,20,11,21],[14,26,14,27],[14,28,14,29],[8,26,8,27],[6,26,6,27],[7,26,7,27],[8,28,8,29],[9,28,9,29],[10,28,10,29],[11,28,11,29],[5,26,5,27],[5,20,5,21],[6,20,6,21],[7,20,7,21],[8,20,8,21]]}
["AUXERRE",null,null,null,null,null,null,null,null,null,null,null,null,null,null,"Saison 2023-2024"]
[null,"Joueur(es) participant à la rencontre",null,null,null,null,null,null,null,"Saisir votre liste complète en MAJUSCULES ",null,null,null,null,null,null,null,null,null,null,null,null,"Carte Verte","Carte Jaune","Carte Rose","Carte Bleue","5,0 Val",null,"Non Sélectionnables en EDF (hors Fidet)"]
[null,null,null,null,null,null,null,null,null,"Joueurs(es) qualifié(es) saison 2023 -2024",null,null,null,null,null,null,null,null,"Avec une date de validité"]
[]
["Statuts","Classif.","          Noms      /    Prénoms",null,"Numéros","ET","VALID","",null,"Statuts","Classif.","          Noms      /    Prénoms",null,"Numéros"]
[null,null,null,null,null,{"$f":"IF(A6=\"ET\",1,\"\")","v":""},{"$f":"IF(B6=5,1,\"\")","v":""},"",null,"S",2.5,"ABOUKIR","JD",4,null,"Elite Nationale Bastide Médical",null,null,14.5,null,"Maxi 17,5 pts",null,"+  1 ","+  2","+  1,5",null,"1 sur la feuille",null,"Pas de limite"]
[null,null,null,null,null,{"$f":"IF(A7=\"ET\",1,\"\")","v":""},{"$f":"IF(B7=5,1,\"\")","v":""},null,null,"N",1,"LAGHOUITI","S",5,null,null,null,null,null,null,"si cartes de couleurs",null,null,null,null,null,"et terrain"]
[null,null,null,null,null,{"$f":"IF(A8=\"ET\",1,\"\")","v":""},"","",null,"J",3,"PARIS","A",6,null," Nationale 1",null,null,14.5,null,"Maxi 17,5 pts",null,"+  1 ,5","+  2,5","+  1,5",null,"1 sur la feuille",null,"4  Maxi / terrain     "]
[null,null,null,null,null,"","",null,null,"S",4,"BONINE","C",7,null,null,null,null,null,null,"si cartes de couleurs",null,null,null,null,null,"et terrain",null," (5 sur la feuille)"]
[null,null,null,null,null,"","","",null,null,null,null,null,8,null," Nationale 2",null,null,15,null,"Maxi 19 pts",null,"+  1,5","+  2,5","+  1,5","+  0,5","2 sur la feuille",null,"4  Maxi / terrain     "]
[null,null,null,null,null,"","","",null,null,null,null,null,9,null,null,null,null,null,null,"si cartes de couleurs",null,null,null,null,null,"2 sur le terrain",null," (5 sur la feuille)"]
[null,null,null,null,null,"","","",null,null,null,null,null,10,null," Nationale 3",null,null,15.5,null,null,null,"+  1,5","+  2,5","+  1,5","+  0,5"]
[null,null,null,null,null,"","","",null,"J",3.5,"BONNIEUX","M",11,null,null,null,null,"Si 16pts début match-handicap de 10pts",null,"Maxi 19 pts",null,null,null,null,null,"2 sur la feuille",null,"4 Maxi / terrain"]
[null,null,null,null,null,"","","",null,"N",4.5,"DERRE","E",12,null,null,null,null,null,null,"si cartes de couleurs",null,null,null,null,null,"2 sur le terrain",null," (5 sur la feuille)"]
[null,null,null,null,null,"","","",null,null,null,null,null,13]
[null,null,null,null,null,"","","",null,"N",2,"DALI  YOUCEF","N",14,null,"Inscrire dans la colonne de gauche les \"Statuts\" des joueurs de l'équipe"]
[null,null,null,null,null,"","","",null,"S",4,"CRESSENT","B",15,null,"J",null,null,"Pour les cartes Vertes",null,null,null,"Jeune joueur (U19 en Elite Nationale Bastide Médical)"]
[null,null,null,null,null,"","","",null,"S",4.5,"GENETTE","JL",16,null,null,null,null,null,null,null,null,"Joueur débutant, sélectionnable en Equipe de France"]
[null,null,null,null,null,"","","",null,null,null,null,null,17,null,null,null,null,null,null,null,null,"seulement (attention à la date de validité juqu'à 22 ans révolu)"]
[null,null,null,null,null,"","",null,null,null,null,null,null,18,null,"JF",null,null,"Pour les cartes Jaunes",null,null,null,"Jeune joueuse (U19 en Elite Nationale Bastide Médical)"]
[null,null,null,null,null,"","","",null,null,null,null,null,19,null,null,null,null,null,null,null,null,"Joueuse débutante, sélectionnable en Equipe de France"]
[null,null,null,null,null,"","",null,null,null,null,null,null,20,null,null,null,null,null,null,null,null,"seulement (attention à la date de validité juqu' à 22 ans révolu)"]
[null,null,null,null,null,"","",null,null,null,null,null,null,null,null,"F ou FET",null,null,"Pour les cartes roses",null,null,null,"Pour les femmes ou femmes étrangères <5pts  (Bonus 1,5 pts)"]
[null,null,null,null,null,"","",null,null,null,null,null,null,null,null,"En Nationale 2 et 3 uniquement (joueuses et joueurs de plus de 55 ans)"]
[null,null,null,null,null,"","",null,null,null,null,null,null,null,null,"S",null,null,"Pour les hommes séniors",null,null,null," Français ou Etrangers (Bonus de 0,5pt)"]
[null,null,null,null,null,null,null,null,null,null,null,null,null,null,null,"FS",null,null,"   Pour les femmes seniors",null,null,null," (Bonus 2pts)      "]
[" Joueurs-joueuses valides de l'équipe (5 points)",null,null,null,null,null,null,null,null,null,null,null,null,null,null,"JS",null,null," Pour les jeunes hommes séniors",null,null,null," Débutants  (Bonus 2pts)  validité (<3pts 2ans)       ( > 3pts 1 an)"]
[{"$f":"IF($G$31=0,\"\",IF($G$31>2,\"Trop de valides sur le terrain\",\"OK\"))","v":""},null,null,null,null,null,null,null,null,null,null,null,null,null,null,"JFS",null,null," Pour les jeunes femmes séniors",null,null,null," Débutantes  (Bonus 3pts)  validité (<3pts 2ans)     ( > 3pts 1 an)"]
["Joueurs étrangers ",null,null,null,null,null,null,null,null,null,null,null,null,null,null,"Autres possibilités (sans Bonus)"]
[{"$f":"IF(F31=0,\"\",IF(F31>4,\"Trop de joueurs étrangers sur la feuille\",\"OK\"))","v":""},null,null,null,null,null,null,null,null,null,null,null,null,null,null,"ET",null,null,"Pour un joueur étranger"]
[null,null,null,null,null,{"$f":"SUM(F6:F25)","v":0},{"$f":"SUM(G6:G25)","v":0},null,null,null,null,null,null,null,null,"FID",null,null,"Pour un joueur fidèle"]
[null,null,null,null,null,null,null,null,null,null,null,null,null,null,null,"N",null,null,"Pour tous joueurs sans symbole sur la carte de classification"]

{"sheet":"ENT BELFORT BESANCON 2","index":54,"n_rows":32,"n_cols":29,"rows_kept":32,"cut":false,"hidden":false,"merged":[[23,15,23,29],[24,15,24,17],[25,15,25,17],[26,15,26,17],[1,0,2,0],[1,1,2,3],[1,9,1,13],[2,9,2,13],[5,15,6,17],[5,18,6,19],[5,22,6,22],[5,23,6,23],[5,20,5,21],[5,26,5,27],[5,24,6,24],[5,28,6,29],[7,15,8,17],[7,18,8,19],[7,22,8,22],[7,23,8,23],[0,15,0,29],[1,22,3,22],[1,23,3,23],[1,24,3,24],[1,25,3,25],[1,26,3,27],[1,28,3,29],[6,26,6,27],[7,20,7,21],[7,26,7,27],[7,24,8,24],[7,28,7,29],[8,28,8,29],[8,20,8,21],[8,26,8,27],[6,20,6,21],[9,15,10,17],[9,18,10,19],[9,22,10,22],[9,23,10,23],[10,20,10,21],[9,20,9,21],[9,26,9,27],[9,24,10,24],[9,25,10,25],[9,28,9,29],[10,28,10,29],[10,26,10,27],[11,15,14,17],[11,18,11,19],[11,22,14,22],[11,23,14,23],[12,18,14,19],[12,20,12,21],[13,20,13,21],[14,20,14,21],[11,20,11,21],[11,26,11,27],[11,24,14,24],[11,25,14,25],[11,28,11,29],[12,26,12,27],[12,28,12,29],[13,26,13,27],[13,28,13,29],[14,26,14,27],[14,28,14,29],[16,15,18,17],[16,18,18,21],[22,15,22,17],[15,15,15,29],[19,15,21,17],[19,18,21,21],[22,18,22,21],[30,15,30,17],[31,15,31,17],[29,0,29,4],[26,0,26,4],[27,0,27,4],[27,15,27,17],[28,0,28,4],[29,15,29,17],[28,15,28,29]]}
["ENT BELFORT BESANCON 2",null,null,null,null,null,null,null,null,null,null,null,null,null,null,"Saison 2023-2024"]
[null,"Joueur(es) participant à la rencontre",null,null,null,null,null,null,null,"Saisir votre liste complète en MAJUSCULES ",null,null,null,null,null,null,null,null,null,null,null,null,"Carte Verte","Carte Jaune","Carte Rose","Carte Bleue","5,0 Val",null,"Non Sélectionnables en EDF (hors Fidet)"]
[null,null,null,null,null,null,null,null,null,"Joueurs(es) qualifié(es) saison 2023 -2024",null,null,null,null,null,null,null,null,"Avec une date de validité"]
[]
["Statuts","Classif.","          Noms      /    Prénoms",null,"Numéros","ET","VALID","",null,"Statuts","Classif.","          Noms      /    Prénoms",null,"Numéros"]
[null,null,null,null,null,{"$f":"IF(A6=\"ET\",1,\"\")","v":""},{"$f":"IF(B6=5,1,\"\")","v":""},"",null,null,null,null,null,4,null,"Elite Nationale Bastide Médical",null,null,14.5,null,"Maxi 17,5 pts",null,"+  1 ","+  2","+  1,5",null,"1 sur la feuille",null,"Pas de limite"]
[null,null,null,null,null,{"$f":"IF(A7=\"ET\",1,\"\")","v":""},{"$f":"IF(B7=5,1,\"\")","v":""},null,null,null,null,null,null,5,null,null,null,null,null,null,"si cartes de couleurs",null,null,null,null,null,"et terrain"]
[null,null,null,null,null,{"$f":"IF(A8=\"ET\",1,\"\")","v":""},"","",null,null,null,null,null,6,null," Nationale 1",null,null,14.5,null,"Maxi 17,5 pts",null,"+  1 ,5","+  2,5","+  1,5",null,"1 sur la feuille",null,"4  Maxi / terrain     "]
[null,null,null,null,null,"","",null,null,null,null,null,null,7,null,null,null,null,null,null,"si cartes de couleurs",null,null,null,null,null,"et terrain",null," (5 sur la feuille)"]
[null,null,null,null,null,"","","",null,null,null,null,null,8,null," Nationale 2",null,null,15,null,"Maxi 19 pts",null,"+  1,5","+  2,5","+  1,5","+  0,5","2 sur la feuille",null,"4  Maxi / terrain     "]
[null,null,null,null,null,"","","",null,null,null,null,null,9,null,null,null,null,null,null,"si cartes de couleurs",null,null,null,null,null,"2 sur le terrain",null," (5 sur la feuille)"]
[null,null,null,null,null,"","","",null,null,null,null,null,10,null," Nationale 3",null,null,15.5,null,null,null,"+  1,5","+  2,5","+  1,5","+  0,5"]
[null,null,null,null,null,"","","",null,null,null,null,null,11,null,null,null,null,"Si 16pts début match-handicap de 10pts",null,"Maxi 19 pts",null,null,null,null,null,"2 sur la feuille",null,"4 Maxi / terrain"]
[null,null,null,null,null,"","","",null,null,null,null,null,12,null,null,null,null,null,null,"si cartes de couleurs",null,null,null,null,null,"2 sur le terrain",null," (5 sur la feuille)"]
[null,null,null,null,null,"","","",null,null,null,null,null,13]
[null,null,null,null,null,"","","",null,null,null,null,null,14,null,"Inscrire dans la colonne de gauche les \"Statuts\" des joueurs de l'équipe"]
[null,null,null,null,null,"","","",null,null,null,null,null,15,null,"J",null,null,"Pour les cartes Vertes",null,null,null,"Jeune joueur (U19 en Elite Nationale Bastide Médical)"]
[null,null,null,null,null,"","","",null,null,null,null,null,16,null,null,null,null,null,null,null,null,"Joueur débutant, sélectionnable en Equipe de France"]
[null,null,null,null,null,"","","",null,null,null,null,null,17,null,null,null,null,null,null,null,null,"seulement (attention à la date de validité juqu'à 22 ans révolu)"]
[null,null,null,null,null,"","",null,null,null,null,null,null,18,null,"JF",null,null,"Pour les cartes Jaunes",null,null,null,"Jeune joueuse (U19 en Elite Nationale Bastide Médical)"]
[null,null,null,null,null,"","","",null,null,null,null,null,19,null,null,null,null,null,null,null,null,"Joueuse débutante, sélectionnable en Equipe de France"]
[null,null,null,null,null,"","",null,null,null,null,null,null,20,null,null,null,null,null,null,null,null,"seulement (attention à la date de validité juqu' à 22 ans révolu)"]
[null,null,null,null,null,"","",null,null,null,null,null,null,null,null,"F ou FET",null,null,"Pour les cartes roses",null,null,null,"Pour les femmes ou femmes étrangères <5pts  (Bonus 1,5 pts)"]
[null,null,null,null,null,"","",null,null,null,null,null,null,null,null,"En Nationale 2 et 3 uniquement (joueuses et joueurs de plus de 55 ans)"]
[null,null,null,null,null,"","",null,null,null,null,null,null,null,null,"S",null,null,"Pour les hommes séniors",null,null,null," Français ou Etrangers (Bonus de 0,5pt)"]
[null,null,null,null,null,null,null,null,null,null,null,null,null,null,null,"FS",null,null,"   Pour les femmes seniors",null,null,null," (Bonus 2pts)      "]
[" Joueurs-joueuses valides de l'équipe (5 points)",null,null,null,null,null,null,null,null,null,null,null,null,null,null,"JS",null,null," Pour les jeunes hommes séniors",null,null,null," Débutants  (Bonus 2pts)  validité (<3pts 2ans)       ( > 3pts 1 an)"]
[{"$f":"IF($G$31=0,\"\",IF($G$31>2,\"Trop de valides sur le terrain\",\"OK\"))","v":""},null,null,null,null,null,null,null,null,null,null,null,null,null,null,"JFS",null,null," Pour les jeunes femmes séniors",null,null,null," Débutantes  (Bonus 3pts)  validité (<3pts 2ans)     ( > 3pts 1 an)"]
["Joueurs étrangers ",null,null,null,null,null,null,null,null,null,null,null,null,null,null,"Autres possibilités (sans Bonus)"]
[{"$f":"IF($F$31=0,\"\",IF($F$31>5,\"Trop de joueurs étrangers sur la feuille\",\"OK\"))","v":""},null,null,null,null,null,null,null,null,null,null,null,null,null,null,"ET",null,null,"Pour un joueur étranger"]
[null,null,null,null,null,{"$f":"SUM(F6:F25)","v":0},{"$f":"SUM(G6:G25)","v":0},null,null,null,null,null,null,null,null,"FID",null,null,"Pour un joueur fidèle"]
[null,null,null,null,null,null,null,null,null,null,null,null,null,null,null,"N",null,null,"Pour tous joueurs sans symbole sur la carte de classification"]

{"sheet":"ENT CHALON DIJON 3","index":55,"n_rows":32,"n_cols":29,"rows_kept":32,"cut":false,"hidden":false,"merged":[[30,15,30,17],[31,15,31,17],[14,26,14,27],[14,28,14,29],[15,15,15,29],[19,15,21,17],[19,18,21,21],[22,18,22,21],[16,15,18,17],[16,18,18,21],[14,20,14,21],[9,28,9,29],[10,28,10,29],[11,15,14,17],[11,18,11,19],[11,22,14,22],[11,23,14,23],[11,24,14,24],[11,25,14,25],[11,28,11,29],[12,18,14,19],[12,20,12,21],[12,26,12,27],[12,28,12,29],[13,20,13,21],[13,26,13,27],[13,28,13,29],[5,28,6,29],[7,15,8,17],[7,18,8,19],[7,22,8,22],[7,23,8,23],[7,24,8,24],[7,28,7,29],[8,28,8,29],[0,15,0,29],[1,22,3,22],[1,23,3,23],[1,24,3,24],[1,25,3,25],[1,26,3,27],[1,28,3,29],[1,0,2,0],[1,1,2,3],[1,9,1,13],[29,0,29,4],[22,15,22,17],[26,0,26,4],[27,0,27,4],[27,15,27,17],[29,15,29,17],[28,0,28,4],[23,15,23,29],[24,15,24,17],[25,15,25,17],[26,15,26,17],[28,15,28,29],[9,26,9,27],[11,26,11,27],[9,15,10,17],[9,18,10,19],[6,26,6,27],[5,15,6,17],[5,18,6,19],[5,22,6,22],[5,23,6,23],[5,24,6,24],[9,22,10,22],[9,23,10,23],[9,24,10,24],[9,25,10,25],[11,20,11,21],[8,20,8,21],[10,20,10,21],[10,26,10,27],[9,20,9,21],[8,26,8,27],[2,9,2,13],[5,20,5,21],[5,26,5,27],[7,26,7,27],[6,20,6,21],[7,20,7,21]]}
["ENT CHALON DIJON 3",null,null,null,null,null,null,null,null,null,null,null,null,null,null,"Saison 2023-2024"]
[null,"Joueur(es) participant à la rencontre",null,null,null,null,null,null,null,"Saisir votre liste complète en MAJUSCULES ",null,null,null,null,null,null,null,null,null,null,null,null,"Carte Verte","Carte Jaune","Carte Rose","Carte Bleue","5,0 Val",null,"Non Sélectionnables en EDF (hors Fidet)"]
[null,null,null,null,null,null,null,null,null,"Joueurs(es) qualifié(es) saison 2023 -2024",null,null,null,null,null,null,null,null,"Avec une date de validité"]
[]
["Statuts","Classif.","          Noms      /    Prénoms",null,"Numéros","ET","VALID","",null,"Statuts","Classif.","          Noms      /    Prénoms",null,"Numéros"]
[null,"²",null,null,null,{"$f":"IF(A6=\"ET\",1,\"\")","v":""},{"$f":"IF(B6=5,1,\"\")","v":""},"",null,"JF",3,"ERNEST AUGUSTIN","M",4,null,"Elite Nationale Bastide Médical",null,null,14.5,null,"Maxi 17,5 pts",null,"+  1 ","+  2","+  1,5",null,"1 sur la feuille",null,"Pas de limite"]
[null,null,null,null,null,{"$f":"IF(A7=\"ET\",1,\"\")","v":""},{"$f":"IF(B7=5,1,\"\")","v":""},null,null,"J",4,"LEFEVRE NIEDERER","S",5,null,null,null,null,null,null,"si cartes de couleurs",null,null,null,null,null,"et terrain"]
[null,null,null,null,null,{"$f":"IF(A8=\"ET\",1,\"\")","v":""},"","",null,"J",1.5,"BOUDIER","V",6,null," Nationale 1",null,null,14.5,null,"Maxi 17,5 pts",null,"+  1 ,5","+  2,5","+  1,5",null,"1 sur la feuille",null,"4  Maxi / terrain     "]
[null,null,null,null,null,"","",null,null,"J",4.5,"VOIRIN","N",7,null,null,null,null,null,null,"si cartes de couleurs",null,null,null,null,null,"et terrain",null," (5 sur la feuille)"]
[null,null,null,null,null,"","","",null,null,null,null,null,8,null," Nationale 2",null,null,15,null,"Maxi 19 pts",null,"+  1,5","+  2,5","+  1,5","+  0,5","2 sur la feuille",null,"4  Maxi / terrain     "]
[null,null,null,null,null,"","","",null,"N",5,"REYMOND","S",9,null,null,null,null,null,null,"si cartes de couleurs",null,null,null,null,null,"2 sur le terrain",null," (5 sur la feuille)"]
[null,null,null,null,null,"","","",null,"F",1.5,"HILT","I",10,null," Nationale 3",null,null,15.5,null,null,null,"+  1,5","+  2,5","+  1,5","+  0,5"]
[null,null,null,null,null,"","","",null,"N",1,"BAUER","A",11,null,null,null,null,"Si 16pts début match-handicap de 10pts",null,"Maxi 19 pts",null,null,null,null,null,"2 sur la feuille",null,"4 Maxi / terrain"]
[null,null,null,null,null,"","","",null,null,null,null,null,12,null,null,null,null,null,null,"si cartes de couleurs",null,null,null,null,null,"2 sur le terrain",null," (5 sur la feuille)"]
[null,null,null,null,null,"","","",null,"N",5,"LORDEL","B",13]
[null,null,null,null,null,"","","",null,null,null,null,null,14,null,"Inscrire dans la colonne de gauche les \"Statuts\" des joueurs de l'équipe"]
[null,null,null,null,null,"","","",null,null,null,null,null,15,null,"J",null,null,"Pour les cartes Vertes",null,null,null,"Jeune joueur (U19 en Elite Nationale Bastide Médical)"]
[null,null,null,null,null,"","","",null,null,null,null,null,16,null,null,null,null,null,null,null,null,"Joueur débutant, sélectionnable en Equipe de France"]
[null,null,null,null,null,"","","",null,null,null,null,null,17,null,null,null,null,null,null,null,null,"seulement (attention à la date de validité juqu'à 22 ans révolu)"]
[null,null,null,null,null,"","",null,null,null,null,null,null,18,null,"JF",null,null,"Pour les cartes Jaunes",null,null,null,"Jeune joueuse (U19 en Elite Nationale Bastide Médical)"]
[null,null,null,null,null,"","","",null,null,null,null,null,19,null,null,null,null,null,null,null,null,"Joueuse débutante, sélectionnable en Equipe de France"]
[null,null,null,null,null,"","",null,null,null,null,null,null,20,null,null,null,null,null,null,null,null,"seulement (attention à la date de validité juqu' à 22 ans révolu)"]
[null,null,null,null,null,"","",null,null,"F",2,"NOLET","L",28,null,"F ou FET",null,null,"Pour les cartes roses",null,null,null,"Pour les femmes ou femmes étrangères <5pts  (Bonus 1,5 pts)"]
[null,null,null,null,null,"","",null,null,null,null,null,null,null,null,"En Nationale 2 et 3 uniquement (joueuses et joueurs de plus de 55 ans)"]
[null,null,null,null,null,"","",null,null,null,null,null,null,null,null,"S",null,null,"Pour les hommes séniors",null,null,null," Français ou Etrangers (Bonus de 0,5pt)"]
[null,null,null,null,null,null,null,null,null,null,null,null,null,null,null,"FS",null,null,"   Pour les femmes seniors",null,null,null," (Bonus 2pts)      "]
[" Joueurs-joueuses valides de l'équipe (5 points)",null,null,null,null,null,null,null,null,null,null,null,null,null,null,"JS",null,null," Pour les jeunes hommes séniors",null,null,null," Débutants  (Bonus 2pts)  validité (<3pts 2ans)       ( > 3pts 1 an)"]
[{"$f":"IF($G$31=0,\"\",IF($G$31>2,\"Trop de valides sur le terrain\",\"OK\"))","v":""},null,null,null,null,null,null,null,null,null,null,null,null,null,null,"JFS",null,null," Pour les jeunes femmes séniors",null,null,null," Débutantes  (Bonus 3pts)  validité (<3pts 2ans)     ( > 3pts 1 an)"]
["Joueurs étrangers ",null,null,null,null,null,null,null,null,null,null,null,null,null,null,"Autres possibilités (sans Bonus)"]
[{"$f":"IF($F$31=0,\"\",IF($F$31>5,\"Trop de joueurs étrangers sur la feuille\",\"OK\"))","v":""},null,null,null,null,null,null,null,null,null,null,null,null,null,null,"ET",null,null,"Pour un joueur étranger"]
[null,null,null,null,null,{"$f":"SUM(F6:F25)","v":0},{"$f":"SUM(G6:G25)","v":0},null,null,null,null,null,null,null,null,"FID",null,null,"Pour un joueur fidèle"]
[null,null,null,null,null,null,null,null,null,null,null,null,null,null,null,"N",null,null,"Pour tous joueurs sans symbole sur la carte de classification"]

{"sheet":"JARNY","index":56,"n_rows":32,"n_cols":29,"rows_kept":32,"cut":false,"hidden":false,"merged":[[30,15,30,17],[31,15,31,17],[14,26,14,27],[14,28,14,29],[15,15,15,29],[19,15,21,17],[19,18,21,21],[22,18,22,21],[16,15,18,17],[16,18,18,21],[14,20,14,21],[9,28,9,29],[10,28,10,29],[11,15,14,17],[11,18,11,19],[11,22,14,22],[11,23,14,23],[11,24,14,24],[11,25,14,25],[11,28,11,29],[12,18,14,19],[12,20,12,21],[12,26,12,27],[12,28,12,29],[13,20,13,21],[13,26,13,27],[13,28,13,29],[5,28,6,29],[7,15,8,17],[7,18,8,19],[7,22,8,22],[7,23,8,23],[7,24,8,24],[7,28,7,29],[8,28,8,29],[0,15,0,29],[1,22,3,22],[1,23,3,23],[1,24,3,24],[1,25,3,25],[1,26,3,27],[1,28,3,29],[1,0,2,0],[1,1,2,3],[1,9,1,13],[29,0,29,4],[22,15,22,17],[26,0,26,4],[27,0,27,4],[27,15,27,17],[29,15,29,17],[28,0,28,4],[23,15,23,29],[24,15,24,17],[25,15,25,17],[26,15,26,17],[28,15,28,29],[9,26,9,27],[11,26,11,27],[9,15,10,17],[9,18,10,19],[6,26,6,27],[5,15,6,17],[5,18,6,19],[5,22,6,22],[5,23,6,23],[5,24,6,24],[9,22,10,22],[9,23,10,23],[9,24,10,24],[9,25,10,25],[11,20,11,21],[8,20,8,21],[10,20,10,21],[10,26,10,27],[9,20,9,21],[8,26,8,27],[2,9,2,13],[5,20,5,21],[5,26,5,27],[7,26,7,27],[6,20,6,21],[7,20,7,21]]}
["JARNY",null,null,null,null,null,null,null,null,null,null,null,null,null,null,"Saison 2023-2024"]
[null,"Joueur(es) participant à la rencontre",null,null,null,null,null,null,null,"Saisir votre liste complète en MAJUSCULES ",null,null,null,null,null,null,null,null,null,null,null,null,"Carte Verte","Carte Jaune","Carte Rose","Carte Bleue","5,0 Val",null,"Non Sélectionnables en EDF (hors Fidet)"]
[null,null,null,null,null,null,null,null,null,"Joueurs(es) qualifié(es) saison 2023 -2024",null,null,null,null,null,null,null,null,"Avec une date de validité"]
[]
["Statuts","Classif.","          Noms      /    Prénoms",null,"Numéros","ET","VALID","",null,"Statuts","Classif.","          Noms      /    Prénoms",null,"Numéros"]
[null,null,null,null,null,{"$f":"IF(A6=\"ET\",1,\"\")","v":""},{"$f":"IF(B6=5,1,\"\")","v":""},"",null,"J",4,"MULLER","M",4,null,"Elite Nationale Bastide Médical",null,null,14.5,null,"Maxi 17,5 pts",null,"+  1 ","+  2","+  1,5",null,"1 sur la feuille",null,"Pas de limite"]
[null,null,null,null,null,{"$f":"IF(A7=\"ET\",1,\"\")","v":""},{"$f":"IF(B7=5,1,\"\")","v":""},null,null,null,null,null,null,5,null,null,null,null,null,null,"si cartes de couleurs",null,null,null,null,null,"et terrain"]
[null,null,null,null,null,{"$f":"IF(A8=\"ET\",1,\"\")","v":""},"","",null,"N",5,"ALBERTINI","J",6,null," Nationale 1",null,null,14.5,null,"Maxi 17,5 pts",null,"+  1 ,5","+  2,5","+  1,5",null,"1 sur la feuille",null,"4  Maxi / terrain     "]
[null,null,null,null,null,"","",null,null,null,null,null,null,7,null,null,null,null,null,null,"si cartes de couleurs",null,null,null,null,null,"et terrain",null," (5 sur la feuille)"]
[null,null,null,null,null,"","","",null,"N",1,"BALDIN","L",8,null," Nationale 2",null,null,15,null,"Maxi 19 pts",null,"+  1,5","+  2,5","+  1,5","+  0,5","2 sur la feuille",null,"4  Maxi / terrain     "]
[null,null,null,null,null,"","","",null,null,2.5,"MAACHE","K",9,null,null,null,null,null,null,"si cartes de couleurs",null,null,null,null,null,"2 sur le terrain",null," (5 sur la feuille)"]
[null,null,null,null,null,"","","",null,"S",2.5,"LOUIS","R",10,null," Nationale 3",null,null,15.5,null,null,null,"+  1,5","+  2,5","+  1,5","+  0,5"]
[null,null,null,null,null,"","","",null,null,null,null,null,11,null,null,null,null,"Si 16pts début match-handicap de 10pts",null,"Maxi 19 pts",null,null,null,null,null,"2 sur la feuille",null,"4 Maxi / terrain"]
[null,null,null,null,null,"","","",null,"N",1,"FERRI","G",12,null,null,null,null,null,null,"si cartes de couleurs",null,null,null,null,null,"2 sur le terrain",null," (5 sur la feuille)"]
[null,null,null,null,null,"","","",null,"N",5,"LOUIS","J",13]
[null,null,null,null,null,"","","",null,null,null,null,null,14,null,"Inscrire dans la colonne de gauche les \"Statuts\" des joueurs de l'équipe"]
[null,null,null,null,null,"","","",null,null,null,null,null,15,null,"J",null,null,"Pour les cartes Vertes",null,null,null,"Jeune joueur (U19 en Elite Nationale Bastide Médical)"]
[null,null,null,null,null,"","","",null,null,null,null,null,16,null,null,null,null,null,null,null,null,"Joueur débutant, sélectionnable en Equipe de France"]
[null,null,null,null,null,"","","",null,null,null,null,null,17,null,null,null,null,null,null,null,null,"seulement (attention à la date de validité juqu'à 22 ans révolu)"]
[null,null,null,null,null,"","",null,null,null,null,null,null,18,null,"JF",null,null,"Pour les cartes Jaunes",null,null,null,"Jeune joueuse (U19 en Elite Nationale Bastide Médical)"]
[null,null,null,null,null,"","","",null,null,null,null,null,19,null,null,null,null,null,null,null,null,"Joueuse débutante, sélectionnable en Equipe de France"]
[null,null,null,null,null,"","",null,null,null,null,null,null,20,null,null,null,null,null,null,null,null,"seulement (attention à la date de validité juqu' à 22 ans révolu)"]
[null,null,null,null,null,"","",null,null,null,null,null,null,null,null,"F ou FET",null,null,"Pour les cartes roses",null,null,null,"Pour les femmes ou femmes étrangères <5pts  (Bonus 1,5 pts)"]
[null,null,null,null,null,"","",null,null,null,null,null,null,null,null,"En Nationale 2 et 3 uniquement (joueuses et joueurs de plus de 55 ans)"]
[null,null,null,null,null,"","",null,null,null,null,null,null,null,null,"S",null,null,"Pour les hommes séniors",null,null,null," Français ou Etrangers (Bonus de 0,5pt)"]
[null,null,null,null,null,null,null,null,null,null,null,null,null,null,null,"FS",null,null,"   Pour les femmes seniors",null,null,null," (Bonus 2pts)      "]
[" Joueurs-joueuses valides de l'équipe (5 points)",null,null,null,null,null,null,null,null,null,null,null,null,null,null,"JS",null,null," Pour les jeunes hommes séniors",null,null,null," Débutants  (Bonus 2pts)  validité (<3pts 2ans)       ( > 3pts 1 an)"]
[{"$f":"IF($G$31=0,\"\",IF($G$31>2,\"Trop de valides sur le terrain\",\"OK\"))","v":""},null,null,null,null,null,null,null,null,null,null,null,null,null,null,"JFS",null,null," Pour les jeunes femmes séniors",null,null,null," Débutantes  (Bonus 3pts)  validité (<3pts 2ans)     ( > 3pts 1 an)"]
["Joueurs étrangers ",null,null,null,null,null,null,null,null,null,null,null,null,null,null,"Autres possibilités (sans Bonus)"]
[{"$f":"IF($F$31=0,\"\",IF($F$31>5,\"Trop de joueurs étrangers sur la feuille\",\"OK\"))","v":""},null,null,null,null,null,null,null,null,null,null,null,null,null,null,"ET",null,null,"Pour un joueur étranger"]
[null,null,null,null,null,{"$f":"SUM(F6:F25)","v":0},{"$f":"SUM(G6:G25)","v":0},null,null,null,null,null,null,null,null,"FID",null,null,"Pour un joueur fidèle"]
[null,null,null,null,null,null,null,null,null,null,null,null,null,null,null,"N",null,null,"Pour tous joueurs sans symbole sur la carte de classification"]

{"sheet":"MULHOUSE","index":57,"n_rows":32,"n_cols":29,"rows_kept":32,"cut":false,"hidden":false,"merged":[[30,15,30,17],[31,15,31,17],[14,26,14,27],[14,28,14,29],[15,15,15,29],[19,15,21,17],[19,18,21,21],[22,18,22,21],[16,15,18,17],[16,18,18,21],[14,20,14,21],[9,28,9,29],[10,28,10,29],[11,15,14,17],[11,18,11,19],[11,22,14,22],[11,23,14,23],[11,24,14,24],[11,25,14,25],[11,28,11,29],[12,18,14,19],[12,20,12,21],[12,26,12,27],[12,28,12,29],[13,20,13,21],[13,26,13,27],[13,28,13,29],[5,28,6,29],[7,15,8,17],[7,18,8,19],[7,22,8,22],[7,23,8,23],[7,24,8,24],[7,28,7,29],[8,28,8,29],[0,15,0,29],[1,22,3,22],[1,23,3,23],[1,24,3,24],[1,25,3,25],[1,26,3,27],[1,28,3,29],[1,0,2,0],[1,1,2,3],[1,9,1,13],[29,0,29,4],[22,15,22,17],[26,0,26,4],[27,0,27,4],[27,15,27,17],[29,15,29,17],[28,0,28,4],[23,15,23,29],[24,15,24,17],[25,15,25,17],[26,15,26,17],[28,15,28,29],[9,26,9,27],[11,26,11,27],[9,15,10,17],[9,18,10,19],[6,26,6,27],[5,15,6,17],[5,18,6,19],[5,22,6,22],[5,23,6,23],[5,24,6,24],[9,22,10,22],[9,23,10,23],[9,24,10,24],[9,25,10,25],[11,20,11,21],[8,20,8,21],[10,20,10,21],[10,26,10,27],[9,20,9,21],[8,26,8,27],[2,9,2,13],[5,20,5,21],[5,26,5,27],[7,26,7,27],[6,20,6,21],[7,20,7,21]]}
["MULHOUSE",null,null,null,null,null,null,null,null,null,null,null,null,null,null,"Saison 2023-2024"]
[null,"Joueur(es) participant à la rencontre",null,null,null,null,null,null,null,"Saisir votre liste complète en MAJUSCULES ",null,null,null,null,null,null,null,null,null,null,null,null,"Carte Verte","Carte Jaune","Carte Rose","Carte Bleue","5,0 Val",null,"Non Sélectionnables en EDF (hors Fidet)"]
[null,null,null,null,null,null,null,null,null,"Joueurs(es) qualifié(es) saison 2023 -2024",null,null,null,null,null,null,null,null,"Avec une date de validité"]
[]
["Statuts","Classif.","          Noms      /    Prénoms",null,"Numéros","ET","VALID","",null,"Statuts","Classif.","          Noms      /    Prénoms",null,"Numéros"]
[null,null,null,null,null,{"$f":"IF(A6=\"ET\",1,\"\")","v":""},{"$f":"IF(B6=5,1,\"\")","v":""},"",null,null,null,null,null,4,null,"Elite Nationale Bastide Médical",null,null,14.5,null,"Maxi 17,5 pts",null,"+  1 ","+  2","+  1,5",null,"1 sur la feuille",null,"Pas de limite"]
[null,null,null,null,null,{"$f":"IF(A7=\"ET\",1,\"\")","v":""},{"$f":"IF(B7=5,1,\"\")","v":""},null,null,"N",2,"LAKEL","M",5,null,null,null,null,null,null,"si cartes de couleurs",null,null,null,null,null,"et terrain"]
[null,null,null,null,null,{"$f":"IF(A8=\"ET\",1,\"\")","v":""},"","",null,null,null,null,null,6,null," Nationale 1",null,null,14.5,null,"Maxi 17,5 pts",null,"+  1 ,5","+  2,5","+  1,5",null,"1 sur la feuille",null,"4  Maxi / terrain     "]
[null,null,null,null,null,"","",null,null,"S",1.5,"MEYER","A",7,null,null,null,null,null,null,"si cartes de couleurs",null,null,null,null,null,"et terrain",null," (5 sur la feuille)"]
[null,null,null,null,null,"","","",null,"N",1,"DJENEDI","R",8,null," Nationale 2",null,null,15,null,"Maxi 19 pts",null,"+  1,5","+  2,5","+  1,5","+  0,5","2 sur la feuille",null,"4  Maxi / terrain     "]
[null,null,null,null,null,"","","",null,null,null,null,null,9,null,null,null,null,null,null,"si cartes de couleurs",null,null,null,null,null,"2 sur le terrain",null," (5 sur la feuille)"]
[null,null,null,null,null,"","","",null,"N",2.5,"BERNARD","C",10,null," Nationale 3",null,null,15.5,null,null,null,"+  1,5","+  2,5","+  1,5","+  0,5"]
[null,null,null,null,null,"","","",null,null,null,null,null,11,null,null,null,null,"Si 16pts début match-handicap de 10pts",null,"Maxi 19 pts",null,null,null,null,null,"2 sur la feuille",null,"4 Maxi / terrain"]
[null,null,null,null,null,"","","",null,null,null,null,null,12,null,null,null,null,null,null,"si cartes de couleurs",null,null,null,null,null,"2 sur le terrain",null," (5 sur la feuille)"]
[null,null,null,null,null,"","","",null,"N",4,"DAVID","M",13]
[null,null,null,null,null,"","","",null,null,null,null,null,14,null,"Inscrire dans la colonne de gauche les \"Statuts\" des joueurs de l'équipe"]
[null,null,null,null,null,"","","",null,"ET",4,"AKRIM",4,15,null,"J",null,null,"Pour les cartes Vertes",null,null,null,"Jeune joueur (U19 en Elite Nationale Bastide Médical)"]
[null,null,null,null,null,"","","",null,"S",3.5,"FERNANDES","A",16,null,null,null,null,null,null,null,null,"Joueur débutant, sélectionnable en Equipe de France"]
[null,null,null,null,null,"","","",null,null,null,null,null,17,null,null,null,null,null,null,null,null,"seulement (attention à la date de validité juqu'à 22 ans révolu)"]
[null,null,null,null,null,"","",null,null,null,null,null,null,18,null,"JF",null,null,"Pour les cartes Jaunes",null,null,null,"Jeune joueuse (U19 en Elite Nationale Bastide Médical)"]
[null,null,null,null,null,"","","",null,"N",5,"DJENEDI","A",19,null,null,null,null,null,null,null,null,"Joueuse débutante, sélectionnable en Equipe de France"]
[null,null,null,null,null,"","",null,null,"S",4.5,"IMBROGIANO","V",20,null,null,null,null,null,null,null,null,"seulement (attention à la date de validité juqu' à 22 ans révolu)"]
[null,null,null,null,null,"","",null,null,null,null,null,null,null,null,"F ou FET",null,null,"Pour les cartes roses",null,null,null,"Pour les femmes ou femmes étrangères <5pts  (Bonus 1,5 pts)"]
[null,null,null,null,null,"","",null,null,null,null,null,null,null,null,"En Nationale 2 et 3 uniquement (joueuses et joueurs de plus de 55 ans)"]
[null,null,null,null,null,"","",null,null,null,null,null,null,null,null,"S",null,null,"Pour les hommes séniors",null,null,null," Français ou Etrangers (Bonus de 0,5pt)"]
[null,null,null,null,null,null,null,null,null,null,null,null,null,null,null,"FS",null,null,"   Pour les femmes seniors",null,null,null," (Bonus 2pts)      "]
[" Joueurs-joueuses valides de l'équipe (5 points)",null,null,null,null,null,null,null,null,null,null,null,null,null,null,"JS",null,null," Pour les jeunes hommes séniors",null,null,null," Débutants  (Bonus 2pts)  validité (<3pts 2ans)       ( > 3pts 1 an)"]
[{"$f":"IF($G$31=0,\"\",IF($G$31>2,\"Trop de valides sur le terrain\",\"OK\"))","v":""},null,null,null,null,null,null,null,null,null,null,null,null,null,null,"JFS",null,null," Pour les jeunes femmes séniors",null,null,null," Débutantes  (Bonus 3pts)  validité (<3pts 2ans)     ( > 3pts 1 an)"]
["Joueurs étrangers ",null,null,null,null,null,null,null,null,null,null,null,null,null,null,"Autres possibilités (sans Bonus)"]
[{"$f":"IF($F$31=0,\"\",IF($F$31>5,\"Trop de joueurs étrangers sur la feuille\",\"OK\"))","v":""},null,null,null,null,null,null,null,null,null,null,null,null,null,null,"ET",null,null,"Pour un joueur étranger"]
[null,null,null,null,null,{"$f":"SUM(F6:F25)","v":0},{"$f":"SUM(G6:G25)","v":0},null,null,null,null,null,null,null,null,"FID",null,null,"Pour un joueur fidèle"]
[null,null,null,null,null,null,null,null,null,null,null,null,null,null,null,"N",null,null,"Pour tous joueurs sans symbole sur la carte de classification"]

{"sheet":"STRASBOURG 2","index":58,"n_rows":32,"n_cols":29,"rows_kept":32,"cut":false,"hidden":false,"merged":[[30,15,30,17],[31,15,31,17],[14,26,14,27],[14,28,14,29],[15,15,15,29],[19,15,21,17],[19,18,21,21],[22,18,22,21],[16,15,18,17],[16,18,18,21],[14,20,14,21],[9,28,9,29],[10,28,10,29],[11,15,14,17],[11,18,11,19],[11,22,14,22],[11,23,14,23],[11,24,14,24],[11,25,14,25],[11,28,11,29],[12,18,14,19],[12,20,12,21],[12,26,12,27],[12,28,12,29],[13,20,13,21],[13,26,13,27],[13,28,13,29],[5,28,6,29],[7,15,8,17],[7,18,8,19],[7,22,8,22],[7,23,8,23],[7,24,8,24],[7,28,7,29],[8,28,8,29],[0,15,0,29],[1,22,3,22],[1,23,3,23],[1,24,3,24],[1,25,3,25],[1,26,3,27],[1,28,3,29],[1,0,2,0],[1,1,2,3],[1,9,1,13],[29,0,29,4],[22,15,22,17],[26,0,26,4],[27,0,27,4],[27,15,27,17],[29,15,29,17],[28,0,28,4],[23,15,23,29],[24,15,24,17],[25,15,25,17],[26,15,26,17],[28,15,28,29],[9,26,9,27],[11,26,11,27],[9,15,10,17],[9,18,10,19],[6,26,6,27],[5,15,6,17],[5,18,6,19],[5,22,6,22],[5,23,6,23],[5,24,6,24],[9,22,10,22],[9,23,10,23],[9,24,10,24],[9,25,10,25],[11,20,11,21],[8,20,8,21],[10,20,10,21],[10,26,10,27],[9,20,9,21],[8,26,8,27],[2,9,2,13],[5,20,5,21],[5,26,5,27],[7,26,7,27],[6,20,6,21],[7,20,7,21]]}
["STRASBOURG 2",null,null,null,null,null,null,null,null,null,null,null,null,null,null,"Saison 2023-2024"]
[null,"Joueur(es) participant à la rencontre",null,null,null,null,null,null,null,"Saisir votre liste complète en MAJUSCULES ",null,null,null,null,null,null,null,null,null,null,null,null,"Carte Verte","Carte Jaune","Carte Rose","Carte Bleue","5,0 Val",null,"Non Sélectionnables en EDF (hors Fidet)"]
[null,null,null,null,null,null,null,null,null,"Joueurs(es) qualifié(es) saison 2023 -2024",null,null,null,null,null,null,null,null,"Avec une date de validité"]
[]
["Statuts","Classif.","          Noms      /    Prénoms",null,"Numéros","ET","VALID","",null,"Statuts","Classif.","          Noms      /    Prénoms",null,"Numéros"]
[null,null,null,null,null,{"$f":"IF(A6=\"ET\",1,\"\")","v":""},{"$f":"IF(B6=5,1,\"\")","v":""},"",null,"ET",2,"AFITI","M",4,null,"Elite Nationale Bastide Médical",null,null,14.5,null,"Maxi 17,5 pts",null,"+  1 ","+  2","+  1,5",null,"1 sur la feuille",null,"Pas de limite"]
[null,null,null,null,null,{"$f":"IF(A7=\"ET\",1,\"\")","v":""},{"$f":"IF(B7=5,1,\"\")","v":""},null,null,null,null,null,null,5,null,null,null,null,null,null,"si cartes de couleurs",null,null,null,null,null,"et terrain"]
[null,null,null,null,null,{"$f":"IF(A8=\"ET\",1,\"\")","v":""},"","",null,"N",1.5,"NOVAS","M",6,null," Nationale 1",null,null,14.5,null,"Maxi 17,5 pts",null,"+  1 ,5","+  2,5","+  1,5",null,"1 sur la feuille",null,"4  Maxi / terrain     "]
[null,null,null,null,null,"","",null,null,"N",2,"JACOB","J",7,null,null,null,null,null,null,"si cartes de couleurs",null,null,null,null,null,"et terrain",null," (5 sur la feuille)"]
[null,null,null,null,null,"","","",null,"N",4.5,"KRAFT","R",8,null," Nationale 2",null,null,15,null,"Maxi 19 pts",null,"+  1,5","+  2,5","+  1,5","+  0,5","2 sur la feuille",null,"4  Maxi / terrain     "]
[null,null,null,null,null,"","","",null,"N",2.5,"DA SILVA","F",9,null,null,null,null,null,null,"si cartes de couleurs",null,null,null,null,null,"2 sur le terrain",null," (5 sur la feuille)"]
[null,null,null,null,null,"","","",null,"F",3,"MAURER","J",10,null," Nationale 3",null,null,15.5,null,null,null,"+  1,5","+  2,5","+  1,5","+  0,5"]
[null,null,null,null,null,"","","",null,null,null,null,null,11,null,null,null,null,"Si 16pts début match-handicap de 10pts",null,"Maxi 19 pts",null,null,null,null,null,"2 sur la feuille",null,"4 Maxi / terrain"]
[null,null,null,null,null,"","","",null,"N",1.5,"ERBS","JF",12,null,null,null,null,null,null,"si cartes de couleurs",null,null,null,null,null,"2 sur le terrain",null," (5 sur la feuille)"]
[null,null,null,null,null,"","","",null,"ET",3.5,"OGUNBONA","H",13]
[null,null,null,null,null,"","","",null,"F",4.5,"FLAMENT","A",14,null,"Inscrire dans la colonne de gauche les \"Statuts\" des joueurs de l'équipe"]
[null,null,null,null,null,"","","",null,null,null,null,null,15,null,"J",null,null,"Pour les cartes Vertes",null,null,null,"Jeune joueur (U19 en Elite Nationale Bastide Médical)"]
[null,null,null,null,null,"","","",null,null,null,null,null,16,null,null,null,null,null,null,null,null,"Joueur débutant, sélectionnable en Equipe de France"]
[null,null,null,null,null,"","","",null,null,null,null,null,17,null,null,null,null,null,null,null,null,"seulement (attention à la date de validité juqu'à 22 ans révolu)"]
[null,null,null,null,null,"","",null,null,"N",2.5,"DUCHENE","F",18,null,"JF",null,null,"Pour les cartes Jaunes",null,null,null,"Jeune joueuse (U19 en Elite Nationale Bastide Médical)"]
[null,null,null,null,null,"","","",null,null,null,null,null,19,null,null,null,null,null,null,null,null,"Joueuse débutante, sélectionnable en Equipe de France"]
[null,null,null,null,null,"","",null,null,null,null,null,null,20,null,null,null,null,null,null,null,null,"seulement (attention à la date de validité juqu' à 22 ans révolu)"]
[null,null,null,null,null,"","",null,null,null,null,null,null,null,null,"F ou FET",null,null,"Pour les cartes roses",null,null,null,"Pour les femmes ou femmes étrangères <5pts  (Bonus 1,5 pts)"]
[null,null,null,null,null,"","",null,null,null,null,null,null,null,null,"En Nationale 2 et 3 uniquement (joueuses et joueurs de plus de 55 ans)"]
[null,null,null,null,null,"","",null,null,null,null,null,null,null,null,"S",null,null,"Pour les hommes séniors",null,null,null," Français ou Etrangers (Bonus de 0,5pt)"]
[null,null,null,null,null,null,null,null,null,null,null,null,null,null,null,"FS",null,null,"   Pour les femmes seniors",null,null,null," (Bonus 2pts)      "]
[" Joueurs-joueuses valides de l'équipe (5 points)",null,null,null,null,null,null,null,null,null,null,null,null,null,null,"JS",null,null," Pour les jeunes hommes séniors",null,null,null," Débutants  (Bonus 2pts)  validité (<3pts 2ans)       ( > 3pts 1 an)"]
[{"$f":"IF($G$31=0,\"\",IF($G$31>2,\"Trop de valides sur le terrain\",\"OK\"))","v":""},null,null,null,null,null,null,null,null,null,null,null,null,null,null,"JFS",null,null," Pour les jeunes femmes séniors",null,null,null," Débutantes  (Bonus 3pts)  validité (<3pts 2ans)     ( > 3pts 1 an)"]
["Joueurs étrangers ",null,null,null,null,null,null,null,null,null,null,null,null,null,null,"Autres possibilités (sans Bonus)"]
[{"$f":"IF($F$31=0,\"\",IF($F$31>5,\"Trop de joueurs étrangers sur la feuille\",\"OK\"))","v":""},null,null,null,null,null,null,null,null,null,null,null,null,null,null,"ET",null,null,"Pour un joueur étranger"]
[null,null,null,null,null,{"$f":"SUM(F6:F25)","v":0},{"$f":"SUM(G6:G25)","v":0},null,null,null,null,null,null,null,null,"FID",null,null,"Pour un joueur fidèle"]
[null,null,null,null,null,null,null,null,null,null,null,null,null,null,null,"N",null,null,"Pour tous joueurs sans symbole sur la carte de classification"]

{"sheet":"THIONVILLE","index":59,"n_rows":32,"n_cols":29,"rows_kept":32,"cut":false,"hidden":false,"merged":[[30,15,30,17],[31,15,31,17],[14,26,14,27],[14,28,14,29],[15,15,15,29],[19,15,21,17],[19,18,21,21],[22,18,22,21],[16,15,18,17],[16,18,18,21],[14,20,14,21],[9,28,9,29],[10,28,10,29],[11,15,14,17],[11,18,11,19],[11,22,14,22],[11,23,14,23],[11,24,14,24],[11,25,14,25],[11,28,11,29],[12,18,14,19],[12,20,12,21],[12,26,12,27],[12,28,12,29],[13,20,13,21],[13,26,13,27],[13,28,13,29],[5,28,6,29],[7,15,8,17],[7,18,8,19],[7,22,8,22],[7,23,8,23],[7,24,8,24],[7,28,7,29],[8,28,8,29],[0,15,0,29],[1,22,3,22],[1,23,3,23],[1,24,3,24],[1,25,3,25],[1,26,3,27],[1,28,3,29],[1,0,2,0],[1,1,2,3],[1,9,1,13],[29,0,29,4],[22,15,22,17],[26,0,26,4],[27,0,27,4],[27,15,27,17],[29,15,29,17],[28,0,28,4],[23,15,23,29],[24,15,24,17],[25,15,25,17],[26,15,26,17],[28,15,28,29],[9,26,9,27],[11,26,11,27],[9,15,10,17],[9,18,10,19],[6,26,6,27],[5,15,6,17],[5,18,6,19],[5,22,6,22],[5,23,6,23],[5,24,6,24],[9,22,10,22],[9,23,10,23],[9,24,10,24],[9,25,10,25],[11,20,11,21],[8,20,8,21],[10,20,10,21],[10,26,10,27],[9,20,9,21],[8,26,8,27],[2,9,2,13],[5,20,5,21],[5,26,5,27],[7,26,7,27],[6,20,6,21],[7,20,7,21]]}
["THIONVILLE",null,null,null,null,null,null,null,null,null,null,null,null,null,null,"Saison 2023-2024"]
[null,"Joueur(es) participant à la rencontre",null,null,null,null,null,null,null,"Saisir votre liste complète en MAJUSCULES ",null,null,null,null,null,null,null,null,null,null,null,null,"Carte Verte","Carte Jaune","Carte Rose","Carte Bleue","5,0 Val",null,"Non Sélectionnables en EDF (hors Fidet)"]
[null,null,null,null,null,null,null,null,null,"Joueurs(es) qualifié(es) saison 2023 -2024",null,null,null,null,null,null,null,null,"Avec une date de validité"]
[]
["Statuts","Classif.","          Noms      /    Prénoms",null,"Numéros","ET","VALID","",null,"Statuts","Classif.","          Noms      /    Prénoms",null,"Numéros"]
[null,null,null,null,null,{"$f":"IF(A6=\"ET\",1,\"\")","v":""},{"$f":"IF(B6=5,1,\"\")","v":""},"",null,"J",4.5,"HAMEN","J",0,null,"Elite Nationale Bastide Médical",null,null,14.5,null,"Maxi 17,5 pts",null,"+  1 ","+  2","+  1,5",null,"1 sur la feuille",null,"Pas de limite"]
[null,null,null,null,null,{"$f":"IF(A7=\"ET\",1,\"\")","v":""},{"$f":"IF(B7=5,1,\"\")","v":""},null,null,"N",5,"LEFAY","G",4,null,null,null,null,null,null,"si cartes de couleurs",null,null,null,null,null,"et terrain"]
[null,null,null,null,null,{"$f":"IF(A8=\"ET\",1,\"\")","v":""},"","",null,"J",3.5,"KOLOSA","J",6,null," Nationale 1",null,null,14.5,null,"Maxi 17,5 pts",null,"+  1 ,5","+  2,5","+  1,5",null,"1 sur la feuille",null,"4  Maxi / terrain     "]
[null,null,null,null,null,"","",null,null,"N",1.5,"LEFAY","S",7,null,null,null,null,null,null,"si cartes de couleurs",null,null,null,null,null,"et terrain",null," (5 sur la feuille)"]
[null,null,null,null,null,"","","",null,null,null,null,null,8,null," Nationale 2",null,null,15,null,"Maxi 19 pts",null,"+  1,5","+  2,5","+  1,5","+  0,5","2 sur la feuille",null,"4  Maxi / terrain     "]
[null,null,null,null,null,"","","",null,"ET",3,"BAUDOUIN","E",9,null,null,null,null,null,null,"si cartes de couleurs",null,null,null,null,null,"2 sur le terrain",null," (5 sur la feuille)"]
[null,null,null,null,null,"","","",null,"N",2.5,"COUGOUILLE","V",10,null," Nationale 3",null,null,15.5,null,null,null,"+  1,5","+  2,5","+  1,5","+  0,5"]
[null,null,null,null,null,"","","",null,null,null,null,null,11,null,null,null,null,"Si 16pts début match-handicap de 10pts",null,"Maxi 19 pts",null,null,null,null,null,"2 sur la feuille",null,"4 Maxi / terrain"]
[null,null,null,null,null,"","","",null,"J",4,"BERTRAND","V",12,null,null,null,null,null,null,"si cartes de couleurs",null,null,null,null,null,"2 sur le terrain",null," (5 sur la feuille)"]
[null,null,null,null,null,"","","",null,"N",1,"GHOUNIME","Y",13]
[null,null,null,null,null,"","","",null,null,null,null,null,14,null,"Inscrire dans la colonne de gauche les \"Statuts\" des joueurs de l'équipe"]
[null,null,null,null,null,"","","",null,"N",5,"JOCHUM","MS",15,null,"J",null,null,"Pour les cartes Vertes",null,null,null,"Jeune joueur (U19 en Elite Nationale Bastide Médical)"]
[null,null,null,null,null,"","","",null,null,null,null,null,16,null,null,null,null,null,null,null,null,"Joueur débutant, sélectionnable en Equipe de France"]
[null,null,null,null,null,"","","",null,"J",3,"THIRY","K",17,null,null,null,null,null,null,null,null,"seulement (attention à la date de validité juqu'à 22 ans révolu)"]
[null,null,null,null,null,"","",null,null,null,null,null,null,18,null,"JF",null,null,"Pour les cartes Jaunes",null,null,null,"Jeune joueuse (U19 en Elite Nationale Bastide Médical)"]
[null,null,null,null,null,"","","",null,null,null,null,null,19,null,null,null,null,null,null,null,null,"Joueuse débutante, sélectionnable en Equipe de France"]
[null,null,null,null,null,"","",null,null,null,null,null,null,20,null,null,null,null,null,null,null,null,"seulement (attention à la date de validité juqu' à 22 ans révolu)"]
[null,null,null,null,null,"","",null,null,null,null,null,null,null,null,"F ou FET",null,null,"Pour les cartes roses",null,null,null,"Pour les femmes ou femmes étrangères <5pts  (Bonus 1,5 pts)"]
[null,null,null,null,null,"","",null,null,null,null,null,null,null,null,"En Nationale 2 et 3 uniquement (joueuses et joueurs de plus de 55 ans)"]
[null,null,null,null,null,null,null,null,null,null,null,null,null,null,null,"S",null,null,"Pour les hommes séniors",null,null,null," Français ou Etrangers (Bonus de 0,5pt)"]
[null,null,null,null,null,null,null,null,null,null,null,null,null,null,null,"FS",null,null,"   Pour les femmes seniors",null,null,null," (Bonus 2pts)      "]
[" Joueurs-joueuses valides de l'équipe (5 points)",null,null,null,null,null,null,null,null,null,null,null,null,null,null,"JS",null,null," Pour les jeunes hommes séniors",null,null,null," Débutants  (Bonus 2pts)  validité (<3pts 2ans)       ( > 3pts 1 an)"]
[{"$f":"IF(G31=0,\"\",IF(G31>2,\"Trop de valides sur la feuille\",\"OK\"))","v":""},null,null,null,null,null,null,null,null,null,null,null,null,null,null,"JFS",null,null," Pour les jeunes femmes séniors",null,null,null," Débutantes  (Bonus 3pts)  validité (<3pts 2ans)     ( > 3pts 1 an)"]
["Joueurs étrangers ",null,null,null,null,null,null,null,null,null,null,null,null,null,null,"Autres possibilités (sans Bonus)"]
[{"$f":"IF(F31=0,\"\",IF(F31>5,\"Trop de joueurs étrangers sur la feuille\",\"OK\"))","v":""},null,null,null,null,null,null,null,null,null,null,null,null,null,null,"ET",null,null,"Pour un joueur étranger"]
[null,null,null,null,null,{"$f":"SUM(F6:F30)","v":0},{"$f":"SUM(G6:G30)","v":0},null,null,null,null,null,null,null,null,"FID",null,null,"Pour un joueur fidèle"]
[null,null,null,null,null,null,null,null,null,null,null,null,null,null,null,"N",null,null,"Pour tous joueurs sans symbole sur la carte de classification"]

{"sheet":"TROYES","index":60,"n_rows":32,"n_cols":29,"rows_kept":32,"cut":false,"hidden":false,"merged":[[30,15,30,17],[31,15,31,17],[14,20,14,21],[14,26,14,27],[14,28,14,29],[15,15,15,29],[19,15,21,17],[19,18,21,21],[9,28,9,29],[10,28,10,29],[11,15,14,17],[11,18,11,19],[11,22,14,22],[11,23,14,23],[11,24,14,24],[11,25,14,25],[11,28,11,29],[12,18,14,19],[12,20,12,21],[12,26,12,27],[12,28,12,29],[13,20,13,21],[13,26,13,27],[13,28,13,29],[5,28,6,29],[6,20,6,21],[6,26,6,27],[7,18,8,19],[7,22,8,22],[7,23,8,23],[7,24,8,24],[7,28,7,29],[8,28,8,29],[7,26,7,27],[7,20,7,21],[8,20,8,21],[8,26,8,27],[1,0,2,0],[1,1,2,3],[1,9,1,13],[28,0,28,4],[7,15,8,17],[9,15,10,17],[23,15,23,29],[24,15,24,17],[25,15,25,17],[26,15,26,17],[28,15,28,29],[22,18,22,21],[10,20,10,21],[10,26,10,27],[11,20,11,21],[11,26,11,27],[29,0,29,4],[22,15,22,17],[26,0,26,4],[27,0,27,4],[27,15,27,17],[29,15,29,17],[0,15,0,29],[1,22,3,22],[1,23,3,23],[9,18,10,19],[9,22,10,22],[9,23,10,23],[9,24,10,24],[9,25,10,25],[9,20,9,21],[1,24,3,24],[1,25,3,25],[1,26,3,27],[1,28,3,29],[5,15,6,17],[5,18,6,19],[5,22,6,22],[9,26,9,27],[16,15,18,17],[16,18,18,21],[2,9,2,13],[5,26,5,27],[5,20,5,21],[5,23,6,23],[5,24,6,24]]}
["TROYES",null,null,null,null,null,null,null,null,null,null,null,null,null,null,"Saison 2023-2024"]
[null,"Joueur(es) participant à la rencontre",null,null,null,null,null,null,null,"Saisir votre liste complète en MAJUSCULES ",null,null,null,null,null,null,null,null,null,null,null,null,"Carte Verte","Carte Jaune","Carte Rose","Carte Bleue","5,0 Val",null,"Non Sélectionnables en EDF (hors Fidet)"]
[null,null,null,null,null,null,null,null,null,"Joueurs(es) qualifié(es) saison 2023 -2024",null,null,null,null,null,null,null,null,"Avec une date de validité"]
[]
["Statuts","Classif.","          Noms      /    Prénoms",null,"Numéros","ET","VALIDE",null,null,"Statuts","Classif.","          Noms      /    Prénoms",null,"Numéros"]
[null,null,null,null,null,{"$f":"IF(A6=\"ET\",1,\"\")","v":""},{"$f":"IF(B6=5,1,\"\")","v":""},null,null,null,null,null,null,4,null,"Elite Nationale Bastide Médical",null,null,14.5,null,"Maxi 17,5 pts",null,"+  1 ","+  2","+  1,5",null,"1 sur la feuille",null,"Pas de limite"]
[null,null,null,null,null,{"$f":"IF(A7=\"ET\",1,\"\")","v":""},{"$f":"IF(B7=5,1,\"\")","v":""},null,null,"N",2,"FAULIN","R",5,null,null,null,null,null,null,"si cartes de couleurs",null,null,null,null,null,"et terrain"]
[null,null,null,null,null,{"$f":"IF(A8=\"ET\",1,\"\")","v":""},{"$f":"IF(B8=5,1,\"\")","v":""},null,null,"N",4.5,"MARMOUZE","K",6,null," Nationale 1",null,null,14.5,null,"Maxi 17,5 pts",null,"+  1 ,5","+  2,5","+  1,5",null,"1 sur la feuille",null,"4  Maxi / terrain     "]
[null,null,null,null,null,"","",null,null,null,null,null,null,7,null,null,null,null,null,null,"si cartes de couleurs",null,null,null,null,null,"et terrain",null," (5 sur la feuille)"]
[null,null,null,null,null,"","",null,null,"ET",1.5,"MRIMI","A",8,null," Nationale 2",null,null,15,null,"Maxi 19 pts",null,"+  1,5","+  2,5","+  1,5","+  0,5","2 sur la feuille",null,"4  Maxi / terrain     "]
[null,null,null,null,null,"","",null,null,"N",5,"LEBOEUF","A",9,null,null,null,null,null,null,"si cartes de couleurs",null,null,null,null,null,"2 sur le terrain",null," (5 sur la feuille)"]
[null,null,null,null,null,"","",null,null,null,null,null,null,10,null," Nationale 3",null,null,15.5,null,null,null,"+  1,5","+  2,5","+  1,5","+  0,5"]
[null,null,null,null,null,"","",null,null,"N",1.5,"ANCELIN","H",11,null,null,null,null,"Si 16pts début match-handicap de 10pts",null,"Maxi 19 pts",null,null,null,null,null,"2 sur la feuille",null,"4 Maxi / terrain"]
[null,null,null,null,null,"","",null,null,"S",4.5,"SOYER","P",12,null,null,null,null,null,null,"si cartes de couleurs",null,null,null,null,null,"2 sur le terrain",null," (5 sur la feuille)"]
[null,null,null,null,null,"","",null,null,"SF",1.5,"SOYER","E",13]
[null,null,null,null,null,"","",null,null,"J",4.5,"CHEBSON","F",14,null,"Inscrire dans la colonne de gauche les \"Statuts\" des joueurs de l'équipe"]
[null,null,null,null,null,"","","",null,"N",4,"DOYEN","JB",15,null,"J",null,null,"Pour les cartes Vertes",null,null,null,"Jeune joueur (U19 en Elite Nationale Bastide Médical)"]
[null,null,null,null,null,"","","",null,null,null,null,null,16,null,null,null,null,null,null,null,null,"Joueur débutant, sélectionnable en Equipe de France"]
[null,null,null,null,null,"","","",null,null,null,null,null,17,null,null,null,null,null,null,null,null,"seulement (attention à la date de validité juqu'à 22 ans révolu)"]
[null,null,null,null,null,"","",null,null,null,null,null,null,18,null,"JF",null,null,"Pour les cartes Jaunes",null,null,null,"Jeune joueuse (U19 en Elite Nationale Bastide Médical)"]
[null,null,null,null,null,"","","",null,null,null,null,null,19,null,null,null,null,null,null,null,null,"Joueuse débutante, sélectionnable en Equipe de France"]
[null,null,null,null,null,"","",null,null,null,null,null,null,20,null,null,null,null,null,null,null,null,"seulement (attention à la date de validité juqu' à 22 ans révolu)"]
[null,null,null,null,null,"","",null,null,null,null,null,null,null,null,"F ou FET",null,null,"Pour les cartes roses",null,null,null,"Pour les femmes ou femmes étrangères <5pts  (Bonus 1,5 pts)"]
[null,null,null,null,null,"","",null,null,null,null,null,null,null,null,"En Nationale 2 et 3 uniquement (joueuses et joueurs de plus de 55 ans)"]
[null,null,null,null,null,"","",null,null,null,null,null,null,null,null,"S",null,null,"Pour les hommes séniors",null,null,null," Français ou Etrangers (Bonus de 0,5pt)"]
[null,null,null,null,null,null,null,null,null,null,null,null,null,null,null,"FS",null,null,"   Pour les femmes seniors",null,null,null," (Bonus 2pts)      "]
[" Joueurs-joueuses valides de l'équipe (5 points)",null,null,null,null,null,null,null,null,null,null,null,null,null,null,"JS",null,null," Pour les jeunes hommes séniors",null,null,null," Débutants  (Bonus 2pts)  validité (<3pts 2ans)       ( > 3pts 1 an)"]
[{"$f":"IF(G31=0,\"\",IF(G31>2,\"Trop de valides sur la feuille\",\"OK\"))","v":""},null,null,null,null,null,null,null,null,null,null,null,null,null,null,"JFS",null,null," Pour les jeunes femmes séniors",null,null,null," Débutantes  (Bonus 3pts)  validité (<3pts 2ans)     ( > 3pts 1 an)"]
["Joueurs étrangers ",null,null,null,null,null,null,null,null,null,null,null,null,null,null,"Autres possibilités (sans Bonus)"]
[{"$f":"IF(F31=0,\"\",IF(F31>5,\"Trop de joueurs étrangers sur la feuille\",\"OK\"))","v":""},null,null,null,null,null,null,null,null,null,null,null,null,null,null,"ET",null,null,"Pour un joueur étranger"]
[null,null,null,null,null,{"$f":"SUM(F6:F28)","v":0},{"$f":"SUM(G6:G30)","v":0},null,null,null,null,null,null,null,null,"FID",null,null,"Pour un joueur fidèle"]
[null,null,null,null,null,null,null,null,null,null,null,null,null,null,null,"N",null,null,"Pour tous joueurs sans symbole sur la carte de classification"]

{"sheet":"VANDOEUVRE 2","index":61,"n_rows":32,"n_cols":29,"rows_kept":32,"cut":false,"hidden":false,"merged":[[30,15,30,17],[31,15,31,17],[14,26,14,27],[14,28,14,29],[15,15,15,29],[19,15,21,17],[19,18,21,21],[22,18,22,21],[16,15,18,17],[16,18,18,21],[14,20,14,21],[9,28,9,29],[10,28,10,29],[11,15,14,17],[11,18,11,19],[11,22,14,22],[11,23,14,23],[11,24,14,24],[11,25,14,25],[11,28,11,29],[12,18,14,19],[12,20,12,21],[12,26,12,27],[12,28,12,29],[13,20,13,21],[13,26,13,27],[13,28,13,29],[5,28,6,29],[7,15,8,17],[7,18,8,19],[7,22,8,22],[7,23,8,23],[7,24,8,24],[7,28,7,29],[8,28,8,29],[0,15,0,29],[1,22,3,22],[1,23,3,23],[1,24,3,24],[1,25,3,25],[1,26,3,27],[1,28,3,29],[1,0,2,0],[1,1,2,3],[1,9,1,13],[29,0,29,4],[22,15,22,17],[26,0,26,4],[27,0,27,4],[27,15,27,17],[29,15,29,17],[28,0,28,4],[23,15,23,29],[24,15,24,17],[25,15,25,17],[26,15,26,17],[28,15,28,29],[9,26,9,27],[11,26,11,27],[9,15,10,17],[9,18,10,19],[6,26,6,27],[5,15,6,17],[5,18,6,19],[5,22,6,22],[5,23,6,23],[5,24,6,24],[9,22,10,22],[9,23,10,23],[9,24,10,24],[9,25,10,25],[11,20,11,21],[8,20,8,21],[10,20,10,21],[10,26,10,27],[9,20,9,21],[8,26,8,27],[2,9,2,13],[5,20,5,21],[5,26,5,27],[7,26,7,27],[6,20,6,21],[7,20,7,21]]}
["VANDOEUVRE 2",null,null,null,null,null,null,null,null,null,null,null,null,null,null,"Saison 2023-2024"]
[null,"Joueur(es) participant à la rencontre",null,null,null,null,null,null,null,"Saisir votre liste complète en MAJUSCULES ",null,null,null,null,null,null,null,null,null,null,null,null,"Carte Verte","Carte Jaune","Carte Rose","Carte Bleue","5,0 Val",null,"Non Sélectionnables en EDF (hors Fidet)"]
[null,null,null,null,null,null,null,null,null,"Joueurs(es) qualifié(es) saison 2023 -2024",null,null,null,null,null,null,null,null,"Avec une date de validité"]
[]
["Statuts","Classif.","          Noms      /    Prénoms",null,"Numéros","ET","VALID","",null,"Statuts","Classif.","          Noms      /    Prénoms",null,"Numéros"]
[null,null,null,null,null,{"$f":"IF(A6=\"ET\",1,\"\")","v":""},{"$f":"IF(B6=5,1,\"\")","v":""},"",null,"N",1,"JEANDEL","T",4,null,"Elite Nationale Bastide Médical",null,null,14.5,null,"Maxi 17,5 pts",null,"+  1 ","+  2","+  1,5",null,"1 sur la feuille",null,"Pas de limite"]
[null,null,null,null,null,{"$f":"IF(A7=\"ET\",1,\"\")","v":""},{"$f":"IF(B7=5,1,\"\")","v":""},null,null,"N",5,"BAYARD","A",5,null,null,null,null,null,null,"si cartes de couleurs",null,null,null,null,null,"et terrain"]
[null,null,null,null,null,{"$f":"IF(A8=\"ET\",1,\"\")","v":""},"","",null,null,null,null,null,6,null," Nationale 1",null,null,14.5,null,"Maxi 17,5 pts",null,"+  1 ,5","+  2,5","+  1,5",null,"1 sur la feuille",null,"4  Maxi / terrain     "]
[null,null,null,null,null,"","",null,null,"N",1,"SANDERS","K",7,null,null,null,null,null,null,"si cartes de couleurs",null,null,null,null,null,"et terrain",null," (5 sur la feuille)"]
[null,null,null,null,null,"","","",null,"J",4.5,"DEMANGEOT","F",8,null," Nationale 2",null,null,15,null,"Maxi 19 pts",null,"+  1,5","+  2,5","+  1,5","+  0,5","2 sur la feuille",null,"4  Maxi / terrain     "]
[null,null,null,null,null,"","","",null,"J",2,"ZAKI","Y",9,null,null,null,null,null,null,"si cartes de couleurs",null,null,null,null,null,"2 sur le terrain",null," (5 sur la feuille)"]
[null,null,null,null,null,"","","",null,null,null,null,null,10,null," Nationale 3",null,null,15.5,null,null,null,"+  1,5","+  2,5","+  1,5","+  0,5"]
[null,null,null,null,null,"","","",null,"J",2.5,"JACQUEMIN","T",11,null,null,null,null,"Si 16pts début match-handicap de 10pts",null,"Maxi 19 pts",null,null,null,null,null,"2 sur la feuille",null,"4 Maxi / terrain"]
[null,null,null,null,null,"","","",null,"N",1,"ELOMBO LOBE","M",12,null,null,null,null,null,null,"si cartes de couleurs",null,null,null,null,null,"2 sur le terrain",null," (5 sur la feuille)"]
[null,null,null,null,null,"","","",null,"J",4,"TOMBOIS","G",13]
[null,null,null,null,null,"","","",null,"F",4.5,"CLAUSSE","C",14,null,"Inscrire dans la colonne de gauche les \"Statuts\" des joueurs de l'équipe"]
[null,null,null,null,null,"","","",null,null,null,null,null,15,null,"J",null,null,"Pour les cartes Vertes",null,null,null,"Jeune joueur (U19 en Elite Nationale Bastide Médical)"]
[null,null,null,null,null,"","","",null,null,null,null,null,16,null,null,null,null,null,null,null,null,"Joueur débutant, sélectionnable en Equipe de France"]
[null,null,null,null,null,"","","",null,null,null,null,null,17,null,null,null,null,null,null,null,null,"seulement (attention à la date de validité juqu'à 22 ans révolu)"]
[null,null,null,null,null,"","",null,null,null,null,null,null,18,null,"JF",null,null,"Pour les cartes Jaunes",null,null,null,"Jeune joueuse (U19 en Elite Nationale Bastide Médical)"]
[null,null,null,null,null,"","","",null,null,null,null,null,19,null,null,null,null,null,null,null,null,"Joueuse débutante, sélectionnable en Equipe de France"]
[null,null,null,null,null,"","",null,null,null,null,null,null,20,null,null,null,null,null,null,null,null,"seulement (attention à la date de validité juqu' à 22 ans révolu)"]
[null,null,null,null,null,"","",null,null,null,null,null,null,null,null,"F ou FET",null,null,"Pour les cartes roses",null,null,null,"Pour les femmes ou femmes étrangères <5pts  (Bonus 1,5 pts)"]
[null,null,null,null,null,"","",null,null,null,null,null,null,null,null,"En Nationale 2 et 3 uniquement (joueuses et joueurs de plus de 55 ans)"]
[null,null,null,null,null,"","",null,null,null,null,null,null,null,null,"S",null,null,"Pour les hommes séniors",null,null,null," Français ou Etrangers (Bonus de 0,5pt)"]
[null,null,null,null,null,null,null,null,null,null,null,null,null,null,null,"FS",null,null,"   Pour les femmes seniors",null,null,null," (Bonus 2pts)      "]
[" Joueurs-joueuses valides de l'équipe (5 points)",null,null,null,null,null,null,null,null,null,null,null,null,null,null,"JS",null,null," Pour les jeunes hommes séniors",null,null,null," Débutants  (Bonus 2pts)  validité (<3pts 2ans)       ( > 3pts 1 an)"]
[{"$f":"IF(G31=0,\"\",IF(G31>2,\"Trop de valides sur la feuille\",\"OK\"))","v":""},null,null,null,null,null,null,null,null,null,null,null,null,null,null,"JFS",null,null," Pour les jeunes femmes séniors",null,null,null," Débutantes  (Bonus 3pts)  validité (<3pts 2ans)     ( > 3pts 1 an)"]
["Joueurs étrangers ",null,null,null,null,null,null,null,null,null,null,null,null,null,null,"Autres possibilités (sans Bonus)"]
[{"$f":"IF(F31=0,\"\",IF(F31>5,\"Trop de joueurs étrangers sur la feuille\",\"OK\"))","v":""},null,null,null,null,null,null,null,null,null,null,null,null,null,null,"ET",null,null,"Pour un joueur étranger"]
[null,null,null,null,null,{"$f":"SUM(F6:F25)","v":0},{"$f":"SUM(G6:G25)","v":0},null,null,null,null,null,null,null,null,"FID",null,null,"Pour un joueur fidèle"]
[null,null,null,null,null,null,null,null,null,null,null,null,null,null,null,"N",null,null,"Pour tous joueurs sans symbole sur la carte de classification"]

{"sheet":"CHAMBRAY","index":62,"n_rows":32,"n_cols":29,"rows_kept":32,"cut":false,"hidden":false,"merged":[[23,15,23,29],[24,15,24,17],[25,15,25,17],[26,15,26,17],[1,0,2,0],[1,1,2,3],[1,9,1,13],[2,9,2,13],[5,15,6,17],[5,18,6,19],[5,22,6,22],[5,23,6,23],[5,20,5,21],[5,26,5,27],[5,24,6,24],[5,28,6,29],[7,15,8,17],[7,18,8,19],[7,22,8,22],[7,23,8,23],[0,15,0,29],[1,22,3,22],[1,23,3,23],[1,24,3,24],[1,25,3,25],[1,26,3,27],[1,28,3,29],[6,26,6,27],[7,20,7,21],[7,26,7,27],[7,24,8,24],[7,28,7,29],[8,28,8,29],[8,20,8,21],[8,26,8,27],[6,20,6,21],[9,15,10,17],[9,18,10,19],[9,22,10,22],[9,23,10,23],[10,20,10,21],[9,20,9,21],[9,26,9,27],[9,24,10,24],[9,25,10,25],[9,28,9,29],[10,28,10,29],[10,26,10,27],[11,15,14,17],[11,18,11,19],[11,22,14,22],[11,23,14,23],[12,18,14,19],[12,20,12,21],[13,20,13,21],[14,20,14,21],[11,20,11,21],[11,26,11,27],[11,24,14,24],[11,25,14,25],[11,28,11,29],[12,26,12,27],[12,28,12,29],[13,26,13,27],[13,28,13,29],[14,26,14,27],[14,28,14,29],[16,15,18,17],[16,18,18,21],[22,15,22,17],[15,15,15,29],[19,15,21,17],[19,18,21,21],[22,18,22,21],[30,15,30,17],[31,15,31,17],[29,0,29,4],[26,0,26,4],[27,0,27,4],[27,15,27,17],[28,0,28,4],[29,15,29,17],[28,15,28,29]]}
["CHAMBRAY",null,null,null,null,null,null,null,null,null,null,null,null,null,null,"Saison 2023-2024"]
[null,"Joueur(es) participant à la rencontre",null,null,null,null,null,null,null,"Saisir votre liste complète en MAJUSCULES ",null,null,null,null,null,null,null,null,null,null,null,null,"Carte Verte","Carte Jaune","Carte Rose","Carte Bleue","5,0 Val",null,"Non Sélectionnables en EDF (hors Fidet)"]
[null,null,null,null,null,null,null,null,null,"Joueurs(es) qualifié(es) saison 2023 -2024",null,null,null,null,null,null,null,null,"Avec une date de validité"]
[]
["Statuts","Classif.","          Noms      /    Prénoms",null,"Numéros","ET","VALID","",null,"Statuts","Classif.","          Noms      /    Prénoms",null,"Numéros"]
[null,null,null,null,null,{"$f":"IF(A6=\"ET\",1,\"\")","v":""},{"$f":"IF(B6=5,1,\"\")","v":""},"",null,"FID",2.5,"NIAMBA","G",4,null,"Elite Nationale Bastide Médical",null,null,14.5,null,"Maxi 17,5 pts",null,"+  1 ","+  2","+  1,5",null,"1 sur la feuille",null,"Pas de limite"]
[null,null,null,null,null,{"$f":"IF(A7=\"ET\",1,\"\")","v":""},{"$f":"IF(B7=5,1,\"\")","v":""},null,null,"N",2.5,"GUY","N",5,null,null,null,null,null,null,"si cartes de couleurs",null,null,null,null,null,"et terrain"]
[null,null,null,null,null,{"$f":"IF(A8=\"ET\",1,\"\")","v":""},"","",null,"ET",4,"HAMOV MAMAR","D",6,null," Nationale 1",null,null,14.5,null,"Maxi 17,5 pts",null,"+  1 ,5","+  2,5","+  1,5",null,"1 sur la feuille",null,"4  Maxi / terrain     "]
[null,null,null,null,null,"","",null,null,"N",1,"VIDAL","C",7,null,null,null,null,null,null,"si cartes de couleurs",null,null,null,null,null,"et terrain",null," (5 sur la feuille)"]
[null,null,null,null,null,"","","",null,null,null,null,null,8,null," Nationale 2",null,null,15,null,"Maxi 19 pts",null,"+  1,5","+  2,5","+  1,5","+  0,5","2 sur la feuille",null,"4  Maxi / terrain     "]
[null,null,null,null,null,"","","",null,null,null,null,null,9,null,null,null,null,null,null,"si cartes de couleurs",null,null,null,null,null,"2 sur le terrain",null," (5 sur la feuille)"]
[null,null,null,null,null,"","","",null,null,null,null,null,10,null," Nationale 3",null,null,15.5,null,null,null,"+  1,5","+  2,5","+  1,5","+  0,5"]
[null,null,null,null,null,"","","",null,"N",4.5,"LACOUT","B",11,null,null,null,null,"Si 16pts début match-handicap de 10pts",null,"Maxi 19 pts",null,null,null,null,null,"2 sur la feuille",null,"4 Maxi / terrain"]
[null,null,null,null,null,"","","",null,"N",4,"SAGLIO","B",12,null,null,null,null,null,null,"si cartes de couleurs",null,null,null,null,null,"2 sur le terrain",null," (5 sur la feuille)"]
[null,null,null,null,null,"","","",null,"N",2.5,"HEULOT","R",13]
[null,null,null,null,null,"","","",null,"N",1.5,"ALLART","C",14,null,"Inscrire dans la colonne de gauche les \"Statuts\" des joueurs de l'équipe"]
[null,null,null,null,null,"","","",null,null,null,null,null,15,null,"J",null,null,"Pour les cartes Vertes",null,null,null,"Jeune joueur (U19 en Elite Nationale Bastide Médical)"]
[null,null,null,null,null,"","","",null,null,null,null,null,16,null,null,null,null,null,null,null,null,"Joueur débutant, sélectionnable en Equipe de France"]
[null,null,null,null,null,"","","",null,null,null,null,null,17,null,null,null,null,null,null,null,null,"seulement (attention à la date de validité juqu'à 22 ans révolu)"]
[null,null,null,null,null,"","",null,null,null,null,null,null,18,null,"JF",null,null,"Pour les cartes Jaunes",null,null,null,"Jeune joueuse (U19 en Elite Nationale Bastide Médical)"]
[null,null,null,null,null,"","","",null,null,null,null,null,19,null,null,null,null,null,null,null,null,"Joueuse débutante, sélectionnable en Equipe de France"]
[null,null,null,null,null,"","",null,null,null,null,null,null,20,null,null,null,null,null,null,null,null,"seulement (attention à la date de validité juqu' à 22 ans révolu)"]
[null,null,null,null,null,"","",null,null,null,null,null,null,null,null,"F ou FET",null,null,"Pour les cartes roses",null,null,null,"Pour les femmes ou femmes étrangères <5pts  (Bonus 1,5 pts)"]
[null,null,null,null,null,"","",null,null,null,null,null,null,null,null,"En Nationale 2 et 3 uniquement (joueuses et joueurs de plus de 55 ans)"]
[null,null,null,null,null,"","",null,null,null,null,null,null,null,null,"S",null,null,"Pour les hommes séniors",null,null,null," Français ou Etrangers (Bonus de 0,5pt)"]
[null,null,null,null,null,null,null,null,null,null,null,null,null,null,null,"FS",null,null,"   Pour les femmes seniors",null,null,null," (Bonus 2pts)      "]
[" Joueurs-joueuses valides de l'équipe (5 points)",null,null,null,null,null,null,null,null,null,null,null,null,null,null,"JS",null,null," Pour les jeunes hommes séniors",null,null,null," Débutants  (Bonus 2pts)  validité (<3pts 2ans)       ( > 3pts 1 an)"]
[{"$f":"IF($G$31=0,\"\",IF($G$31>2,\"Trop de valides sur le terrain\",\"OK\"))","v":""},null,null,null,null,null,null,null,null,null,null,null,null,null,null,"JFS",null,null," Pour les jeunes femmes séniors",null,null,null," Débutantes  (Bonus 3pts)  validité (<3pts 2ans)     ( > 3pts 1 an)"]
["Joueurs étrangers ",null,null,null,null,null,null,null,null,null,null,null,null,null,null,"Autres possibilités (sans Bonus)"]
[{"$f":"IF(F31=0,\"\",IF(F31>5,\"Trop de joueurs étrangers sur la feuille\",\"OK\"))","v":""},null,null,null,null,null,null,null,null,null,null,null,null,null,null,"ET",null,null,"Pour un joueur étranger"]
[null,null,null,null,null,{"$f":"SUM(F6:F25)","v":0},{"$f":"SUM(G6:G25)","v":0},null,null,null,null,null,null,null,null,"FID",null,null,"Pour un joueur fidèle"]
[null,null,null,null,null,null,null,null,null,null,null,null,null,null,null,"N",null,null,"Pour tous joueurs sans symbole sur la carte de classification"]

{"sheet":"EQUEURDREVILLE","index":63,"n_rows":32,"n_cols":29,"rows_kept":32,"cut":false,"hidden":false,"merged":[[23,15,23,29],[24,15,24,17],[25,15,25,17],[26,15,26,17],[1,0,2,0],[1,1,2,3],[1,9,1,13],[2,9,2,13],[5,15,6,17],[5,18,6,19],[5,22,6,22],[5,23,6,23],[5,20,5,21],[5,26,5,27],[5,24,6,24],[5,28,6,29],[7,15,8,17],[7,18,8,19],[7,22,8,22],[7,23,8,23],[0,15,0,29],[1,22,3,22],[1,23,3,23],[1,24,3,24],[1,25,3,25],[1,26,3,27],[1,28,3,29],[6,26,6,27],[7,20,7,21],[7,26,7,27],[7,24,8,24],[7,28,7,29],[8,28,8,29],[8,20,8,21],[8,26,8,27],[6,20,6,21],[9,15,10,17],[9,18,10,19],[9,22,10,22],[9,23,10,23],[10,20,10,21],[9,20,9,21],[9,26,9,27],[9,24,10,24],[9,25,10,25],[9,28,9,29],[10,28,10,29],[10,26,10,27],[11,15,14,17],[11,18,11,19],[11,22,14,22],[11,23,14,23],[12,18,14,19],[12,20,12,21],[13,20,13,21],[14,20,14,21],[11,20,11,21],[11,26,11,27],[11,24,14,24],[11,25,14,25],[11,28,11,29],[12,26,12,27],[12,28,12,29],[13,26,13,27],[13,28,13,29],[14,26,14,27],[14,28,14,29],[16,15,18,17],[16,18,18,21],[22,15,22,17],[15,15,15,29],[19,15,21,17],[19,18,21,21],[22,18,22,21],[30,15,30,17],[31,15,31,17],[29,0,29,4],[26,0,26,4],[27,0,27,4],[27,15,27,17],[28,0,28,4],[29,15,29,17],[28,15,28,29]]}
["EQUEURDREVILLE",null,null,null,null,null,null,null,null,null,null,null,null,null,null,"Saison 2023-2024"]
[null,"Joueur(es) participant à la rencontre",null,null,null,null,null,null,null,"Saisir votre liste complète en MAJUSCULES ",null,null,null,null,null,null,null,null,null,null,null,null,"Carte Verte","Carte Jaune","Carte Rose","Carte Bleue","5,0 Val",null,"Non Sélectionnables en EDF (hors Fidet)"]
[null,null,null,null,null,null,null,null,null,"Joueurs(es) qualifié(es) saison 2023 -2024",null,null,null,null,null,null,null,null,"Avec une date de validité"]
[]
["Statuts","Classif.","          Noms      /    Prénoms",null,"Numéros","ET","VALID","",null,"Statuts","Classif.","          Noms      /    Prénoms",null,"Numéros"]
[null,null,null,null,null,{"$f":"IF(A6=\"ET\",1,\"\")","v":""},{"$f":"IF(B6=5,1,\"\")","v":""},"",null,"N",2,"TOLLET","CH",4,null,"Elite Nationale Bastide Médical",null,null,14.5,null,"Maxi 17,5 pts",null,"+  1 ","+  2","+  1,5",null,"1 sur la feuille",null,"Pas de limite"]
[null,null,null,null,null,{"$f":"IF(A7=\"ET\",1,\"\")","v":""},{"$f":"IF(B7=5,1,\"\")","v":""},null,null,null,null,null,null,5,null,null,null,null,null,null,"si cartes de couleurs",null,null,null,null,null,"et terrain"]
[null,null,null,null,null,{"$f":"IF(A8=\"ET\",1,\"\")","v":""},"","",null,"N",2,"CHERIFI","CH",6,null," Nationale 1",null,null,14.5,null,"Maxi 17,5 pts",null,"+  1 ,5","+  2,5","+  1,5",null,"1 sur la feuille",null,"4  Maxi / terrain     "]
[null,null,null,null,null,"","",null,null,null,null,null,null,7,null,null,null,null,null,null,"si cartes de couleurs",null,null,null,null,null,"et terrain",null," (5 sur la feuille)"]
[null,null,null,null,null,"","","",null,"ET",2.5,"TSOGOO","D",8,null," Nationale 2",null,null,15,null,"Maxi 19 pts",null,"+  1,5","+  2,5","+  1,5","+  0,5","2 sur la feuille",null,"4  Maxi / terrain     "]
[null,null,null,null,null,"","","",null,"N",2.5,"MARTIN","Q",9,null,null,null,null,null,null,"si cartes de couleurs",null,null,null,null,null,"2 sur le terrain",null," (5 sur la feuille)"]
[null,null,null,null,null,"","","",null,"N",4,"JOUANNE","J",10,null," Nationale 3",null,null,15.5,null,null,null,"+  1,5","+  2,5","+  1,5","+  0,5"]
[null,null,null,null,null,"","","",null,null,null,null,null,11,null,null,null,null,"Si 16pts début match-handicap de 10pts",null,"Maxi 19 pts",null,null,null,null,null,"2 sur la feuille",null,"4 Maxi / terrain"]
[null,null,null,null,null,"","","",null,"ET",3,"NSIMBA","M",12,null,null,null,null,null,null,"si cartes de couleurs",null,null,null,null,null,"2 sur le terrain",null," (5 sur la feuille)"]
[null,null,null,null,null,"","","",null,null,null,null,null,13]
[null,null,null,null,null,"","","",null,"N",2,"DAVIE","W",14,null,"Inscrire dans la colonne de gauche les \"Statuts\" des joueurs de l'équipe"]
[null,null,null,null,null,"","","",null,null,null,null,null,15,null,"J",null,null,"Pour les cartes Vertes",null,null,null,"Jeune joueur (U19 en Elite Nationale Bastide Médical)"]
[null,null,null,null,null,"","","",null,null,null,null,null,16,null,null,null,null,null,null,null,null,"Joueur débutant, sélectionnable en Equipe de France"]
[null,null,null,null,null,"","","",null,null,null,null,null,17,null,null,null,null,null,null,null,null,"seulement (attention à la date de validité juqu'à 22 ans révolu)"]
[null,null,null,null,null,"","",null,null,null,null,null,null,18,null,"JF",null,null,"Pour les cartes Jaunes",null,null,null,"Jeune joueuse (U19 en Elite Nationale Bastide Médical)"]
[null,null,null,null,null,"","","",null,null,null,null,null,19,null,null,null,null,null,null,null,null,"Joueuse débutante, sélectionnable en Equipe de France"]
[null,null,null,null,null,"","",null,null,null,null,null,null,20,null,null,null,null,null,null,null,null,"seulement (attention à la date de validité juqu' à 22 ans révolu)"]
[null,null,null,null,null,"","",null,null,null,null,null,null,null,null,"F ou FET",null,null,"Pour les cartes roses",null,null,null,"Pour les femmes ou femmes étrangères <5pts  (Bonus 1,5 pts)"]
[null,null,null,null,null,"","",null,null,null,null,null,null,null,null,"En Nationale 2 et 3 uniquement (joueuses et joueurs de plus de 55 ans)"]
[null,null,null,null,null,"","",null,null,null,null,null,null,null,null,"S",null,null,"Pour les hommes séniors",null,null,null," Français ou Etrangers (Bonus de 0,5pt)"]
[null,null,null,null,null,null,null,null,null,null,null,null,null,null,null,"FS",null,null,"   Pour les femmes seniors",null,null,null," (Bonus 2pts)      "]
[" Joueurs-joueuses valides de l'équipe (5 points)",null,null,null,null,null,null,null,null,null,null,null,null,null,null,"JS",null,null," Pour les jeunes hommes séniors",null,null,null," Débutants  (Bonus 2pts)  validité (<3pts 2ans)       ( > 3pts 1 an)"]
[{"$f":"IF($G$31=0,\"\",IF($G$31>2,\"Trop de valides sur le terrain\",\"OK\"))","v":""},null,null,null,null,null,null,null,null,null,null,null,null,null,null,"JFS",null,null," Pour les jeunes femmes séniors",null,null,null," Débutantes  (Bonus 3pts)  validité (<3pts 2ans)     ( > 3pts 1 an)"]
["Joueurs étrangers ",null,null,null,null,null,null,null,null,null,null,null,null,null,null,"Autres possibilités (sans Bonus)"]
[{"$f":"IF(F31=0,\"\",IF(F31>5,\"Trop de joueurs étrangers sur la feuille\",\"OK\"))","v":""},null,null,null,null,null,null,null,null,null,null,null,null,null,null,"ET",null,null,"Pour un joueur étranger"]
[null,null,null,null,null,{"$f":"SUM(F6:F30)","v":0},{"$f":"SUM(G6:G30)","v":0},null,null,null,null,null,null,null,null,"FID",null,null,"Pour un joueur fidèle"]
[null,null,null,null,null,null,null,null,null,null,null,null,null,null,null,"N",null,null,"Pour tous joueurs sans symbole sur la carte de classification"]

{"sheet":"ENT LAVAL-RENNES","index":64,"n_rows":32,"n_cols":29,"rows_kept":32,"cut":false,"hidden":false,"merged":[[23,15,23,29],[24,15,24,17],[25,15,25,17],[26,15,26,17],[1,0,2,0],[1,1,2,3],[1,9,1,13],[2,9,2,13],[5,15,6,17],[5,18,6,19],[5,22,6,22],[5,23,6,23],[5,20,5,21],[5,26,5,27],[5,24,6,24],[5,28,6,29],[7,15,8,17],[7,18,8,19],[7,22,8,22],[7,23,8,23],[0,15,0,29],[1,22,3,22],[1,23,3,23],[1,24,3,24],[1,25,3,25],[1,26,3,27],[1,28,3,29],[6,26,6,27],[7,20,7,21],[7,26,7,27],[7,24,8,24],[7,28,7,29],[8,28,8,29],[8,20,8,21],[8,26,8,27],[6,20,6,21],[9,15,10,17],[9,18,10,19],[9,22,10,22],[9,23,10,23],[10,20,10,21],[9,20,9,21],[9,26,9,27],[9,24,10,24],[9,25,10,25],[9,28,9,29],[10,28,10,29],[10,26,10,27],[11,15,14,17],[11,18,11,19],[11,22,14,22],[11,23,14,23],[12,18,14,19],[12,20,12,21],[13,20,13,21],[14,20,14,21],[11,20,11,21],[11,26,11,27],[11,24,14,24],[11,25,14,25],[11,28,11,29],[12,26,12,27],[12,28,12,29],[13,26,13,27],[13,28,13,29],[14,26,14,27],[14,28,14,29],[16,15,18,17],[16,18,18,21],[22,15,22,17],[15,15,15,29],[19,15,21,17],[19,18,21,21],[22,18,22,21],[30,15,30,17],[31,15,31,17],[29,0,29,4],[26,0,26,4],[27,0,27,4],[27,15,27,17],[28,0,28,4],[29,15,29,17],[28,15,28,29]]}
["ENT LAVAL-RENNES",null,null,null,null,null,null,null,null,null,null,null,null,null,null,"Saison 2023-2024"]
[null,"Joueur(es) participant à la rencontre",null,null,null,null,null,null,null,"Saisir votre liste complète en MAJUSCULES ",null,null,null,null,null,null,null,null,null,null,null,null,"Carte Verte","Carte Jaune","Carte Rose","Carte Bleue","5,0 Val",null,"Non Sélectionnables en EDF (hors Fidet)"]
[null,null,null,null,null,null,null,null,null,"Joueurs(es) qualifié(es) saison 2023 -2024",null,null,null,null,null,null,null,null,"Avec une date de validité"]
[]
["Statuts","Classif.","          Noms      /    Prénoms",null,"Numéros","ET","VALID","",null,"Statuts","Classif.","          Noms      /    Prénoms",null,"Numéros"]
[null,null,null,null,null,{"$f":"IF(A6=\"ET\",1,\"\")","v":""},{"$f":"IF(B6=5,1,\"\")","v":""},"",null,"SF",4.5,"GELEBART","MP",4,null,"Elite Nationale Bastide Médical",null,null,14.5,null,"Maxi 17,5 pts",null,"+  1 ","+  2","+  1,5",null,"1 sur la feuille",null,"Pas de limite"]
[null,null,null,null,null,{"$f":"IF(A7=\"ET\",1,\"\")","v":""},{"$f":"IF(B7=5,1,\"\")","v":""},null,null,"N",1,"BEGOIN","V",5,null,null,null,null,null,null,"si cartes de couleurs",null,null,null,null,null,"et terrain"]
[null,null,null,null,null,{"$f":"IF(A8=\"ET\",1,\"\")","v":""},"","",null,"F",3,"DAHUNDIA","A",6,null," Nationale 1",null,null,14.5,null,"Maxi 17,5 pts",null,"+  1 ,5","+  2,5","+  1,5",null,"1 sur la feuille",null,"4  Maxi / terrain     "]
[null,null,null,null,null,"","",null,null,"J",4.5,"LEBARBE","J",7,null,null,null,null,null,null,"si cartes de couleurs",null,null,null,null,null,"et terrain",null," (5 sur la feuille)"]
[null,null,null,null,null,"","","",null,"N",3,"DEU","T",8,null," Nationale 2",null,null,15,null,"Maxi 19 pts",null,"+  1,5","+  2,5","+  1,5","+  0,5","2 sur la feuille",null,"4  Maxi / terrain     "]
[null,null,null,null,null,"","","",null,"FID",3,"ONDUA","F",9,null,null,null,null,null,null,"si cartes de couleurs",null,null,null,null,null,"2 sur le terrain",null," (5 sur la feuille)"]
[null,null,null,null,null,"","","",null,"N",4.5,"CHEURIS","MP",10,null," Nationale 3",null,null,15.5,null,null,null,"+  1,5","+  2,5","+  1,5","+  0,5"]
[null,null,null,null,null,"","","",null,"N",4,"FIAULT","MP",11,null,null,null,null,"Si 16pts début match-handicap de 10pts",null,"Maxi 19 pts",null,null,null,null,null,"2 sur la feuille",null,"4 Maxi / terrain"]
[null,null,null,null,null,"","","",null,null,null,null,null,12,null,null,null,null,null,null,"si cartes de couleurs",null,null,null,null,null,"2 sur le terrain",null," (5 sur la feuille)"]
[null,null,null,null,null,"","","",null,"N",2.5,"BASQUIN","P",13]
[null,null,null,null,null,"","","",null,"N",1,"LEGAVE","JM",14,null,"Inscrire dans la colonne de gauche les \"Statuts\" des joueurs de l'équipe"]
[null,null,null,null,null,"","","",null,null,null,null,null,15,null,"J",null,null,"Pour les cartes Vertes",null,null,null,"Jeune joueur (U19 en Elite Nationale Bastide Médical)"]
[null,null,null,null,null,"","","",null,"N",2.5,"PIED","L",16,null,null,null,null,null,null,null,null,"Joueur débutant, sélectionnable en Equipe de France"]
[null,null,null,null,null,"","","",null,null,null,null,null,17,null,null,null,null,null,null,null,null,"seulement (attention à la date de validité juqu'à 22 ans révolu)"]
[null,null,null,null,null,"","",null,null,null,null,null,null,18,null,"JF",null,null,"Pour les cartes Jaunes",null,null,null,"Jeune joueuse (U19 en Elite Nationale Bastide Médical)"]
[null,null,null,null,null,"","","",null,null,null,null,null,19,null,null,null,null,null,null,null,null,"Joueuse débutante, sélectionnable en Equipe de France"]
[null,null,null,null,null,"","",null,null,null,null,null,null,20,null,null,null,null,null,null,null,null,"seulement (attention à la date de validité juqu' à 22 ans révolu)"]
[null,null,null,null,null,"","",null,null,null,null,null,null,null,null,"F ou FET",null,null,"Pour les cartes roses",null,null,null,"Pour les femmes ou femmes étrangères <5pts  (Bonus 1,5 pts)"]
[null,null,null,null,null,"","",null,null,null,null,null,null,null,null,"En Nationale 2 et 3 uniquement (joueuses et joueurs de plus de 55 ans)"]
[null,null,null,null,null,"","",null,null,null,null,null,null,null,null,"S",null,null,"Pour les hommes séniors",null,null,null," Français ou Etrangers (Bonus de 0,5pt)"]
[null,null,null,null,null,null,null,null,null,null,null,null,null,null,null,"FS",null,null,"   Pour les femmes seniors",null,null,null," (Bonus 2pts)      "]
[" Joueurs-joueuses valides de l'équipe (5 points)",null,null,null,null,null,null,null,null,null,null,null,null,null,null,"JS",null,null," Pour les jeunes hommes séniors",null,null,null," Débutants  (Bonus 2pts)  validité (<3pts 2ans)       ( > 3pts 1 an)"]
[{"$f":"IF($G$31=0,\"\",IF($G$31>2,\"Trop de valides sur le terrain\",\"OK\"))","v":""},null,null,null,null,null,null,null,null,null,null,null,null,null,null,"JFS",null,null," Pour les jeunes femmes séniors",null,null,null," Débutantes  (Bonus 3pts)  validité (<3pts 2ans)     ( > 3pts 1 an)"]
["Joueurs étrangers ",null,null,null,null,null,null,null,null,null,null,null,null,null,null,"Autres possibilités (sans Bonus)"]
[{"$f":"IF(F31=0,\"\",IF(F31>5,\"Trop de joueurs étrangers sur la feuille\",\"OK\"))","v":""},null,null,null,null,null,null,null,null,null,null,null,null,null,null,"ET",null,null,"Pour un joueur étranger"]
[null,null,null,null,null,{"$f":"SUM(F6:F25)","v":0},{"$f":"SUM(G6:G25)","v":0},null,null,null,null,null,null,null,null,"FID",null,null,"Pour un joueur fidèle"]
[null,null,null,null,null,null,null,null,null,null,null,null,null,null,null,"N",null,null,"Pour tous joueurs sans symbole sur la carte de classification"]

{"sheet":"QUIMPER","index":65,"n_rows":32,"n_cols":29,"rows_kept":32,"cut":false,"hidden":false,"merged":[[23,15,23,29],[24,15,24,17],[25,15,25,17],[26,15,26,17],[1,0,2,0],[1,1,2,3],[1,9,1,13],[2,9,2,13],[5,15,6,17],[5,18,6,19],[5,22,6,22],[5,23,6,23],[5,20,5,21],[5,26,5,27],[5,24,6,24],[5,28,6,29],[7,15,8,17],[7,18,8,19],[7,22,8,22],[7,23,8,23],[0,15,0,29],[1,22,3,22],[1,23,3,23],[1,24,3,24],[1,25,3,25],[1,26,3,27],[1,28,3,29],[6,26,6,27],[7,20,7,21],[7,26,7,27],[7,24,8,24],[7,28,7,29],[8,28,8,29],[8,20,8,21],[8,26,8,27],[6,20,6,21],[9,15,10,17],[9,18,10,19],[9,22,10,22],[9,23,10,23],[10,20,10,21],[9,20,9,21],[9,26,9,27],[9,24,10,24],[9,25,10,25],[9,28,9,29],[10,28,10,29],[10,26,10,27],[11,15,14,17],[11,18,11,19],[11,22,14,22],[11,23,14,23],[12,18,14,19],[12,20,12,21],[13,20,13,21],[14,20,14,21],[11,20,11,21],[11,26,11,27],[11,24,14,24],[11,25,14,25],[11,28,11,29],[12,26,12,27],[12,28,12,29],[13,26,13,27],[13,28,13,29],[14,26,14,27],[14,28,14,29],[16,15,18,17],[16,18,18,21],[22,15,22,17],[15,15,15,29],[19,15,21,17],[19,18,21,21],[22,18,22,21],[30,15,30,17],[31,15,31,17],[29,0,29,4],[26,0,26,4],[27,0,27,4],[27,15,27,17],[28,0,28,4],[29,15,29,17],[28,15,28,29]]}
["QUIMPER",null,null,null,null,null,null,null,null,null,null,null,null,null,null,"Saison 2023-2024"]
[null,"Joueur(es) participant à la rencontre",null,null,null,null,null,null,null,"Saisir votre liste complète en MAJUSCULES ",null,null,null,null,null,null,null,null,null,null,null,null,"Carte Verte","Carte Jaune","Carte Rose","Carte Bleue","5,0 Val",null,"Non Sélectionnables en EDF (hors Fidet)"]
[null,null,null,null,null,null,null,null,null,"Joueurs(es) qualifié(es) saison 2023 -2024",null,null,null,null,null,null,null,null,"Avec une date de validité"]
[]
["Statuts","Classif.","          Noms      /    Prénoms",null,"Numéros","ET","VALID","",null,"Statuts","Classif.","          Noms      /    Prénoms",null,"Numéros"]
[null,null,null,null,null,{"$f":"IF(A6=\"ET\",1,\"\")","v":""},{"$f":"IF(B6=5,1,\"\")","v":""},"",null,null,null,null,null,4,null,"Elite Nationale Bastide Médical",null,null,14.5,null,"Maxi 17,5 pts",null,"+  1 ","+  2","+  1,5",null,"1 sur la feuille",null,"Pas de limite"]
[null,null,null,null,null,{"$f":"IF(A7=\"ET\",1,\"\")","v":""},{"$f":"IF(B7=5,1,\"\")","v":""},null,null,null,null,null,null,5,null,null,null,null,null,null,"si cartes de couleurs",null,null,null,null,null,"et terrain"]
[null,null,null,null,null,{"$f":"IF(A8=\"ET\",1,\"\")","v":""},"","",null,null,null,null,null,6,null," Nationale 1",null,null,14.5,null,"Maxi 17,5 pts",null,"+  1 ,5","+  2,5","+  1,5",null,"1 sur la feuille",null,"4  Maxi / terrain     "]
[null,null,null,null,null,"","",null,null,null,null,null,null,7,null,null,null,null,null,null,"si cartes de couleurs",null,null,null,null,null,"et terrain",null," (5 sur la feuille)"]
[null,null,null,null,null,"","","",null,"N",1,"GUILLARD","M",8,null," Nationale 2",null,null,15,null,"Maxi 19 pts",null,"+  1,5","+  2,5","+  1,5","+  0,5","2 sur la feuille",null,"4  Maxi / terrain     "]
[null,null,null,null,null,"","","",null,null,null,null,null,9,null,null,null,null,null,null,"si cartes de couleurs",null,null,null,null,null,"2 sur le terrain",null," (5 sur la feuille)"]
[null,null,null,null,null,"","","",null,"S",4,"LARHANT","H",10,null," Nationale 3",null,null,15.5,null,null,null,"+  1,5","+  2,5","+  1,5","+  0,5"]
[null,null,null,null,null,"","","",null,null,null,null,null,11,null,null,null,null,"Si 16pts début match-handicap de 10pts",null,"Maxi 19 pts",null,null,null,null,null,"2 sur la feuille",null,"4 Maxi / terrain"]
[null,null,null,null,null,"","","",null,"S",1.5,"MARTIN","H",12,null,null,null,null,null,null,"si cartes de couleurs",null,null,null,null,null,"2 sur le terrain",null," (5 sur la feuille)"]
[null,null,null,null,null,"","","",null,"JF",4.5,"CLAVAUD","N",13]
[null,null,null,null,null,"","","",null,null,null,null,null,14,null,"Inscrire dans la colonne de gauche les \"Statuts\" des joueurs de l'équipe"]
[null,null,null,null,null,"","","",null,null,null,null,null,15,null,"J",null,null,"Pour les cartes Vertes",null,null,null,"Jeune joueur (U19 en Elite Nationale Bastide Médical)"]
[null,null,null,null,null,"","","",null,"F",4.5,"LE DEON","F",20,null,null,null,null,null,null,null,null,"Joueur débutant, sélectionnable en Equipe de France"]
[null,null,null,null,null,"","","",null,"N",1,null,"JY",21,null,null,null,null,null,null,null,null,"seulement (attention à la date de validité juqu'à 22 ans révolu)"]
[null,null,null,null,null,"","",null,null,"N",1,"BARGUILLE","R",23,null,"JF",null,null,"Pour les cartes Jaunes",null,null,null,"Jeune joueuse (U19 en Elite Nationale Bastide Médical)"]
[null,null,null,null,null,"","","",null,null,null,null,null,25,null,null,null,null,null,null,null,null,"Joueuse débutante, sélectionnable en Equipe de France"]
[null,null,null,null,null,"","",null,null,"N",5,"LE SAUSSE","E",77,null,null,null,null,null,null,null,null,"seulement (attention à la date de validité juqu' à 22 ans révolu)"]
[null,null,null,null,null,"","",null,null,null,null,null,null,null,null,"F ou FET",null,null,"Pour les cartes roses",null,null,null,"Pour les femmes ou femmes étrangères <5pts  (Bonus 1,5 pts)"]
[null,null,null,null,null,"","",null,null,null,null,null,null,null,null,"En Nationale 2 et 3 uniquement (joueuses et joueurs de plus de 55 ans)"]
[null,null,null,null,null,"","",null,null,null,null,null,null,null,null,"S",null,null,"Pour les hommes séniors",null,null,null," Français ou Etrangers (Bonus de 0,5pt)"]
[null,null,null,null,null,null,null,null,null,null,null,null,null,null,null,"FS",null,null,"   Pour les femmes seniors",null,null,null," (Bonus 2pts)      "]
[" Joueurs-joueuses valides de l'équipe (5 points)",null,null,null,null,null,null,null,null,null,null,null,null,null,null,"JS",null,null," Pour les jeunes hommes séniors",null,null,null," Débutants  (Bonus 2pts)  validité (<3pts 2ans)       ( > 3pts 1 an)"]
[{"$f":"IF($G$31=0,\"\",IF($G$31>2,\"Trop de valides sur le terrain\",\"OK\"))","v":""},null,null,null,null,null,null,null,null,null,null,null,null,null,null,"JFS",null,null," Pour les jeunes femmes séniors",null,null,null," Débutantes  (Bonus 3pts)  validité (<3pts 2ans)     ( > 3pts 1 an)"]
["Joueurs étrangers ",null,null,null,null,null,null,null,null,null,null,null,null,null,null,"Autres possibilités (sans Bonus)"]
[{"$f":"IF(F31=0,\"\",IF(F31>5,\"Trop de joueurs étrangers sur la feuille\",\"OK\"))","v":""},null,null,null,null,null,null,null,null,null,null,null,null,null,null,"ET",null,null,"Pour un joueur étranger"]
[null,null,null,null,null,{"$f":"SUM(F6:F30)","v":0},{"$f":"SUM(G6:G30)","v":0},null,null,null,null,null,null,null,null,"FID",null,null,"Pour un joueur fidèle"]
[null,null,null,null,null,null,null,null,null,null,null,null,null,null,null,"N",null,null,"Pour tous joueurs sans symbole sur la carte de classification"]

{"sheet":"SAINT HERBLAIN 2","index":66,"n_rows":32,"n_cols":29,"rows_kept":32,"cut":false,"hidden":false,"merged":[[23,15,23,29],[24,15,24,17],[25,15,25,17],[26,15,26,17],[1,0,2,0],[1,1,2,3],[1,9,1,13],[2,9,2,13],[5,15,6,17],[5,18,6,19],[5,22,6,22],[5,23,6,23],[5,20,5,21],[5,26,5,27],[5,24,6,24],[5,28,6,29],[7,15,8,17],[7,18,8,19],[7,22,8,22],[7,23,8,23],[0,15,0,29],[1,22,3,22],[1,23,3,23],[1,24,3,24],[1,25,3,25],[1,26,3,27],[1,28,3,29],[6,26,6,27],[7,20,7,21],[7,26,7,27],[7,24,8,24],[7,28,7,29],[8,28,8,29],[8,20,8,21],[8,26,8,27],[6,20,6,21],[9,15,10,17],[9,18,10,19],[9,22,10,22],[9,23,10,23],[10,20,10,21],[9,20,9,21],[9,26,9,27],[9,24,10,24],[9,25,10,25],[9,28,9,29],[10,28,10,29],[10,26,10,27],[11,15,14,17],[11,18,11,19],[11,22,14,22],[11,23,14,23],[12,18,14,19],[12,20,12,21],[13,20,13,21],[14,20,14,21],[11,20,11,21],[11,26,11,27],[11,24,14,24],[11,25,14,25],[11,28,11,29],[12,26,12,27],[12,28,12,29],[13,26,13,27],[13,28,13,29],[14,26,14,27],[14,28,14,29],[16,15,18,17],[16,18,18,21],[22,15,22,17],[15,15,15,29],[19,15,21,17],[19,18,21,21],[22,18,22,21],[30,15,30,17],[31,15,31,17],[29,0,29,4],[26,0,26,4],[27,0,27,4],[27,15,27,17],[28,0,28,4],[29,15,29,17],[28,15,28,29]]}
["SAINT HERBLAIN 2",null,null,null,null,null,null,null,null,null,null,null,null,null,null,"Saison 2023-2024"]
[null,"Joueur(es) participant à la rencontre",null,null,null,null,null,null,null,"Saisir votre liste complète en MAJUSCULES ",null,null,null,null,null,null,null,null,null,null,null,null,"Carte Verte","Carte Jaune","Carte Rose","Carte Bleue","5,0 Val",null,"Non Sélectionnables en EDF (hors Fidet)"]
[null,null,null,null,null,null,null,null,null,"Joueurs(es) qualifié(es) saison 2023 -2024",null,null,null,null,null,null,null,null,"Avec une date de validité"]
[]
["Statuts","Classif.","          Noms      /    Prénoms",null,"Numéros","ET","VALID","",null,"Statuts","Classif.","          Noms      /    Prénoms",null,"Numéros"]
[null,null,null,null,null,{"$f":"IF(A6=\"ET\",1,\"\")","v":""},{"$f":"IF(B6=5,1,\"\")","v":""},"",null,"S",1,"GEMARD","D",4,null,"Elite Nationale Bastide Médical",null,null,14.5,null,"Maxi 17,5 pts",null,"+  1 ","+  2","+  1,5",null,"1 sur la feuille",null,"Pas de limite"]
[null,null,null,null,null,{"$f":"IF(A7=\"ET\",1,\"\")","v":""},{"$f":"IF(B7=5,1,\"\")","v":""},null,null,null,null,null,null,5,null,null,null,null,null,null,"si cartes de couleurs",null,null,null,null,null,"et terrain"]
[null,null,null,null,null,{"$f":"IF(A8=\"ET\",1,\"\")","v":""},"","",null,null,null,null,null,6,null," Nationale 1",null,null,14.5,null,"Maxi 17,5 pts",null,"+  1 ,5","+  2,5","+  1,5",null,"1 sur la feuille",null,"4  Maxi / terrain     "]
[null,null,null,null,null,"","",null,null,null,null,null,null,7,null,null,null,null,null,null,"si cartes de couleurs",null,null,null,null,null,"et terrain",null," (5 sur la feuille)"]
[null,null,null,null,null,"","","",null,"N",3,"ROBIN","B",8,null," Nationale 2",null,null,15,null,"Maxi 19 pts",null,"+  1,5","+  2,5","+  1,5","+  0,5","2 sur la feuille",null,"4  Maxi / terrain     "]
[null,null,null,null,null,"","","",null,"N",1,"GIBERT","L",9,null,null,null,null,null,null,"si cartes de couleurs",null,null,null,null,null,"2 sur le terrain",null," (5 sur la feuille)"]
[null,null,null,null,null,"","","",null,null,null,null,null,10,null," Nationale 3",null,null,15.5,null,null,null,"+  1,5","+  2,5","+  1,5","+  0,5"]
[null,null,null,null,null,"","","",null,"N",5,"FALLOV","E",11,null,null,null,null,"Si 16pts début match-handicap de 10pts",null,"Maxi 19 pts",null,null,null,null,null,"2 sur la feuille",null,"4 Maxi / terrain"]
[null,null,null,null,null,"","","",null,"N",4,"ROUAT","M",12,null,null,null,null,null,null,"si cartes de couleurs",null,null,null,null,null,"2 sur le terrain",null," (5 sur la feuille)"]
[null,null,null,null,null,"","","",null,"N",1,"TURPIN","J",13]
[null,null,null,null,null,"","","",null,"N",1,"PASCHAU","JP",14,null,"Inscrire dans la colonne de gauche les \"Statuts\" des joueurs de l'équipe"]
[null,null,null,null,null,"","","",null,"N",4,"DOUET","Y",15,null,"J",null,null,"Pour les cartes Vertes",null,null,null,"Jeune joueur (U19 en Elite Nationale Bastide Médical)"]
[null,null,null,null,null,"","","",null,null,null,null,null,16,null,null,null,null,null,null,null,null,"Joueur débutant, sélectionnable en Equipe de France"]
[null,null,null,null,null,"","","",null,"N",4.5,"JOSSO","J",17,null,null,null,null,null,null,null,null,"seulement (attention à la date de validité juqu'à 22 ans révolu)"]
[null,null,null,null,null,"","",null,null,null,null,null,null,18,null,"JF",null,null,"Pour les cartes Jaunes",null,null,null,"Jeune joueuse (U19 en Elite Nationale Bastide Médical)"]
[null,null,null,null,null,"","","",null,null,null,null,null,19,null,null,null,null,null,null,null,null,"Joueuse débutante, sélectionnable en Equipe de France"]
[null,null,null,null,null,"","",null,null,null,null,null,null,20,null,null,null,null,null,null,null,null,"seulement (attention à la date de validité juqu' à 22 ans révolu)"]
[null,null,null,null,null,"","",null,null,null,null,null,null,null,null,"F ou FET",null,null,"Pour les cartes roses",null,null,null,"Pour les femmes ou femmes étrangères <5pts  (Bonus 1,5 pts)"]
[null,null,null,null,null,"","",null,null,null,null,null,null,null,null,"En Nationale 2 et 3 uniquement (joueuses et joueurs de plus de 55 ans)"]
[null,null,null,null,null,"","",null,null,null,null,null,null,null,null,"S",null,null,"Pour les hommes séniors",null,null,null," Français ou Etrangers (Bonus de 0,5pt)"]
[null,null,null,null,null,null,null,null,null,null,null,null,null,null,null,"FS",null,null,"   Pour les femmes seniors",null,null,null," (Bonus 2pts)      "]
[" Joueurs-joueuses valides de l'équipe (5 points)",null,null,null,null,null,null,null,null,null,null,null,null,null,null,"JS",null,null," Pour les jeunes hommes séniors",null,null,null," Débutants  (Bonus 2pts)  validité (<3pts 2ans)       ( > 3pts 1 an)"]
[{"$f":"IF($G$31=0,\"\",IF($G$31>2,\"Trop de valides sur le terrain\",\"OK\"))","v":""},null,null,null,null,null,null,null,null,null,null,null,null,null,null,"JFS",null,null," Pour les jeunes femmes séniors",null,null,null," Débutantes  (Bonus 3pts)  validité (<3pts 2ans)     ( > 3pts 1 an)"]
["Joueurs étrangers ",null,null,null,null,null,null,null,null,null,null,null,null,null,null,"Autres possibilités (sans Bonus)"]
[{"$f":"IF(F31=0,\"\",IF(F31>5,\"Trop de joueurs étrangers sur la feuille\",\"OK\"))","v":""},null,null,null,null,null,null,null,null,null,null,null,null,null,null,"ET",null,null,"Pour un joueur étranger"]
[null,null,null,null,null,{"$f":"SUM(F6:F25)","v":0},{"$f":"SUM(G6:G25)","v":0},null,null,null,null,null,null,null,null,"FID",null,null,"Pour un joueur fidèle"]
[null,null,null,null,null,null,null,null,null,null,null,null,null,null,null,"N",null,null,"Pour tous joueurs sans symbole sur la carte de classification"]

{"sheet":"SAINT POL DE LEON","index":67,"n_rows":32,"n_cols":29,"rows_kept":32,"cut":false,"hidden":false,"merged":[[23,15,23,29],[24,15,24,17],[25,15,25,17],[26,15,26,17],[1,0,2,0],[1,1,2,3],[1,9,1,13],[2,9,2,13],[5,15,6,17],[5,18,6,19],[5,22,6,22],[5,23,6,23],[5,20,5,21],[5,26,5,27],[5,24,6,24],[5,28,6,29],[7,15,8,17],[7,18,8,19],[7,22,8,22],[7,23,8,23],[0,15,0,29],[1,22,3,22],[1,23,3,23],[1,24,3,24],[1,25,3,25],[1,26,3,27],[1,28,3,29],[6,26,6,27],[7,20,7,21],[7,26,7,27],[7,24,8,24],[7,28,7,29],[8,28,8,29],[8,20,8,21],[8,26,8,27],[6,20,6,21],[9,15,10,17],[9,18,10,19],[9,22,10,22],[9,23,10,23],[10,20,10,21],[9,20,9,21],[9,26,9,27],[9,24,10,24],[9,25,10,25],[9,28,9,29],[10,28,10,29],[10,26,10,27],[11,15,14,17],[11,18,11,19],[11,22,14,22],[11,23,14,23],[12,18,14,19],[12,20,12,21],[13,20,13,21],[14,20,14,21],[11,20,11,21],[11,26,11,27],[11,24,14,24],[11,25,14,25],[11,28,11,29],[12,26,12,27],[12,28,12,29],[13,26,13,27],[13,28,13,29],[14,26,14,27],[14,28,14,29],[16,15,18,17],[16,18,18,21],[22,15,22,17],[15,15,15,29],[19,15,21,17],[19,18,21,21],[22,18,22,21],[30,15,30,17],[31,15,31,17],[29,0,29,4],[26,0,26,4],[27,0,27,4],[27,15,27,17],[28,0,28,4],[29,15,29,17],[28,15,28,29]]}
["SAINT POL DE LEON",null,null,null,null,null,null,null,null,null,null,null,null,null,null,"Saison 2023-2024"]
[null,"Joueur(es) participant à la rencontre",null,null,null,null,null,null,null,"Saisir votre liste complète en MAJUSCULES ",null,null,null,null,null,null,null,null,null,null,null,null,"Carte Verte","Carte Jaune","Carte Rose","Carte Bleue","5,0 Val",null,"Non Sélectionnables en EDF (hors Fidet)"]
[null,null,null,null,null,null,null,null,null,"Joueurs(es) qualifié(es) saison 2023 -2024",null,null,null,null,null,null,null,null,"Avec une date de validité"]
[]
["Statuts","Classif.","          Noms      /    Prénoms",null,"Numéros","ET","VALID","",null,"Statuts","Classif.","          Noms      /    Prénoms",null,"Numéros"]
[null,null,null,null,null,{"$f":"IF(A6=\"ET\",1,\"\")","v":""},{"$f":"IF(B6=5,1,\"\")","v":""},"",null,null,null,null,null,4,null,"Elite Nationale Bastide Médical",null,null,14.5,null,"Maxi 17,5 pts",null,"+  1 ","+  2","+  1,5",null,"1 sur la feuille",null,"Pas de limite"]
[null,null,null,null,null,{"$f":"IF(A7=\"ET\",1,\"\")","v":""},{"$f":"IF(B7=5,1,\"\")","v":""},null,null,"N",1,"GUENEUGUES","L",5,null,null,null,null,null,null,"si cartes de couleurs",null,null,null,null,null,"et terrain"]
[null,null,null,null,null,{"$f":"IF(A8=\"ET\",1,\"\")","v":""},"","",null,"JF",1,"TORCHEN","S",6,null," Nationale 1",null,null,14.5,null,"Maxi 17,5 pts",null,"+  1 ,5","+  2,5","+  1,5",null,"1 sur la feuille",null,"4  Maxi / terrain     "]
[null,null,null,null,null,"","",null,null,"N",5,"LE VELLY","K",7,null,null,null,null,null,null,"si cartes de couleurs",null,null,null,null,null,"et terrain",null," (5 sur la feuille)"]
[null,null,null,null,null,"","","",null,"F",4.5,"ARMAND","S",8,null," Nationale 2",null,null,15,null,"Maxi 19 pts",null,"+  1,5","+  2,5","+  1,5","+  0,5","2 sur la feuille",null,"4  Maxi / terrain     "]
[null,null,null,null,null,"","","",null,null,null,null,null,9,null,null,null,null,null,null,"si cartes de couleurs",null,null,null,null,null,"2 sur le terrain",null," (5 sur la feuille)"]
[null,null,null,null,null,"","","",null,"N",2,"ABYVEN","JL",10,null," Nationale 3",null,null,15.5,null,null,null,"+  1,5","+  2,5","+  1,5","+  0,5"]
[null,null,null,null,null,"","","",null,"N",1,"JAFFRES","B",11,null,null,null,null,"Si 16pts début match-handicap de 10pts",null,"Maxi 19 pts",null,null,null,null,null,"2 sur la feuille",null,"4 Maxi / terrain"]
[null,null,null,null,null,"","","",null,"N",3.5,"CRENN","L",12,null,null,null,null,null,null,"si cartes de couleurs",null,null,null,null,null,"2 sur le terrain",null," (5 sur la feuille)"]
[null,null,null,null,null,"","","",null,null,null,null,null,13]
[null,null,null,null,null,"","","",null,null,null,null,null,14,null,"Inscrire dans la colonne de gauche les \"Statuts\" des joueurs de l'équipe"]
[null,null,null,null,null,"","","",null,"N",5,null,"N",15,null,"J",null,null,"Pour les cartes Vertes",null,null,null,"Jeune joueur (U19 en Elite Nationale Bastide Médical)"]
[null,null,null,null,null,"","","",null,null,null,null,null,16,null,null,null,null,null,null,null,null,"Joueur débutant, sélectionnable en Equipe de France"]
[null,null,null,null,null,"","","",null,null,null,null,null,17,null,null,null,null,null,null,null,null,"seulement (attention à la date de validité juqu'à 22 ans révolu)"]
[null,null,null,null,null,"","",null,null,null,null,null,null,18,null,"JF",null,null,"Pour les cartes Jaunes",null,null,null,"Jeune joueuse (U19 en Elite Nationale Bastide Médical)"]
[null,null,null,null,null,"","","",null,null,null,null,null,19,null,null,null,null,null,null,null,null,"Joueuse débutante, sélectionnable en Equipe de France"]
[null,null,null,null,null,"","",null,null,null,null,null,null,20,null,null,null,null,null,null,null,null,"seulement (attention à la date de validité juqu' à 22 ans révolu)"]
[null,null,null,null,null,"","",null,null,null,null,null,null,null,null,"F ou FET",null,null,"Pour les cartes roses",null,null,null,"Pour les femmes ou femmes étrangères <5pts  (Bonus 1,5 pts)"]
[null,null,null,null,null,"","",null,null,null,null,null,null,null,null,"En Nationale 2 et 3 uniquement (joueuses et joueurs de plus de 55 ans)"]
[null,null,null,null,null,"","",null,null,null,null,null,null,null,null,"S",null,null,"Pour les hommes séniors",null,null,null," Français ou Etrangers (Bonus de 0,5pt)"]
[null,null,null,null,null,null,null,null,null,null,null,null,null,null,null,"FS",null,null,"   Pour les femmes seniors",null,null,null," (Bonus 2pts)      "]
[" Joueurs-joueuses valides de l'équipe (5 points)",null,null,null,null,null,null,null,null,null,null,null,null,null,null,"JS",null,null," Pour les jeunes hommes séniors",null,null,null," Débutants  (Bonus 2pts)  validité (<3pts 2ans)       ( > 3pts 1 an)"]
[{"$f":"IF($G$31=0,\"\",IF($G$31>2,\"Trop de valides sur le terrain\",\"OK\"))","v":""},null,null,null,null,null,null,null,null,null,null,null,null,null,null,"JFS",null,null," Pour les jeunes femmes séniors",null,null,null," Débutantes  (Bonus 3pts)  validité (<3pts 2ans)     ( > 3pts 1 an)"]
["Joueurs étrangers ",null,null,null,null,null,null,null,null,null,null,null,null,null,null,"Autres possibilités (sans Bonus)"]
[{"$f":"IF(F31=0,\"\",IF(F31>5,\"Trop de joueurs étrangers sur la feuille\",\"OK\"))","v":""},null,null,null,null,null,null,null,null,null,null,null,null,null,null,"ET",null,null,"Pour un joueur étranger"]
[null,null,null,null,null,{"$f":"SUM(F6:F30)","v":0},{"$f":"SUM(G6:G30)","v":0},null,null,null,null,null,null,null,null,"FID",null,null,"Pour un joueur fidèle"]
[null,null,null,null,null,null,null,null,null,null,null,null,null,null,null,"N",null,null,"Pour tous joueurs sans symbole sur la carte de classification"]

{"sheet":"YFFINIAC","index":68,"n_rows":32,"n_cols":29,"rows_kept":32,"cut":false,"hidden":false,"merged":[[23,15,23,29],[24,15,24,17],[25,15,25,17],[26,15,26,17],[1,0,2,0],[1,1,2,3],[1,9,1,13],[2,9,2,13],[5,15,6,17],[5,18,6,19],[5,22,6,22],[5,23,6,23],[5,20,5,21],[5,26,5,27],[5,24,6,24],[5,28,6,29],[7,15,8,17],[7,18,8,19],[7,22,8,22],[7,23,8,23],[0,15,0,29],[1,22,3,22],[1,23,3,23],[1,24,3,24],[1,25,3,25],[1,26,3,27],[1,28,3,29],[6,26,6,27],[7,20,7,21],[7,26,7,27],[7,24,8,24],[7,28,7,29],[8,28,8,29],[8,20,8,21],[8,26,8,27],[6,20,6,21],[9,15,10,17],[9,18,10,19],[9,22,10,22],[9,23,10,23],[10,20,10,21],[9,20,9,21],[9,26,9,27],[9,24,10,24],[9,25,10,25],[9,28,9,29],[10,28,10,29],[10,26,10,27],[11,15,14,17],[11,18,11,19],[11,22,14,22],[11,23,14,23],[12,18,14,19],[12,20,12,21],[13,20,13,21],[14,20,14,21],[11,20,11,21],[11,26,11,27],[11,24,14,24],[11,25,14,25],[11,28,11,29],[12,26,12,27],[12,28,12,29],[13,26,13,27],[13,28,13,29],[14,26,14,27],[14,28,14,29],[16,15,18,17],[16,18,18,21],[22,15,22,17],[15,15,15,29],[19,15,21,17],[19,18,21,21],[22,18,22,21],[30,15,30,17],[31,15,31,17],[29,0,29,4],[26,0,26,4],[27,0,27,4],[27,15,27,17],[28,0,28,4],[29,15,29,17],[28,15,28,29]]}
["YFFINIAC",null,null,null,null,null,null,null,null,null,null,null,null,null,null,"Saison 2023-2024"]
[null,"Joueur(es) participant à la rencontre",null,null,null,null,null,null,null,"Saisir votre liste complète en MAJUSCULES ",null,null,null,null,null,null,null,null,null,null,null,null,"Carte Verte","Carte Jaune","Carte Rose","Carte Bleue","5,0 Val",null,"Non Sélectionnables en EDF (hors Fidet)"]
[null,null,null,null,null,null,null,null,null,"Joueurs(es) qualifié(es) saison 2023 -2024",null,null,null,null,null,null,null,null,"Avec une date de validité"]
[]
["Statuts","Classif.","          Noms      /    Prénoms",null,"Numéros","ET","VALID","",null,"Statuts","Classif.","          Noms      /    Prénoms",null,"Numéros"]
[null,null,null,null,null,{"$f":"IF(A6=\"ET\",1,\"\")","v":""},{"$f":"IF(B6=5,1,\"\")","v":""},"",null,"F",4.5,"BYROTHEAU","L",4,null,"Elite Nationale Bastide Médical",null,null,14.5,null,"Maxi 17,5 pts",null,"+  1 ","+  2","+  1,5",null,"1 sur la feuille",null,"Pas de limite"]
[null,null,null,null,null,{"$f":"IF(A7=\"ET\",1,\"\")","v":""},{"$f":"IF(B7=5,1,\"\")","v":""},null,null,"F",1.5,"JAHAN","V",5,null,null,null,null,null,null,"si cartes de couleurs",null,null,null,null,null,"et terrain"]
[null,null,null,null,null,{"$f":"IF(A8=\"ET\",1,\"\")","v":""},"","",null,"N",2.5,"GAUTHIER","JP",6,null," Nationale 1",null,null,14.5,null,"Maxi 17,5 pts",null,"+  1 ,5","+  2,5","+  1,5",null,"1 sur la feuille",null,"4  Maxi / terrain     "]
[null,null,null,null,null,"","",null,null,"N",1,"MOISAN","L",7,null,null,null,null,null,null,"si cartes de couleurs",null,null,null,null,null,"et terrain",null," (5 sur la feuille)"]
[null,null,null,null,null,"","","",null,"J",3.5,"FLIPEAU","C",8,null," Nationale 2",null,null,15,null,"Maxi 19 pts",null,"+  1,5","+  2,5","+  1,5","+  0,5","2 sur la feuille",null,"4  Maxi / terrain     "]
[null,null,null,null,null,"","","",null,"N",5,"POUTREL","E",9,null,null,null,null,null,null,"si cartes de couleurs",null,null,null,null,null,"2 sur le terrain",null," (5 sur la feuille)"]
[null,null,null,null,null,"","","",null,null,null,null,null,10,null," Nationale 3",null,null,15.5,null,null,null,"+  1,5","+  2,5","+  1,5","+  0,5"]
[null,null,null,null,null,"","","",null,null,null,null,null,11,null,null,null,null,"Si 16pts début match-handicap de 10pts",null,"Maxi 19 pts",null,null,null,null,null,"2 sur la feuille",null,"4 Maxi / terrain"]
[null,null,null,null,null,"","","",null,"N",1,"MOISAN","L",12,null,null,null,null,null,null,"si cartes de couleurs",null,null,null,null,null,"2 sur le terrain",null," (5 sur la feuille)"]
[null,null,null,null,null,"","","",null,null,null,null,null,13]
[null,null,null,null,null,"","","",null,"S",4,"LESCEAU","D",14,null,"Inscrire dans la colonne de gauche les \"Statuts\" des joueurs de l'équipe"]
[null,null,null,null,null,"","","",null,null,null,null,null,15,null,"J",null,null,"Pour les cartes Vertes",null,null,null,"Jeune joueur (U19 en Elite Nationale Bastide Médical)"]
[null,null,null,null,null,"","","",null,null,null,null,null,16,null,null,null,null,null,null,null,null,"Joueur débutant, sélectionnable en Equipe de France"]
[null,null,null,null,null,"","","",null,null,null,null,null,17,null,null,null,null,null,null,null,null,"seulement (attention à la date de validité juqu'à 22 ans révolu)"]
[null,null,null,null,null,"","",null,null,null,null,null,null,18,null,"JF",null,null,"Pour les cartes Jaunes",null,null,null,"Jeune joueuse (U19 en Elite Nationale Bastide Médical)"]
[null,null,null,null,null,"","","",null,null,null,null,null,19,null,null,null,null,null,null,null,null,"Joueuse débutante, sélectionnable en Equipe de France"]
[null,null,null,null,null,"","",null,null,null,null,null,null,20,null,null,null,null,null,null,null,null,"seulement (attention à la date de validité juqu' à 22 ans révolu)"]
[null,null,null,null,null,"","",null,null,null,null,null,null,null,null,"F ou FET",null,null,"Pour les cartes roses",null,null,null,"Pour les femmes ou femmes étrangères <5pts  (Bonus 1,5 pts)"]
[null,null,null,null,null,"","",null,null,null,null,null,null,null,null,"En Nationale 2 et 3 uniquement (joueuses et joueurs de plus de 55 ans)"]
[null,null,null,null,null,"","",null,null,null,null,null,null,null,null,"S",null,null,"Pour les hommes séniors",null,null,null," Français ou Etrangers (Bonus de 0,5pt)"]
[null,null,null,null,null,null,null,null,null,null,null,null,null,null,null,"FS",null,null,"   Pour les femmes seniors",null,null,null," (Bonus 2pts)      "]
[" Joueurs-joueuses valides de l'équipe (5 points)",null,null,null,null,null,null,null,null,null,null,null,null,null,null,"JS",null,null," Pour les jeunes hommes séniors",null,null,null," Débutants  (Bonus 2pts)  validité (<3pts 2ans)       ( > 3pts 1 an)"]
[{"$f":"IF($G$31=0,\"\",IF($G$31>2,\"Trop de valides sur le terrain\",\"OK\"))","v":""},null,null,null,null,null,null,null,null,null,null,null,null,null,null,"JFS",null,null," Pour les jeunes femmes séniors",null,null,null," Débutantes  (Bonus 3pts)  validité (<3pts 2ans)     ( > 3pts 1 an)"]
["Joueurs étrangers ",null,null,null,null,null,null,null,null,null,null,null,null,null,null,"Autres possibilités (sans Bonus)"]
[{"$f":"IF(F31=0,\"\",IF(F31>5,\"Trop de joueurs étrangers sur la feuille\",\"OK\"))","v":""},null,null,null,null,null,null,null,null,null,null,null,null,null,null,"ET",null,null,"Pour un joueur étranger"]
[null,null,null,null,null,{"$f":"SUM(F6:F25)","v":0},{"$f":"SUM(G6:G25)","v":0},null,null,null,null,null,null,null,null,"FID",null,null,"Pour un joueur fidèle"]
[null,null,null,null,null,null,null,null,null,null,null,null,null,null,null,"N",null,null,"Pour tous joueurs sans symbole sur la carte de classification"]

{"sheet":"ANGLET","index":69,"n_rows":32,"n_cols":29,"rows_kept":32,"cut":false,"hidden":false,"merged":[[31,15,31,17],[24,15,24,17],[25,15,25,17],[26,15,26,17],[28,15,28,29],[30,15,30,17],[27,15,27,17],[29,15,29,17],[22,18,22,21],[23,15,23,29],[16,15,18,17],[16,18,18,21],[22,15,22,17],[15,15,15,29],[19,15,21,17],[19,18,21,21],[11,15,14,17],[11,18,11,19],[11,22,14,22],[12,18,14,19],[12,20,12,21],[12,26,12,27],[13,20,13,21],[13,26,13,27],[11,23,14,23],[11,24,14,24],[11,25,14,25],[11,28,11,29],[12,28,12,29],[5,20,5,21],[5,26,5,27],[14,20,14,21],[14,26,14,27],[14,28,14,29],[11,20,11,21],[11,26,11,27],[9,22,10,22],[9,23,10,23],[9,24,10,24],[9,25,10,25],[10,20,10,21],[9,20,9,21],[9,28,9,29],[10,28,10,29],[5,22,6,22],[1,0,2,0],[1,1,2,3],[1,9,1,13],[29,0,29,4],[26,0,26,4],[27,0,27,4],[28,0,28,4],[2,9,2,13],[7,15,8,17],[7,18,8,19],[7,22,8,22],[13,28,13,29],[9,26,9,27],[10,26,10,27],[5,23,6,23],[5,24,6,24],[1,28,3,29],[7,23,8,23],[7,24,8,24],[1,25,3,25],[1,26,3,27],[5,28,6,29],[5,15,6,17],[9,15,10,17],[9,18,10,19],[0,15,0,29],[1,22,3,22],[1,23,3,23],[7,28,7,29],[8,28,8,29],[6,20,6,21],[6,26,6,27],[7,20,7,21],[7,26,7,27],[8,20,8,21],[8,26,8,27],[1,24,3,24],[5,18,6,19]]}
["ANGLET",null,null,null,null,null,null,null,null,null,null,null,null,null,null,"Saison 2023-2024"]
[null,"Joueur(es) participant à la rencontre",null,null,null,null,null,null,null,"Saisir votre liste complète en MAJUSCULES ",null,null,null,null,null,null,null,null,null,null,null,null,"Carte Verte","Carte Jaune","Carte Rose","Carte Bleue","5,0 Val",null,"Non Sélectionnables en EDF (hors Fidet)"]
[null,null,null,null,null,null,null,null,null,"Joueurs(es) qualifié(es) saison 2023 -2024",null,null,null,null,null,null,null,null,"Avec une date de validité"]
[]
["Statuts","Classif.","          Noms      /    Prénoms",null,"Numéros","ET","VALID","",null,"Statuts","Classif.","          Noms      /    Prénoms",null,"Numéros"]
[null,null,null,null,null,{"$f":"IF(A6=\"ET\",1,\"\")","v":""},{"$f":"IF(B6=5,1,\"\")","v":""},"",null,"N",2,"GOURGUES","D",4,null,"Elite Nationale Bastide Médical",null,null,14.5,null,"Maxi 17,5 pts",null,"+  1 ","+  2","+  1,5",null,"1 sur la feuille",null,"Pas de limite"]
[null,null,null,null,null,{"$f":"IF(A7=\"ET\",1,\"\")","v":""},{"$f":"IF(B7=5,1,\"\")","v":""},null,null,"N",5,"MENETRIER","PH",5,null,null,null,null,null,null,"si cartes de couleurs",null,null,null,null,null,"et terrain"]
[null,null,null,null,null,{"$f":"IF(A8=\"ET\",1,\"\")","v":""},"","",null,"F",4.5,"TAFERNABERRY","J",6,null," Nationale 1",null,null,14.5,null,"Maxi 17,5 pts",null,"+  1 ,5","+  2,5","+  1,5",null,"1 sur la feuille",null,"4  Maxi / terrain     "]
[null,null,null,null,null,"","",null,null,"ET",1,"STEWART","J",7,null,null,null,null,null,null,"si cartes de couleurs",null,null,null,null,null,"et terrain",null," (5 sur la feuille)"]
[null,null,null,null,null,"","","",null,"S",4,"BACHOFFER","H",8,null," Nationale 2",null,null,15,null,"Maxi 19 pts",null,"+  1,5","+  2,5","+  1,5","+  0,5","2 sur la feuille",null,"4  Maxi / terrain     "]
[null,null,null,null,null,"","","",null,null,null,null,null,9,null,null,null,null,null,null,"si cartes de couleurs",null,null,null,null,null,"2 sur le terrain",null," (5 sur la feuille)"]
[null,null,null,null,null,"","","",null,null,null,null,null,10,null," Nationale 3",null,null,15.5,null,null,null,"+  1,5","+  2,5","+  1,5","+  0,5"]
[null,null,null,null,null,"","","",null,"N",4,"LAVELLE","A",11,null,null,null,null,"Si 16pts début match-handicap de 10pts",null,"Maxi 19 pts",null,null,null,null,null,"2 sur la feuille",null,"4 Maxi / terrain"]
[null,null,null,null,null,"","","",null,"N",5,"MAUREL","S",12,null,null,null,null,null,null,"si cartes de couleurs",null,null,null,null,null,"2 sur le terrain",null," (5 sur la feuille)"]
[null,null,null,null,null,"","","",null,null,null,null,null,13]
[null,null,null,null,null,"","","",null,null,null,null,null,14,null,"Inscrire dans la colonne de gauche les \"Statuts\" des joueurs de l'équipe"]
[null,null,null,null,null,"","","",null,null,null,null,null,15,null,"J",null,null,"Pour les cartes Vertes",null,null,null,"Jeune joueur (U19 en Elite Nationale Bastide Médical)"]
[null,null,null,null,null,"","","",null,null,null,null,null,16,null,null,null,null,null,null,null,null,"Joueur débutant, sélectionnable en Equipe de France"]
[null,null,null,null,null,"","","",null,null,null,null,null,17,null,null,null,null,null,null,null,null,"seulement (attention à la date de validité juqu'à 22 ans révolu)"]
[null,null,null,null,null,"","",null,null,null,null,null,null,18,null,"JF",null,null,"Pour les cartes Jaunes",null,null,null,"Jeune joueuse (U19 en Elite Nationale Bastide Médical)"]
[null,null,null,null,null,"","","",null,null,null,null,null,19,null,null,null,null,null,null,null,null,"Joueuse débutante, sélectionnable en Equipe de France"]
[null,null,null,null,null,"","",null,null,null,null,null,null,20,null,null,null,null,null,null,null,null,"seulement (attention à la date de validité juqu' à 22 ans révolu)"]
[null,null,null,null,null,"","",null,null,null,null,null,null,null,null,"F ou FET",null,null,"Pour les cartes roses",null,null,null,"Pour les femmes ou femmes étrangères <5pts  (Bonus 1,5 pts)"]
[null,null,null,null,null,"","",null,null,null,null,null,null,null,null,"En Nationale 2 et 3 uniquement (joueuses et joueurs de plus de 55 ans)"]
[null,null,null,null,null,"","",null,null,null,null,null,null,null,null,"S",null,null,"Pour les hommes séniors",null,null,null," Français ou Etrangers (Bonus de 0,5pt)"]
[null,null,null,null,null,null,null,null,null,null,null,null,null,null,null,"FS",null,null,"   Pour les femmes seniors",null,null,null," (Bonus 2pts)      "]
[" Joueurs-joueuses valides de l'équipe (5 points)",null,null,null,null,null,null,null,null,null,null,null,null,null,null,"JS",null,null," Pour les jeunes hommes séniors",null,null,null," Débutants  (Bonus 2pts)  validité (<3pts 2ans)       ( > 3pts 1 an)"]
[{"$f":"IF($G$31=0,\"\",IF($G$31>2,\"Trop de valides sur le terrain\",\"OK\"))","v":""},null,null,null,null,null,null,null,null,null,null,null,null,null,null,"JFS",null,null," Pour les jeunes femmes séniors",null,null,null," Débutantes  (Bonus 3pts)  validité (<3pts 2ans)     ( > 3pts 1 an)"]
["Joueurs étrangers ",null,null,null,null,null,null,null,null,null,null,null,null,null,null,"Autres possibilités (sans Bonus)"]
[{"$f":"IF(F31=0,\"\",IF(F31>5,\"Trop de joueurs étrangers sur la feuille\",\"OK\"))","v":""},null,null,null,null,null,null,null,null,null,null,null,null,null,null,"ET",null,null,"Pour un joueur étranger"]
[null,null,null,null,null,{"$f":"SUM(F6:F25)","v":0},{"$f":"SUM(G6:G25)","v":0},null,null,null,null,null,null,null,null,"FID",null,null,"Pour un joueur fidèle"]
[null,null,null,null,null,null,null,null,null,null,null,null,null,null,null,"N",null,null,"Pour tous joueurs sans symbole sur la carte de classification"]

{"sheet":"ASMTH","index":70,"n_rows":32,"n_cols":29,"rows_kept":32,"cut":false,"hidden":false,"merged":[[31,15,31,17],[24,15,24,17],[25,15,25,17],[26,15,26,17],[28,15,28,29],[30,15,30,17],[27,15,27,17],[29,15,29,17],[22,18,22,21],[23,15,23,29],[16,15,18,17],[16,18,18,21],[22,15,22,17],[15,15,15,29],[19,15,21,17],[19,18,21,21],[11,15,14,17],[11,18,11,19],[11,22,14,22],[12,18,14,19],[12,20,12,21],[12,26,12,27],[13,20,13,21],[13,26,13,27],[11,23,14,23],[11,24,14,24],[11,25,14,25],[11,28,11,29],[12,28,12,29],[5,20,5,21],[5,26,5,27],[14,20,14,21],[14,26,14,27],[14,28,14,29],[11,20,11,21],[11,26,11,27],[9,22,10,22],[9,23,10,23],[9,24,10,24],[9,25,10,25],[10,20,10,21],[9,20,9,21],[9,28,9,29],[10,28,10,29],[5,22,6,22],[1,0,2,0],[1,1,2,3],[1,9,1,13],[29,0,29,4],[26,0,26,4],[27,0,27,4],[28,0,28,4],[2,9,2,13],[7,15,8,17],[7,18,8,19],[7,22,8,22],[13,28,13,29],[9,26,9,27],[10,26,10,27],[5,23,6,23],[5,24,6,24],[1,28,3,29],[7,23,8,23],[7,24,8,24],[1,25,3,25],[1,26,3,27],[5,28,6,29],[5,15,6,17],[9,15,10,17],[9,18,10,19],[0,15,0,29],[1,22,3,22],[1,23,3,23],[7,28,7,29],[8,28,8,29],[6,20,6,21],[6,26,6,27],[7,20,7,21],[7,26,7,27],[8,20,8,21],[8,26,8,27],[1,24,3,24],[5,18,6,19]]}
["ASMTH",null,null,null,null,null,null,null,null,null,null,null,null,null,null,"Saison 2023-2024"]
[null,"Joueur(es) participant à la rencontre",null,null,null,null,null,null,null,"Saisir votre liste complète en MAJUSCULES ",null,null,null,null,null,null,null,null,null,null,null,null,"Carte Verte","Carte Jaune","Carte Rose","Carte Bleue","5,0 Val",null,"Non Sélectionnables en EDF (hors Fidet)"]
[null,null,null,null,null,null,null,null,null,"Joueurs(es) qualifié(es) saison 2023 -2024",null,null,null,null,null,null,null,null,"Avec une date de validité"]
[]
["Statuts","Classif.","          Noms      /    Prénoms",null,"Numéros","ET","VALID","",null,"Statuts","Classif.","          Noms      /    Prénoms",null,"Numéros"]
[null,null,null,null,null,{"$f":"IF(A6=\"ET\",1,\"\")","v":""},{"$f":"IF(B6=5,1,\"\")","v":""},"",null,null,null,null,null,4,null,"Elite Nationale Bastide Médical",null,null,14.5,null,"Maxi 17,5 pts",null,"+  1 ","+  2","+  1,5",null,"1 sur la feuille",null,"Pas de limite"]
[null,null,null,null,null,{"$f":"IF(A7=\"ET\",1,\"\")","v":""},{"$f":"IF(B7=5,1,\"\")","v":""},null,null,null,null,null,null,5,null,null,null,null,null,null,"si cartes de couleurs",null,null,null,null,null,"et terrain"]
[null,null,null,null,null,{"$f":"IF(A8=\"ET\",1,\"\")","v":""},"","",null,null,null,null,null,6,null," Nationale 1",null,null,14.5,null,"Maxi 17,5 pts",null,"+  1 ,5","+  2,5","+  1,5",null,"1 sur la feuille",null,"4  Maxi / terrain     "]
[null,null,null,null,null,"","",null,null,null,null,null,null,7,null,null,null,null,null,null,"si cartes de couleurs",null,null,null,null,null,"et terrain",null," (5 sur la feuille)"]
[null,null,null,null,null,"","","",null,null,null,null,null,8,null," Nationale 2",null,null,15,null,"Maxi 19 pts",null,"+  1,5","+  2,5","+  1,5","+  0,5","2 sur la feuille",null,"4  Maxi / terrain     "]
[null,null,null,null,null,"","","",null,null,null,null,null,9,null,null,null,null,null,null,"si cartes de couleurs",null,null,null,null,null,"2 sur le terrain",null," (5 sur la feuille)"]
[null,null,null,null,null,"","","",null,null,null,null,null,10,null," Nationale 3",null,null,15.5,null,null,null,"+  1,5","+  2,5","+  1,5","+  0,5"]
[null,null,null,null,null,"","","",null,null,null,null,null,11,null,null,null,null,"Si 16pts début match-handicap de 10pts",null,"Maxi 19 pts",null,null,null,null,null,"2 sur la feuille",null,"4 Maxi / terrain"]
[null,null,null,null,null,"","","",null,null,null,null,null,12,null,null,null,null,null,null,"si cartes de couleurs",null,null,null,null,null,"2 sur le terrain",null," (5 sur la feuille)"]
[null,null,null,null,null,"","","",null,null,null,null,null,13]
[null,null,null,null,null,"","","",null,null,null,null,null,14,null,"Inscrire dans la colonne de gauche les \"Statuts\" des joueurs de l'équipe"]
[null,null,null,null,null,"","","",null,null,null,null,null,15,null,"J",null,null,"Pour les cartes Vertes",null,null,null,"Jeune joueur (U19 en Elite Nationale Bastide Médical)"]
[null,null,null,null,null,"","","",null,null,null,null,null,16,null,null,null,null,null,null,null,null,"Joueur débutant, sélectionnable en Equipe de France"]
[null,null,null,null,null,"","","",null,null,null,null,null,17,null,null,null,null,null,null,null,null,"seulement (attention à la date de validité juqu'à 22 ans révolu)"]
[null,null,null,null,null,"","",null,null,null,null,null,null,18,null,"JF",null,null,"Pour les cartes Jaunes",null,null,null,"Jeune joueuse (U19 en Elite Nationale Bastide Médical)"]
[null,null,null,null,null,"","","",null,null,null,null,null,19,null,null,null,null,null,null,null,null,"Joueuse débutante, sélectionnable en Equipe de France"]
[null,null,null,null,null,"","",null,null,null,null,null,null,20,null,null,null,null,null,null,null,null,"seulement (attention à la date de validité juqu' à 22 ans révolu)"]
[null,null,null,null,null,"","",null,null,null,null,null,null,null,null,"F ou FET",null,null,"Pour les cartes roses",null,null,null,"Pour les femmes ou femmes étrangères <5pts  (Bonus 1,5 pts)"]
[null,null,null,null,null,"","",null,null,null,null,null,null,null,null,"En Nationale 2 et 3 uniquement (joueuses et joueurs de plus de 55 ans)"]
[null,null,null,null,null,"","",null,null,null,null,null,null,null,null,"S",null,null,"Pour les hommes séniors",null,null,null," Français ou Etrangers (Bonus de 0,5pt)"]
[null,null,null,null,null,null,null,null,null,null,null,null,null,null,null,"FS",null,null,"   Pour les femmes seniors",null,null,null," (Bonus 2pts)      "]
[" Joueurs-joueuses valides de l'équipe (5 points)",null,null,null,null,null,null,null,null,null,null,null,null,null,null,"JS",null,null," Pour les jeunes hommes séniors",null,null,null," Débutants  (Bonus 2pts)  validité (<3pts 2ans)       ( > 3pts 1 an)"]
[{"$f":"IF($G$31=0,\"\",IF($G$31>2,\"Trop de valides sur le terrain\",\"OK\"))","v":""},null,null,null,null,null,null,null,null,null,null,null,null,null,null,"JFS",null,null," Pour les jeunes femmes séniors",null,null,null," Débutantes  (Bonus 3pts)  validité (<3pts 2ans)     ( > 3pts 1 an)"]
["Joueurs étrangers ",null,null,null,null,null,null,null,null,null,null,null,null,null,null,"Autres possibilités (sans Bonus)"]
[{"$f":"IF(F31=0,\"\",IF(F31>5,\"Trop de joueurs étrangers sur la feuille\",\"OK\"))","v":""},null,null,null,null,null,null,null,null,null,null,null,null,null,null,"ET",null,null,"Pour un joueur étranger"]
[null,null,null,null,null,{"$f":"SUM(F6:F25)","v":0},{"$f":"SUM(G6:G25)","v":0},null,null,null,null,null,null,null,null,"FID",null,null,"Pour un joueur fidèle"]
[null,null,null,null,null,null,null,null,null,null,null,null,null,null,null,"N",null,null,"Pour tous joueurs sans symbole sur la carte de classification"]

{"sheet":"PAVIE","index":71,"n_rows":32,"n_cols":29,"rows_kept":32,"cut":false,"hidden":false,"merged":[[31,15,31,17],[24,15,24,17],[25,15,25,17],[26,15,26,17],[28,15,28,29],[30,15,30,17],[27,15,27,17],[29,15,29,17],[22,18,22,21],[23,15,23,29],[16,15,18,17],[16,18,18,21],[22,15,22,17],[15,15,15,29],[19,15,21,17],[19,18,21,21],[11,15,14,17],[11,18,11,19],[11,22,14,22],[12,18,14,19],[12,20,12,21],[12,26,12,27],[13,20,13,21],[13,26,13,27],[11,23,14,23],[11,24,14,24],[11,25,14,25],[11,28,11,29],[12,28,12,29],[5,20,5,21],[5,26,5,27],[14,20,14,21],[14,26,14,27],[14,28,14,29],[11,20,11,21],[11,26,11,27],[9,22,10,22],[9,23,10,23],[9,24,10,24],[9,25,10,25],[10,20,10,21],[9,20,9,21],[9,28,9,29],[10,28,10,29],[5,22,6,22],[1,0,2,0],[1,1,2,3],[1,9,1,13],[29,0,29,4],[26,0,26,4],[27,0,27,4],[28,0,28,4],[2,9,2,13],[7,15,8,17],[7,18,8,19],[7,22,8,22],[13,28,13,29],[9,26,9,27],[10,26,10,27],[5,23,6,23],[5,24,6,24],[1,28,3,29],[7,23,8,23],[7,24,8,24],[1,25,3,25],[1,26,3,27],[5,28,6,29],[5,15,6,17],[9,15,10,17],[9,18,10,19],[0,15,0,29],[1,22,3,22],[1,23,3,23],[7,28,7,29],[8,28,8,29],[6,20,6,21],[6,26,6,27],[7,20,7,21],[7,26,7,27],[8,20,8,21],[8,26,8,27],[1,24,3,24],[5,18,6,19]]}
["PAVIE",null,null,null,null,null,null,null,null,null,null,null,null,null,null,"Saison 2023-2024"]
[null,"Joueur(es) participant à la rencontre",null,null,null,null,null,null,null,"Saisir votre liste complète en MAJUSCULES ",null,null,null,null,null,null,null,null,null,null,null,null,"Carte Verte","Carte Jaune","Carte Rose","Carte Bleue","5,0 Val",null,"Non Sélectionnables en EDF (hors Fidet)"]
[null,null,null,null,null,null,null,null,null,"Joueurs(es) qualifié(es) saison 2023 -2024",null,null,null,null,null,null,null,null,"Avec une date de validité"]
[]
["Statuts","Classif.","          Noms      /    Prénoms",null,"Numéros","ET","VALID","",null,"Statuts","Classif.","          Noms      /    Prénoms",null,"Numéros"]
[null,null,null,null,null,{"$f":"IF(A6=\"ET\",1,\"\")","v":""},{"$f":"IF(B6=5,1,\"\")","v":""},"",null,null,null,null,null,4,null,"Elite Nationale Bastide Médical",null,null,14.5,null,"Maxi 175, pts",null,"+  1 ","+  2","+  1,5",null,"1 sur la feuille",null,"Pas de limite"]
[null,null,null,null,null,{"$f":"IF(A7=\"ET\",1,\"\")","v":""},{"$f":"IF(B7=5,1,\"\")","v":""},null,null,"N",5,"SOUSSEING","N",5,null,null,null,null,null,null,"si cartes de couleurs",null,null,null,null,null,"et terrain"]
[null,null,null,null,null,{"$f":"IF(A8=\"ET\",1,\"\")","v":""},"","",null,null,null,null,null,6,null," Nationale 1",null,null,14.5,null,"Maxi 17,5 pts",null,"+  1 ,5","+  2,5","+  1,5",null,"1 sur la feuille",null,"4  Maxi / terrain     "]
[null,null,null,null,null,"","",null,null,"F",4,"DENOUX","N",7,null,null,null,null,null,null,"si cartes de couleurs",null,null,null,null,null,"et terrain",null," (5 sur la feuille)"]
[null,null,null,null,null,"","","",null,"N",4.5,"DAGNAN","A",8,null," Nationale 2",null,null,15,null,"Maxi 19 pts",null,"+  1,5","+  2,5","+  1,5","+  0,5","2 sur la feuille",null,"4  Maxi / terrain     "]
[null,null,null,null,null,"","","",null,"N",2.5,"AURENSEN","F",9,null,null,null,null,null,null,"si cartes de couleurs",null,null,null,null,null,"2 sur le terrain",null," (5 sur la feuille)"]
[null,null,null,null,null,"","","",null,"F",4,"ROMA",null,10,null," Nationale 3",null,null,15.5,null,null,null,"+  1,5","+  2,5","+  1,5","+  0,5"]
[null,null,null,null,null,"","","",null,"N",2,"BIELLE","A",11,null,null,null,null,"Si 16pts début match-handicap de 10pts",null,"Maxi 19 pts",null,null,null,null,null,"2 sur la feuille",null,"4 Maxi / terrain"]
[null,null,null,null,null,"","","",null,"N",2,"DOUY","J",12,null,null,null,null,null,null,"si cartes de couleurs",null,null,null,null,null,"2 sur le terrain",null," (5 sur la feuille)"]
[null,null,null,null,null,"","","",null,"N",1,"WELKER","JM",13]
[null,null,null,null,null,"","","",null,"N",4.5,"DELUC","PH",14,null,"Inscrire dans la colonne de gauche les \"Statuts\" des joueurs de l'équipe"]
[null,null,null,null,null,"","","",null,null,null,null,null,15,null,"J",null,null,"Pour les cartes Vertes",null,null,null,"Jeune joueur (U19 en Elite Nationale Bastide Médical)"]
[null,null,null,null,null,"","","",null,"N",5,"QUEROL","PH",16,null,null,null,null,null,null,null,null,"Joueur débutant, sélectionnable en Equipe de France"]
[null,null,null,null,null,"","","",null,null,null,null,null,17,null,null,null,null,null,null,null,null,"seulement (attention à la date de validité juqu'à 22 ans révolu)"]
[null,null,null,null,null,"","",null,null,null,null,null,null,18,null,"JF",null,null,"Pour les cartes Jaunes",null,null,null,"Jeune joueuse (U19 en Elite Nationale Bastide Médical)"]
[null,null,null,null,null,"","","",null,null,null,null,null,19,null,null,null,null,null,null,null,null,"Joueuse débutante, sélectionnable en Equipe de France"]
[null,null,null,null,null,"","",null,null,null,null,null,null,20,null,null,null,null,null,null,null,null,"seulement (attention à la date de validité juqu' à 22 ans révolu)"]
[null,null,null,null,null,"","",null,null,null,null,null,null,null,null,"F ou FET",null,null,"Pour les cartes roses",null,null,null,"Pour les femmes ou femmes étrangères <5pts  (Bonus 1,5 pts)"]
[null,null,null,null,null,"","",null,null,null,null,null,null,null,null,"En Nationale 2 et 3 uniquement (joueuses et joueurs de plus de 55 ans)"]
[null,null,null,null,null,"","",null,null,null,null,null,null,null,null,"S",null,null,"Pour les hommes séniors",null,null,null," Français ou Etrangers (Bonus de 0,5pt)"]
[null,null,null,null,null,null,null,null,null,null,null,null,null,null,null,"FS",null,null,"   Pour les femmes seniors",null,null,null," (Bonus 2pts)      "]
[" Joueurs-joueuses valides de l'équipe (5 points)",null,null,null,null,null,null,null,null,null,null,null,null,null,null,"JS",null,null," Pour les jeunes hommes séniors",null,null,null," Débutants  (Bonus 2pts)  validité (<3pts 2ans)       ( > 3pts 1 an)"]
[{"$f":"IF($G$31=0,\"\",IF($G$31>2,\"Trop de valides sur le terrain\",\"OK\"))","v":""},null,null,null,null,null,null,null,null,null,null,null,null,null,null,"JFS",null,null," Pour les jeunes femmes séniors",null,null,null," Débutantes  (Bonus 3pts)  validité (<3pts 2ans)     ( > 3pts 1 an)"]
["Joueurs étrangers ",null,null,null,null,null,null,null,null,null,null,null,null,null,null,"Autres possibilités (sans Bonus)"]
[{"$f":"IF(F31=0,\"\",IF(F31>5,\"Trop de joueurs étrangers sur la feuille\",\"OK\"))","v":""},null,null,null,null,null,null,null,null,null,null,null,null,null,null,"ET",null,null,"Pour un joueur étranger"]
[null,null,null,null,null,{"$f":"SUM(F6:F25)","v":0},{"$f":"SUM(G6:G25)","v":0},null,null,null,null,null,null,null,null,"FID",null,null,"Pour un joueur fidèle"]
[null,null,null,null,null,null,null,null,null,null,null,null,null,null,null,"N",null,null,"Pour tous joueurs sans symbole sur la carte de classification"]

{"sheet":"LA ROCHELLE","index":72,"n_rows":32,"n_cols":29,"rows_kept":32,"cut":false,"hidden":false,"merged":[[23,15,23,29],[24,15,24,17],[25,15,25,17],[26,15,26,17],[1,0,2,0],[1,1,2,3],[1,9,1,13],[2,9,2,13],[5,15,6,17],[5,18,6,19],[5,22,6,22],[5,23,6,23],[5,20,5,21],[5,26,5,27],[5,24,6,24],[5,28,6,29],[7,15,8,17],[7,18,8,19],[7,22,8,22],[7,23,8,23],[0,15,0,29],[1,22,3,22],[1,23,3,23],[1,24,3,24],[1,25,3,25],[1,26,3,27],[1,28,3,29],[6,26,6,27],[7,20,7,21],[7,26,7,27],[7,24,8,24],[7,28,7,29],[8,28,8,29],[8,20,8,21],[8,26,8,27],[6,20,6,21],[9,15,10,17],[9,18,10,19],[9,22,10,22],[9,23,10,23],[10,20,10,21],[9,20,9,21],[9,26,9,27],[9,24,10,24],[9,25,10,25],[9,28,9,29],[10,28,10,29],[10,26,10,27],[11,15,14,17],[11,18,11,19],[11,22,14,22],[11,23,14,23],[12,18,14,19],[12,20,12,21],[13,20,13,21],[14,20,14,21],[11,20,11,21],[11,26,11,27],[11,24,14,24],[11,25,14,25],[11,28,11,29],[12,26,12,27],[12,28,12,29],[13,26,13,27],[13,28,13,29],[14,26,14,27],[14,28,14,29],[16,15,18,17],[16,18,18,21],[22,15,22,17],[15,15,15,29],[19,15,21,17],[19,18,21,21],[22,18,22,21],[30,15,30,17],[31,15,31,17],[29,0,29,4],[26,0,26,4],[27,0,27,4],[27,15,27,17],[28,0,28,4],[29,15,29,17],[28,15,28,29]]}
["LA ROCHELLE",null,null,null,null,null,null,null,null,null,null,null,null,null,null,"Saison 2023-2024"]
[null,"Joueur(es) participant à la rencontre",null,null,null,null,null,null,null,"Saisir votre liste complète en MAJUSCULES ",null,null,null,null,null,null,null,null,null,null,null,null,"Carte Verte","Carte Jaune","Carte Rose","Carte Bleue","5,0 Val",null,"Non Sélectionnables en EDF (hors Fidet)"]
[null,null,null,null,null,null,null,null,null,"Joueurs(es) qualifié(es) saison 2023 -2024",null,null,null,null,null,null,null,null,"Avec une date de validité"]
[]
["Statuts","Classif.","          Noms      /    Prénoms",null,"Numéros","ET","VALID","",null,"Statuts","Classif.","          Noms      /    Prénoms",null,"Numéros"]
[null,null,null,null,null,{"$f":"IF(A6=\"ET\",1,\"\")","v":""},{"$f":"IF(B6=5,1,\"\")","v":""},"",null,null,null,null,null,4,null,"Elite Nationale Bastide Médical",null,null,14.5,null,"Maxi 17,5 pts",null,"+  1 ","+  2","+  1,5",null,"1 sur la feuille",null,"Pas de limite"]
[null,null,null,null,null,{"$f":"IF(A7=\"ET\",1,\"\")","v":""},{"$f":"IF(B7=5,1,\"\")","v":""},null,null,"N",3,"PLANCHOT","D",5,null,null,null,null,null,null,"si cartes de couleurs",null,null,null,null,null,"et terrain"]
[null,null,null,null,null,{"$f":"IF(A8=\"ET\",1,\"\")","v":""},"","",null,"N",1,"BODY","E",6,null," Nationale 1",null,null,14.5,null,"Maxi 17,5 pts",null,"+  1 ,5","+  2,5","+  1,5",null,"1 sur la feuille",null,"4  Maxi / terrain     "]
[null,null,null,null,null,"","",null,null,"N",2.5,"PETROWISTE","J",7,null,null,null,null,null,null,"si cartes de couleurs",null,null,null,null,null,"et terrain",null," (5 sur la feuille)"]
[null,null,null,null,null,"","","",null,"N",5,"TAVEAU","M",8,null," Nationale 2",null,null,15,null,"Maxi 19 pts",null,"+  1,5","+  2,5","+  1,5","+  0,5","2 sur la feuille",null,"4  Maxi / terrain     "]
[null,null,null,null,null,"","","",null,"N",1.5,"GRANDENER","E",9,null,null,null,null,null,null,"si cartes de couleurs",null,null,null,null,null,"2 sur le terrain",null," (5 sur la feuille)"]
[null,null,null,null,null,"","","",null,"N",4,"SEINE","M",10,null," Nationale 3",null,null,15.5,null,null,null,"+  1,5","+  2,5","+  1,5","+  0,5"]
[null,null,null,null,null,"","","",null,"N",1,"ROUSSEAU","JP",11,null,null,null,null,"Si 16pts début match-handicap de 10pts",null,"Maxi 19 pts",null,null,null,null,null,"2 sur la feuille",null,"4 Maxi / terrain"]
[null,null,null,null,null,"","","",null,"J",4.5,"LOULIER","M",12,null,null,null,null,null,null,"si cartes de couleurs",null,null,null,null,null,"2 sur le terrain",null," (5 sur la feuille)"]
[null,null,null,null,null,"","","",null,null,null,null,null,13]
[null,null,null,null,null,"","","",null,"N",3,"ALBANI","S",34,null,"Inscrire dans la colonne de gauche les \"Statuts\" des joueurs de l'équipe"]
[null,null,null,null,null,"","","",null,"N",3,"LOUIS","S",48,null,"J",null,null,"Pour les cartes Vertes",null,null,null,"Jeune joueur (U19 en Elite Nationale Bastide Médical)"]
[null,null,null,null,null,"","","",null,null,null,null,null,null,null,null,null,null,null,null,null,null,"Joueur débutant, sélectionnable en Equipe de France"]
[null,null,null,null,null,"","","",null,null,null,null,null,null,null,null,null,null,null,null,null,null,"seulement (attention à la date de validité juqu'à 22 ans révolu)"]
[null,null,null,null,null,"","",null,null,null,null,null,null,null,null,"JF",null,null,"Pour les cartes Jaunes",null,null,null,"Jeune joueuse (U19 en Elite Nationale Bastide Médical)"]
[null,null,null,null,null,"","","",null,null,null,null,null,null,null,null,null,null,null,null,null,null,"Joueuse débutante, sélectionnable en Equipe de France"]
[null,null,null,null,null,"","",null,null,null,null,null,null,null,null,null,null,null,null,null,null,null,"seulement (attention à la date de validité juqu' à 22 ans révolu)"]
[null,null,null,null,null,"","",null,null,null,null,null,null,null,null,"F ou FET",null,null,"Pour les cartes roses",null,null,null,"Pour les femmes ou femmes étrangères <5pts  (Bonus 1,5 pts)"]
[null,null,null,null,null,"","",null,null,null,null,null,null,null,null,"En Nationale 2 et 3 uniquement (joueuses et joueurs de plus de 55 ans)"]
[null,null,null,null,null,"","",null,null,null,null,null,null,null,null,"S",null,null,"Pour les hommes séniors",null,null,null," Français ou Etrangers (Bonus de 0,5pt)"]
[null,null,null,null,null,null,null,null,null,null,null,null,null,null,null,"FS",null,null,"   Pour les femmes seniors",null,null,null," (Bonus 2pts)      "]
[" Joueurs-joueuses valides de l'équipe (5 points)",null,null,null,null,null,null,null,null,null,null,null,null,null,null,"JS",null,null," Pour les jeunes hommes séniors",null,null,null," Débutants  (Bonus 2pts)  validité (<3pts 2ans)       ( > 3pts 1 an)"]
[{"$f":"IF($G$31=0,\"\",IF($G$31>2,\"Trop de valides sur le terrain\",\"OK\"))","v":""},null,null,null,null,null,null,null,null,null,null,null,null,null,null,"JFS",null,null," Pour les jeunes femmes séniors",null,null,null," Débutantes  (Bonus 3pts)  validité (<3pts 2ans)     ( > 3pts 1 an)"]
["Joueurs étrangers ",null,null,null,null,null,null,null,null,null,null,null,null,null,null,"Autres possibilités (sans Bonus)"]
[{"$f":"IF(F31=0,\"\",IF(F31>5,\"Trop de joueurs étrangers sur la feuille\",\"OK\"))","v":""},null,null,null,null,null,null,null,null,null,null,null,null,null,null,"ET",null,null,"Pour un joueur étranger"]
[null,null,null,null,null,{"$f":"SUM(F6:F25)","v":0},{"$f":"SUM(G6:G25)","v":0},null,null,null,null,null,null,null,null,"FID",null,null,"Pour un joueur fidèle"]
[null,null,null,null,null,null,null,null,null,null,null,null,null,null,null,"N",null,null,"Pour tous joueurs sans symbole sur la carte de classification"]

{"sheet":"POLE NATIONAL","index":73,"n_rows":32,"n_cols":29,"rows_kept":32,"cut":false,"hidden":false,"merged":[[31,15,31,17],[24,15,24,17],[25,15,25,17],[26,15,26,17],[28,15,28,29],[30,15,30,17],[27,15,27,17],[29,15,29,17],[22,18,22,21],[23,15,23,29],[16,15,18,17],[16,18,18,21],[22,15,22,17],[15,15,15,29],[19,15,21,17],[19,18,21,21],[11,15,14,17],[11,18,11,19],[11,22,14,22],[12,18,14,19],[12,20,12,21],[12,26,12,27],[13,20,13,21],[13,26,13,27],[11,23,14,23],[11,24,14,24],[11,25,14,25],[11,28,11,29],[12,28,12,29],[5,20,5,21],[5,26,5,27],[14,20,14,21],[14,26,14,27],[14,28,14,29],[11,20,11,21],[11,26,11,27],[9,22,10,22],[9,23,10,23],[9,24,10,24],[9,25,10,25],[10,20,10,21],[9,20,9,21],[9,28,9,29],[10,28,10,29],[5,22,6,22],[1,0,2,0],[1,1,2,3],[1,9,1,13],[29,0,29,4],[26,0,26,4],[27,0,27,4],[28,0,28,4],[2,9,2,13],[7,15,8,17],[7,18,8,19],[7,22,8,22],[13,28,13,29],[9,26,9,27],[10,26,10,27],[5,23,6,23],[5,24,6,24],[1,28,3,29],[7,23,8,23],[7,24,8,24],[1,25,3,25],[1,26,3,27],[5,28,6,29],[5,15,6,17],[9,15,10,17],[9,18,10,19],[0,15,0,29],[1,22,3,22],[1,23,3,23],[7,28,7,29],[8,28,8,29],[6,20,6,21],[6,26,6,27],[7,20,7,21],[7,26,7,27],[8,20,8,21],[8,26,8,27],[1,24,3,24],[5,18,6,19]]}
["POLE NATIONAL BASKET",null,null,null,null,null,null,null,null,null,null,null,null,null,null,"Saison 2023-2024"]
[null,"Joueur(es) participant à la rencontre",null,null,null,null,null,null,null,"Saisir votre liste complète en MAJUSCULES ",null,null,null,null,null,null,null,null,null,null,null,null,"Carte Verte","Carte Jaune","Carte Rose","Carte Bleue","5,0 Val",null,"Non Sélectionnables en EDF (hors Fidet)"]
[null,null,null,null,null,null,null,null,null,"Joueurs(es) qualifié(es) saison 2023 -2024",null,null,null,null,null,null,null,null,"Avec une date de validité"]
[]
["Statuts","Classif.","          Noms      /    Prénoms",null,"Numéros","ET","VALID","",null,"Statuts","Classif.","          Noms      /    Prénoms",null,"Numéros"]
[null,null,null,null,null,{"$f":"IF(A6=\"ET\",1,\"\")","v":""},{"$f":"IF(B6=5,1,\"\")","v":""},"",null,null,null,null,null,4,null,"Elite Nationale Bastide Médical",null,null,14.5,null,"Maxi 17,5 pts",null,"+  1 ","+  2","+  1,5",null,"1 sur la feuille",null,"Pas de limite"]
[null,null,null,null,null,{"$f":"IF(A7=\"ET\",1,\"\")","v":""},{"$f":"IF(B7=5,1,\"\")","v":""},null,null,null,null,null,null,5,null,null,null,null,null,null,"si cartes de couleurs",null,null,null,null,null,"et terrain"]
[null,null,null,null,null,{"$f":"IF(A8=\"ET\",1,\"\")","v":""},"","",null,null,null,null,null,6,null," Nationale 1",null,null,14.5,null,"Maxi 17,5 pts",null,"+  1 ,5","+  2,5","+  1,5",null,"1 sur la feuille",null,"4  Maxi / terrain     "]
[null,null,null,null,null,"","",null,null,null,null,null,null,7,null,null,null,null,null,null,"si cartes de couleurs",null,null,null,null,null,"et terrain",null," (5 sur la feuille)"]
[null,null,null,null,null,"","","",null,null,null,null,null,8,null," Nationale 2",null,null,15,null,"Maxi 19 pts",null,"+  1,5","+  2,5","+  1,5","+  0,5","2 sur la feuille",null,"4  Maxi / terrain     "]
[null,null,null,null,null,"","","",null,null,null,null,null,9,null,null,null,null,null,null,"si cartes de couleurs",null,null,null,null,null,"2 sur le terrain",null," (5 sur la feuille)"]
[null,null,null,null,null,"","","",null,null,null,null,null,10,null," Nationale 3",null,null,15.5,null,null,null,"+  1,5","+  2,5","+  1,5","+  0,5"]
[null,null,null,null,null,"","","",null,null,null,null,null,11,null,null,null,null,"Si 16pts début match-handicap de 10pts",null,"Maxi 19 pts",null,null,null,null,null,"2 sur la feuille",null,"4 Maxi / terrain"]
[null,null,null,null,null,"","","",null,null,null,null,null,12,null,null,null,null,null,null,"si cartes de couleurs",null,null,null,null,null,"2 sur le terrain",null," (5 sur la feuille)"]
[null,null,null,null,null,"","","",null,null,null,null,null,13]
[null,null,null,null,null,"","","",null,null,null,null,null,14,null,"Inscrire dans la colonne de gauche les \"Statuts\" des joueurs de l'équipe"]
[null,null,null,null,null,"","","",null,null,null,null,null,15,null,"J",null,null,"Pour les cartes Vertes",null,null,null,"Jeune joueur (U19 en Elite Nationale Bastide Médical)"]
[null,null,null,null,null,"","","",null,null,null,null,null,16,null,null,null,null,null,null,null,null,"Joueur débutant, sélectionnable en Equipe de France"]
[null,null,null,null,null,"","","",null,null,null,null,null,17,null,null,null,null,null,null,null,null,"seulement (attention à la date de validité juqu'à 22 ans révolu)"]
[null,null,null,null,null,"","",null,null,null,null,null,null,18,null,"JF",null,null,"Pour les cartes Jaunes",null,null,null,"Jeune joueuse (U19 en Elite Nationale Bastide Médical)"]
[null,null,null,null,null,"","","",null,null,null,null,null,19,null,null,null,null,null,null,null,null,"Joueuse débutante, sélectionnable en Equipe de France"]
[null,null,null,null,null,"","",null,null,null,null,null,null,20,null,null,null,null,null,null,null,null,"seulement (attention à la date de validité juqu' à 22 ans révolu)"]
[null,null,null,null,null,"","",null,null,null,null,null,null,null,null,"F ou FET",null,null,"Pour les cartes roses",null,null,null,"Pour les femmes ou femmes étrangères <5pts  (Bonus 1,5 pts)"]
[null,null,null,null,null,"","",null,null,null,null,null,null,null,null,"En Nationale 2 et 3 uniquement (joueuses et joueurs de plus de 55 ans)"]
[null,null,null,null,null,"","",null,null,null,null,null,null,null,null,"S",null,null,"Pour les hommes séniors",null,null,null," Français ou Etrangers (Bonus de 0,5pt)"]
[null,null,null,null,null,null,null,null,null,null,null,null,null,null,null,"FS",null,null,"   Pour les femmes seniors",null,null,null," (Bonus 2pts)      "]
[" Joueurs-joueuses valides de l'équipe (5 points)",null,null,null,null,null,null,null,null,null,null,null,null,null,null,"JS",null,null," Pour les jeunes hommes séniors",null,null,null," Débutants  (Bonus 2pts)  validité (<3pts 2ans)       ( > 3pts 1 an)"]
[{"$f":"IF($G$31=0,\"\",IF($G$31>2,\"Trop de valides sur le terrain\",\"OK\"))","v":""},null,null,null,null,null,null,null,null,null,null,null,null,null,null,"JFS",null,null," Pour les jeunes femmes séniors",null,null,null," Débutantes  (Bonus 3pts)  validité (<3pts 2ans)     ( > 3pts 1 an)"]
["Joueurs étrangers ",null,null,null,null,null,null,null,null,null,null,null,null,null,null,"Autres possibilités (sans Bonus)"]
[{"$f":"IF(F31=0,\"\",IF(F31>5,\"Trop de joueurs étrangers sur la feuille\",\"OK\"))","v":""},null,null,null,null,null,null,null,null,null,null,null,null,null,null,"ET",null,null,"Pour un joueur étranger"]
[null,null,null,null,null,{"$f":"SUM(F6:F25)","v":0},{"$f":"SUM(G6:G25)","v":0},null,null,null,null,null,null,null,null,"FID",null,null,"Pour un joueur fidèle"]
[null,null,null,null,null,null,null,null,null,null,null,null,null,null,null,"N",null,null,"Pour tous joueurs sans symbole sur la carte de classification"]

{"sheet":"TOULOUSE 2","index":74,"n_rows":32,"n_cols":29,"rows_kept":32,"cut":false,"hidden":false,"merged":[[31,15,31,17],[24,15,24,17],[25,15,25,17],[26,15,26,17],[28,15,28,29],[30,15,30,17],[27,15,27,17],[29,15,29,17],[22,18,22,21],[23,15,23,29],[16,15,18,17],[16,18,18,21],[22,15,22,17],[15,15,15,29],[19,15,21,17],[19,18,21,21],[11,15,14,17],[11,18,11,19],[11,22,14,22],[12,18,14,19],[12,20,12,21],[12,26,12,27],[13,20,13,21],[13,26,13,27],[11,23,14,23],[11,24,14,24],[11,25,14,25],[11,28,11,29],[12,28,12,29],[5,20,5,21],[5,26,5,27],[14,20,14,21],[14,26,14,27],[14,28,14,29],[11,20,11,21],[11,26,11,27],[9,22,10,22],[9,23,10,23],[9,24,10,24],[9,25,10,25],[10,20,10,21],[9,20,9,21],[9,28,9,29],[10,28,10,29],[5,22,6,22],[1,0,2,0],[1,1,2,3],[1,9,1,13],[29,0,29,4],[26,0,26,4],[27,0,27,4],[28,0,28,4],[2,9,2,13],[7,15,8,17],[7,18,8,19],[7,22,8,22],[13,28,13,29],[9,26,9,27],[10,26,10,27],[5,23,6,23],[5,24,6,24],[1,28,3,29],[7,23,8,23],[7,24,8,24],[1,25,3,25],[1,26,3,27],[5,28,6,29],[5,15,6,17],[9,15,10,17],[9,18,10,19],[0,15,0,29],[1,22,3,22],[1,23,3,23],[7,28,7,29],[8,28,8,29],[6,20,6,21],[6,26,6,27],[7,20,7,21],[7,26,7,27],[8,20,8,21],[8,26,8,27],[1,24,3,24],[5,18,6,19]]}
["TOULOUSE 2",null,null,null,null,null,null,null,null,null,null,null,null,null,null,"Saison 2023-2024"]
[null,"Joueur(es) participant à la rencontre",null,null,null,null,null,null,null,"Saisir votre liste complète en MAJUSCULES ",null,null,null,null,null,null,null,null,null,null,null,null,"Carte Verte","Carte Jaune","Carte Rose","Carte Bleue","5,0 Val",null,"Non Sélectionnables en EDF (hors Fidet)"]
[null,null,null,null,null,null,null,null,null,"Joueurs(es) qualifié(es) saison 2023 -2024",null,null,null,null,null,null,null,null,"Avec une date de validité"]
[]
["Statuts","Classif.","          Noms      /    Prénoms",null,"Numéros","ET","VALID","",null,"Statuts","Classif.","          Noms      /    Prénoms",null,"Numéros"]
[null,null,null,null,null,{"$f":"IF(A6=\"ET\",1,\"\")","v":""},{"$f":"IF(B6=5,1,\"\")","v":""},"",null,"N",2,"LOISEAU","F",4,null,"Elite Nationale Bastide Médical",null,null,14.5,null,"Maxi 17,5 pts",null,"+  1 ","+  2","+  1,5",null,"1 sur la feuille",null,"Pas de limite"]
[null,null,null,null,null,{"$f":"IF(A7=\"ET\",1,\"\")","v":""},{"$f":"IF(B7=5,1,\"\")","v":""},null,null,"F",2.5,"MENARD","E",5,null,null,null,null,null,null,"si cartes de couleurs",null,null,null,null,null,"et terrain"]
[null,null,null,null,null,{"$f":"IF(A8=\"ET\",1,\"\")","v":""},"","",null,null,null,null,null,6,null," Nationale 1",null,null,14.5,null,"Maxi 17,5 pts",null,"+  1 ,5","+  2,5","+  1,5",null,"1 sur la feuille",null,"4  Maxi / terrain     "]
[null,null,null,null,null,"","",null,null,"J",4.5,"FAURES","J",7,null,null,null,null,null,null,"si cartes de couleurs",null,null,null,null,null,"et terrain",null," (5 sur la feuille)"]
[null,null,null,null,null,"","","",null,"N",2,"COURTEILLE","J",8,null," Nationale 2",null,null,15,null,"Maxi 19 pts",null,"+  1,5","+  2,5","+  1,5","+  0,5","2 sur la feuille",null,"4  Maxi / terrain     "]
[null,null,null,null,null,"","","",null,"N",2.5,"BENGOURD","A",9,null,null,null,null,null,null,"si cartes de couleurs",null,null,null,null,null,"2 sur le terrain",null," (5 sur la feuille)"]
[null,null,null,null,null,"","","",null,"N",3,"GALY","N",10,null," Nationale 3",null,null,15.5,null,null,null,"+  1,5","+  2,5","+  1,5","+  0,5"]
[null,null,null,null,null,"","","",null,"FET",4,"ALLEMAN","M",11,null,null,null,null,"Si 16pts début match-handicap de 10pts",null,"Maxi 19 pts",null,null,null,null,null,"2 sur la feuille",null,"4 Maxi / terrain"]
[null,null,null,null,null,"","","",null,"N",5,"VARELIETTE","B",12,null,null,null,null,null,null,"si cartes de couleurs",null,null,null,null,null,"2 sur le terrain",null," (5 sur la feuille)"]
[null,null,null,null,null,"","","",null,null,null,null,null,13]
[null,null,null,null,null,"","","",null,"N",1,"AGUINET","D",14,null,"Inscrire dans la colonne de gauche les \"Statuts\" des joueurs de l'équipe"]
[null,null,null,null,null,"","","",null,"N",5,"STIRM","Y",15,null,"J",null,null,"Pour les cartes Vertes",null,null,null,"Jeune joueur (U19 en Elite Nationale Bastide Médical)"]
[null,null,null,null,null,"","","",null,null,null,null,null,16,null,null,null,null,null,null,null,null,"Joueur débutant, sélectionnable en Equipe de France"]
[null,null,null,null,null,"","","",null,null,null,null,null,17,null,null,null,null,null,null,null,null,"seulement (attention à la date de validité juqu'à 22 ans révolu)"]
[null,null,null,null,null,"","",null,null,null,null,null,null,18,null,"JF",null,null,"Pour les cartes Jaunes",null,null,null,"Jeune joueuse (U19 en Elite Nationale Bastide Médical)"]
[null,null,null,null,null,"","","",null,null,null,null,null,19,null,null,null,null,null,null,null,null,"Joueuse débutante, sélectionnable en Equipe de France"]
[null,null,null,null,null,"","",null,null,null,null,null,null,20,null,null,null,null,null,null,null,null,"seulement (attention à la date de validité juqu' à 22 ans révolu)"]
[null,null,null,null,null,"","",null,null,null,null,null,null,null,null,"F ou FET",null,null,"Pour les cartes roses",null,null,null,"Pour les femmes ou femmes étrangères <5pts  (Bonus 1,5 pts)"]
[null,null,null,null,null,"","",null,null,null,null,null,null,null,null,"En Nationale 2 et 3 uniquement (joueuses et joueurs de plus de 55 ans)"]
[null,null,null,null,null,"","",null,null,null,null,null,null,null,null,"S",null,null,"Pour les hommes séniors",null,null,null," Français ou Etrangers (Bonus de 0,5pt)"]
[null,null,null,null,null,null,null,null,null,null,null,null,null,null,null,"FS",null,null,"   Pour les femmes seniors",null,null,null," (Bonus 2pts)      "]
[" Joueurs-joueuses valides de l'équipe (5 points)",null,null,null,null,null,null,null,null,null,null,null,null,null,null,"JS",null,null," Pour les jeunes hommes séniors",null,null,null," Débutants  (Bonus 2pts)  validité (<3pts 2ans)       ( > 3pts 1 an)"]
[{"$f":"IF($G$31=0,\"\",IF($G$31>2,\"Trop de valides sur le terrain\",\"OK\"))","v":""},null,null,null,null,null,null,null,null,null,null,null,null,null,null,"JFS",null,null," Pour les jeunes femmes séniors",null,null,null," Débutantes  (Bonus 3pts)  validité (<3pts 2ans)     ( > 3pts 1 an)"]
["Joueurs étrangers ",null,null,null,null,null,null,null,null,null,null,null,null,null,null,"Autres possibilités (sans Bonus)"]
[{"$f":"IF(F31=0,\"\",IF(F31>5,\"Trop de joueurs étrangers sur la feuille\",\"OK\"))","v":""},null,null,null,null,null,null,null,null,null,null,null,null,null,null,"ET",null,null,"Pour un joueur étranger"]
[null,null,null,null,null,{"$f":"SUM(F6:F25)","v":0},{"$f":"SUM(G6:G25)","v":0},null,null,null,null,null,null,null,null,"FID",null,null,"Pour un joueur fidèle"]
[null,null,null,null,null,null,null,null,null,null,null,null,null,null,null,"N",null,null,"Pour tous joueurs sans symbole sur la carte de classification"]

{"sheet":"LE CANNET 2","index":75,"n_rows":32,"n_cols":29,"rows_kept":32,"cut":false,"hidden":false,"merged":[[23,15,23,29],[24,15,24,17],[25,15,25,17],[26,15,26,17],[1,0,2,0],[1,1,2,3],[1,9,1,13],[2,9,2,13],[5,15,6,17],[5,18,6,19],[5,22,6,22],[5,23,6,23],[5,20,5,21],[5,26,5,27],[5,24,6,24],[5,28,6,29],[7,15,8,17],[7,18,8,19],[7,22,8,22],[7,23,8,23],[0,15,0,29],[1,22,3,22],[1,23,3,23],[1,24,3,24],[1,25,3,25],[1,26,3,27],[1,28,3,29],[6,26,6,27],[7,20,7,21],[7,26,7,27],[7,24,8,24],[7,28,7,29],[8,28,8,29],[8,20,8,21],[8,26,8,27],[6,20,6,21],[9,15,10,17],[9,18,10,19],[9,22,10,22],[9,23,10,23],[10,20,10,21],[9,20,9,21],[9,26,9,27],[9,24,10,24],[9,25,10,25],[9,28,9,29],[10,28,10,29],[10,26,10,27],[11,15,14,17],[11,18,11,19],[11,22,14,22],[11,23,14,23],[12,18,14,19],[12,20,12,21],[13,20,13,21],[14,20,14,21],[11,20,11,21],[11,26,11,27],[11,24,14,24],[11,25,14,25],[11,28,11,29],[12,26,12,27],[12,28,12,29],[13,26,13,27],[13,28,13,29],[14,26,14,27],[14,28,14,29],[16,15,18,17],[16,18,18,21],[22,15,22,17],[15,15,15,29],[19,15,21,17],[19,18,21,21],[22,18,22,21],[30,15,30,17],[31,15,31,17],[29,0,29,4],[26,0,26,4],[27,0,27,4],[27,15,27,17],[28,0,28,4],[29,15,29,17],[28,15,28,29]]}
["LE CANNET 2",null,null,null,null,null,null,null,null,null,null,null,null,null,null,"Saison 2023-2024"]
[null,"Joueur(es) participant à la rencontre",null,null,null,null,null,null,null,"Saisir votre liste complète en MAJUSCULES ",null,null,null,null,null,null,null,null,null,null,null,null,"Carte Verte","Carte Jaune","Carte Rose","Carte Bleue","5,0 Val",null,"Non Sélectionnables en EDF (hors Fidet)"]
[null,null,null,null,null,null,null,null,null,"Joueurs(es) qualifié(es) saison 2023 -2024",null,null,null,null,null,null,null,null,"Avec une date de validité"]
[]
["Statuts","Classif.","          Noms      /    Prénoms",null,"Numéros","ET","VALID","",null,"Statuts","Classif.","          Noms      /    Prénoms",null,"Numéros"]
[null,null,null,null,null,{"$f":"IF(A6=\"ET\",1,\"\")","v":""},{"$f":"IF(B6=5,1,\"\")","v":""},"",null,"N",1.5,"MARLIER","A",4,null,"Elite Nationale Bastide Médical",null,null,14.5,null,"Maxi 17,5 pts",null,"+  1 ","+  2","+  1,5",null,"1 sur la feuille",null,"Pas de limite"]
[null,null,null,null,null,{"$f":"IF(A7=\"ET\",1,\"\")","v":""},{"$f":"IF(B7=5,1,\"\")","v":""},null,null,"N",1.5,"MARLIER","A",5,null,null,null,null,null,null,"si cartes de couleurs",null,null,null,null,null,"et terrain"]
[null,null,null,null,null,{"$f":"IF(A8=\"ET\",1,\"\")","v":""},"","",null,"N",2.5,"SEMEDO","I",6,null," Nationale 1",null,null,14.5,null,"Maxi 17,5 pts",null,"+  1 ,5","+  2,5","+  1,5",null,"1 sur la feuille",null,"4  Maxi / terrain     "]
[null,null,null,null,null,"","",null,null,null,null,null,null,7,null,null,null,null,null,null,"si cartes de couleurs",null,null,null,null,null,"et terrain",null," (5 sur la feuille)"]
[null,null,null,null,null,"","","",null,"ET",4,"AISSOU","R",8,null," Nationale 2",null,null,15,null,"Maxi 19 pts",null,"+  1,5","+  2,5","+  1,5","+  0,5","2 sur la feuille",null,"4  Maxi / terrain     "]
[null,null,null,null,null,"","","",null,null,null,null,null,9,null,null,null,null,null,null,"si cartes de couleurs",null,null,null,null,null,"2 sur le terrain",null," (5 sur la feuille)"]
[null,null,null,null,null,"","","",null,"N",2.5,"MEKHAZNI","K",10,null," Nationale 3",null,null,15.5,null,null,null,"+  1,5","+  2,5","+  1,5","+  0,5"]
[null,null,null,null,null,"","","",null,null,null,null,null,11,null,null,null,null,"Si 16pts début match-handicap de 10pts",null,"Maxi 19 pts",null,null,null,null,null,"2 sur la feuille",null,"4 Maxi / terrain"]
[null,null,null,null,null,"","","",null,"N",1,"MEHIDI","K",12,null,null,null,null,null,null,"si cartes de couleurs",null,null,null,null,null,"2 sur le terrain",null," (5 sur la feuille)"]
[null,null,null,null,null,"","","",null,"N",5,"PAQUET","D",13]
[null,null,null,null,null,"","","",null,"N",1,"DELATTRE","T",14,null,"Inscrire dans la colonne de gauche les \"Statuts\" des joueurs de l'équipe"]
[null,null,null,null,null,"","","",null,"J",4.5,"RODIER","B",15,null,"J",null,null,"Pour les cartes Vertes",null,null,null,"Jeune joueur (U19 en Elite Nationale Bastide Médical)"]
[null,null,null,null,null,"","","",null,"N",5,"RODIER","Y",16,null,null,null,null,null,null,null,null,"Joueur débutant, sélectionnable en Equipe de France"]
[null,null,null,null,null,"","","",null,null,null,null,null,17,null,null,null,null,null,null,null,null,"seulement (attention à la date de validité juqu'à 22 ans révolu)"]
[null,null,null,null,null,"","",null,null,null,null,null,null,18,null,"JF",null,null,"Pour les cartes Jaunes",null,null,null,"Jeune joueuse (U19 en Elite Nationale Bastide Médical)"]
[null,null,null,null,null,"","","",null,null,null,null,null,19,null,null,null,null,null,null,null,null,"Joueuse débutante, sélectionnable en Equipe de France"]
[null,null,null,null,null,"","",null,null,null,null,null,null,20,null,null,null,null,null,null,null,null,"seulement (attention à la date de validité juqu' à 22 ans révolu)"]
[null,null,null,null,null,"","",null,null,null,null,null,null,null,null,"F ou FET",null,null,"Pour les cartes roses",null,null,null,"Pour les femmes ou femmes étrangères <5pts  (Bonus 1,5 pts)"]
[null,null,null,null,null,"","",null,null,null,null,null,null,null,null,"En Nationale 2 et 3 uniquement (joueuses et joueurs de plus de 55 ans)"]
[null,null,null,null,null,"","",null,null,null,null,null,null,null,null,"S",null,null,"Pour les hommes séniors",null,null,null," Français ou Etrangers (Bonus de 0,5pt)"]
[null,null,null,null,null,null,null,null,null,null,null,null,null,null,null,"FS",null,null,"   Pour les femmes seniors",null,null,null," (Bonus 2pts)      "]
[" Joueurs-joueuses valides de l'équipe (5 points)",null,null,null,null,null,null,null,null,null,null,null,null,null,null,"JS",null,null," Pour les jeunes hommes séniors",null,null,null," Débutants  (Bonus 2pts)  validité (<3pts 2ans)       ( > 3pts 1 an)"]
[{"$f":"IF($G$31=0,\"\",IF($G$31>2,\"Trop de valides sur le terrain\",\"OK\"))","v":""},null,null,null,null,null,null,null,null,null,null,null,null,null,null,"JFS",null,null," Pour les jeunes femmes séniors",null,null,null," Débutantes  (Bonus 3pts)  validité (<3pts 2ans)     ( > 3pts 1 an)"]
["Joueurs étrangers ",null,null,null,null,null,null,null,null,null,null,null,null,null,null,"Autres possibilités (sans Bonus)"]
[{"$f":"IF(F31=0,\"\",IF(F31>5,\"Trop de joueurs étrangers sur la feuille\",\"OK\"))","v":""},null,null,null,null,null,null,null,null,null,null,null,null,null,null,"ET",null,null,"Pour un joueur étranger"]
[null,null,null,null,null,{"$f":"SUM(F6:F30)","v":0},{"$f":"SUM(G6:G30)","v":0},null,null,null,null,null,null,null,null,"FID",null,null,"Pour un joueur fidèle"]
[null,null,null,null,null,null,null,null,null,null,null,null,null,null,null,"N",null,null,"Pour tous joueurs sans symbole sur la carte de classification"]

{"sheet":"GUILHERAND","index":76,"n_rows":32,"n_cols":29,"rows_kept":32,"cut":false,"hidden":false,"merged":[[31,15,31,17],[24,15,24,17],[25,15,25,17],[26,15,26,17],[28,15,28,29],[30,15,30,17],[27,15,27,17],[29,15,29,17],[22,18,22,21],[23,15,23,29],[16,15,18,17],[16,18,18,21],[22,15,22,17],[15,15,15,29],[19,15,21,17],[19,18,21,21],[11,15,14,17],[11,18,11,19],[11,22,14,22],[12,18,14,19],[12,20,12,21],[12,26,12,27],[13,20,13,21],[13,26,13,27],[11,23,14,23],[11,24,14,24],[11,25,14,25],[11,28,11,29],[12,28,12,29],[5,20,5,21],[5,26,5,27],[14,20,14,21],[14,26,14,27],[14,28,14,29],[11,20,11,21],[11,26,11,27],[9,22,10,22],[9,23,10,23],[9,24,10,24],[9,25,10,25],[10,20,10,21],[9,20,9,21],[9,28,9,29],[10,28,10,29],[5,22,6,22],[1,0,2,0],[1,1,2,3],[1,9,1,13],[29,0,29,4],[26,0,26,4],[27,0,27,4],[28,0,28,4],[2,9,2,13],[7,15,8,17],[7,18,8,19],[7,22,8,22],[13,28,13,29],[9,26,9,27],[10,26,10,27],[5,23,6,23],[5,24,6,24],[1,28,3,29],[7,23,8,23],[7,24,8,24],[1,25,3,25],[1,26,3,27],[5,28,6,29],[5,15,6,17],[9,15,10,17],[9,18,10,19],[0,15,0,29],[1,22,3,22],[1,23,3,23],[7,28,7,29],[8,28,8,29],[6,20,6,21],[6,26,6,27],[7,20,7,21],[7,26,7,27],[8,20,8,21],[8,26,8,27],[1,24,3,24],[5,18,6,19]]}
["GUILHERAND",null,null,null,null,null,null,null,null,null,null,null,null,null,null,"Saison 2023-2024"]
[null,"Joueur(es) participant à la rencontre",null,null,null,null,null,null,null,"Saisir votre liste complète en MAJUSCULES ",null,null,null,null,null,null,null,null,null,null,null,null,"Carte Verte","Carte Jaune","Carte Rose","Carte Bleue","5,0 Val",null,"Non Sélectionnables en EDF (hors Fidet)"]
[null,null,null,null,null,null,null,null,null,"Joueurs(es) qualifié(es) saison 2023 -2024",null,null,null,null,null,null,null,null,"Avec une date de validité"]
[]
["Statuts","Classif.","          Noms      /    Prénoms",null,"Numéros","ET","VALID","",null,"Statuts","Classif.","          Noms      /    Prénoms",null,"Numéros"]
[null,null,null,null,null,{"$f":"IF(A6=\"ET\",1,\"\")","v":""},{"$f":"IF(B6=5,1,\"\")","v":""},"",null,null,null,null,null,4,null,"Elite Nationale Bastide Médical",null,null,14.5,null,"Maxi 17,5 pts",null,"+  1 ","+  2","+  1,5",null,"1 sur la feuille",null,"Pas de limite"]
[null,null,null,null,null,{"$f":"IF(A7=\"ET\",1,\"\")","v":""},{"$f":"IF(B7=5,1,\"\")","v":""},null,null,"J",2.5,"BANC","D",5,null,null,null,null,null,null,"si cartes de couleurs",null,null,null,null,null,"et terrain"]
[null,null,null,null,null,{"$f":"IF(A8=\"ET\",1,\"\")","v":""},{"$f":"IF(B8=5,1,\"\")","v":""},"",null,"N",3,"DWORACZECK","M",6,null," Nationale 1",null,null,14.5,null,"Maxi 17,5 pts",null,"+  1 ,5","+  2,5","+  1,5",null,"1 sur la feuille",null,"4  Maxi / terrain     "]
[null,null,null,null,null,"","",null,null,"N",4.5,"NOHERIE","R",7,null,null,null,null,null,null,"si cartes de couleurs",null,null,null,null,null,"et terrain",null," (5 sur la feuille)"]
[null,null,null,null,null,"","","",null,"F",4.5,"BROCOT","N",8,null," Nationale 2",null,null,15,null,"Maxi 19 pts",null,"+  1,5","+  2,5","+  1,5","+  0,5","2 sur la feuille",null,"4  Maxi / terrain     "]
[null,null,null,null,null,"","","",null,null,null,null,null,9,null,null,null,null,null,null,"si cartes de couleurs",null,null,null,null,null,"2 sur le terrain",null," (5 sur la feuille)"]
[null,null,null,null,null,"","","",null,"S",3,"KAFI","S",10,null," Nationale 3",null,null,15.5,null,null,null,"+  1,5","+  2,5","+  1,5","+  0,5"]
[null,null,null,null,null,"","","",null,null,null,null,null,11,null,null,null,null,"Si 16pts début match-handicap de 10pts",null,"Maxi 19 pts",null,null,null,null,null,"2 sur la feuille",null,"4 Maxi / terrain"]
[null,null,null,null,null,"","","",null,null,null,null,null,12,null,null,null,null,null,null,"si cartes de couleurs",null,null,null,null,null,"2 sur le terrain",null," (5 sur la feuille)"]
[null,null,null,null,null,"","","",null,null,null,null,null,13]
[null,null,null,null,null,"","","",null,"N",4,"JAUZIN","C",14,null,"Inscrire dans la colonne de gauche les \"Statuts\" des joueurs de l'équipe"]
[null,null,null,null,null,"","","",null,"N",1,"LECROS","M",15,null,"J",null,null,"Pour les cartes Vertes",null,null,null,"Jeune joueur (U19 en Elite Nationale Bastide Médical)"]
[null,null,null,null,null,"","","",null,null,null,null,null,null,null,null,null,null,null,null,null,null,"Joueur débutant, sélectionnable en Equipe de France"]
[null,null,null,null,null,"","","",null,null,null,null,null,null,null,null,null,null,null,null,null,null,"seulement (attention à la date de validité juqu'à 22 ans révolu)"]
[null,null,null,null,null,"","",null,null,null,null,null,null,null,null,"JF",null,null,"Pour les cartes Jaunes",null,null,null,"Jeune joueuse (U19 en Elite Nationale Bastide Médical)"]
[null,null,null,null,null,"","","",null,null,null,null,null,null,null,null,null,null,null,null,null,null,"Joueuse débutante, sélectionnable en Equipe de France"]
[null,null,null,null,null,"","",null,null,null,null,null,null,null,null,null,null,null,null,null,null,null,"seulement (attention à la date de validité juqu' à 22 ans révolu)"]
[null,null,null,null,null,"","",null,null,null,null,null,null,null,null,"F ou FET",null,null,"Pour les cartes roses",null,null,null,"Pour les femmes ou femmes étrangères <5pts  (Bonus 1,5 pts)"]
[null,null,null,null,null,"","",null,null,null,null,null,null,null,null,"En Nationale 2 et 3 uniquement (joueuses et joueurs de plus de 55 ans)"]
[null,null,null,null,null,"","",null,null,null,null,null,null,null,null,"S",null,null,"Pour les hommes séniors",null,null,null," Français ou Etrangers (Bonus de 0,5pt)"]
[null,null,null,null,null,"","",null,null,null,null,null,null,null,null,"FS",null,null,"   Pour les femmes seniors",null,null,null," (Bonus 2pts)      "]
[" Joueurs-joueuses valides de l'équipe (5 points)",null,null,null,null,"","",null,null,null,null,null,null,null,null,"JS",null,null," Pour les jeunes hommes séniors",null,null,null," Débutants  (Bonus 2pts)  validité (<3pts 2ans)       ( > 3pts 1 an)"]
[{"$f":"IF($G$31=0,\"\",IF($G$31>2,\"Trop de valides sur le terrain\",\"OK\"))","v":""},null,null,null,null,"","",null,null,null,null,null,null,null,null,"JFS",null,null," Pour les jeunes femmes séniors",null,null,null," Débutantes  (Bonus 3pts)  validité (<3pts 2ans)     ( > 3pts 1 an)"]
["Joueurs étrangers ",null,null,null,null,"","",null,null,null,null,null,null,null,null,"Autres possibilités (sans Bonus)"]
[{"$f":"IF(F31=0,\"\",IF(F31>5,\"Trop de joueurs étrangers sur la feuille\",\"OK\"))","v":""},null,null,null,null,"","",null,null,null,null,null,null,null,null,"ET",null,null,"Pour un joueur étranger"]
[null,null,null,null,null,{"$f":"SUM(F6:F28)","v":0},{"$f":"SUM(G6:G28)","v":0},null,null,null,null,null,null,null,null,"FID",null,null,"Pour un joueur fidèle"]
[null,null,null,null,null,null,null,null,null,null,null,null,null,null,null,"N",null,null,"Pour tous joueurs sans symbole sur la carte de classification"]

{"sheet":"HYERES 2","index":77,"n_rows":32,"n_cols":29,"rows_kept":32,"cut":false,"hidden":false,"merged":[[23,15,23,29],[24,15,24,17],[25,15,25,17],[26,15,26,17],[1,0,2,0],[1,1,2,3],[1,9,1,13],[2,9,2,13],[5,15,6,17],[5,18,6,19],[5,22,6,22],[5,23,6,23],[5,20,5,21],[5,26,5,27],[5,24,6,24],[5,28,6,29],[7,15,8,17],[7,18,8,19],[7,22,8,22],[7,23,8,23],[0,15,0,29],[1,22,3,22],[1,23,3,23],[1,24,3,24],[1,25,3,25],[1,26,3,27],[1,28,3,29],[6,26,6,27],[7,20,7,21],[7,26,7,27],[7,24,8,24],[7,28,7,29],[8,28,8,29],[8,20,8,21],[8,26,8,27],[6,20,6,21],[9,15,10,17],[9,18,10,19],[9,22,10,22],[9,23,10,23],[10,20,10,21],[9,20,9,21],[9,26,9,27],[9,24,10,24],[9,25,10,25],[9,28,9,29],[10,28,10,29],[10,26,10,27],[11,15,14,17],[11,18,11,19],[11,22,14,22],[11,23,14,23],[12,18,14,19],[12,20,12,21],[13,20,13,21],[14,20,14,21],[11,20,11,21],[11,26,11,27],[11,24,14,24],[11,25,14,25],[11,28,11,29],[12,26,12,27],[12,28,12,29],[13,26,13,27],[13,28,13,29],[14,26,14,27],[14,28,14,29],[16,15,18,17],[16,18,18,21],[22,15,22,17],[15,15,15,29],[19,15,21,17],[19,18,21,21],[22,18,22,21],[30,15,30,17],[31,15,31,17],[29,0,29,4],[26,0,26,4],[27,0,27,4],[27,15,27,17],[28,0,28,4],[29,15,29,17],[28,15,28,29]]}
["HYERES 2",null,null,null,null,null,null,null,null,null,null,null,null,null,null,"Saison 2023-2024"]
[null,"Joueur(es) participant à la rencontre",null,null,null,null,null,null,null,"Saisir votre liste complète en MAJUSCULES ",null,null,null,null,null,null,null,null,null,null,null,null,"Carte Verte","Carte Jaune","Carte Rose","Carte Bleue","5,0 Val",null,"Non Sélectionnables en EDF (hors Fidet)"]
[null,null,null,null,null,null,null,null,null,"Joueurs(es) qualifié(es) saison 2023 -2024",null,null,null,null,null,null,null,null,"Avec une date de validité"]
[]
["Statuts","Classif.","          Noms      /    Prénoms",null,"Numéros","ET","VALID",null,null,"Statuts","Classif.","          Noms      /    Prénoms",null,"Numéros"]
[null,null,null,null,null,{"$f":"IF(A6=\"ET\",1,\"\")","v":""},{"$f":"IF(B6=5,1,\"\")","v":""},null,null,"S",4,"JAYET","C",4,null,"Elite Nationale Bastide Médical",null,null,14.5,null,"Maxi 17,5 pts",null,"+  1 ","+  2","+  1,5",null,"1 sur la feuille",null,"Pas de limite"]
[null,null,null,null,null,{"$f":"IF(A7=\"ET\",1,\"\")","v":""},{"$f":"IF(B7=5,1,\"\")","v":""},null,null,null,null,null,null,5,null,null,null,null,null,null,"si cartes de couleurs",null,null,null,null,null,"et terrain"]
[null,null,null,null,null,{"$f":"IF(A8=\"ET\",1,\"\")","v":""},"",null,null,null,null,null,null,6,null," Nationale 1",null,null,14.5,null,"Maxi 17,5 pts",null,"+  1 ,5","+  2,5","+  1,5",null,"1 sur la feuille",null,"4  Maxi / terrain     "]
[null,null,null,null,null,"","",null,null,"S",4,"JAYET","C",7,null,null,null,null,null,null,"si cartes de couleurs",null,null,null,null,null,"et terrain",null," (5 sur la feuille)"]
[null,null,null,null,null,"","",null,null,"N",1,"CHABRIER","O",8,null," Nationale 2",null,null,15,null,"Maxi 19 pts",null,"+  1,5","+  2,5","+  1,5","+  0,5","2 sur la feuille",null,"4  Maxi / terrain     "]
[null,null,null,null,null,"","",null,null,"J",2.5,"FERRANTE","J",9,null,null,null,null,null,null,"si cartes de couleurs",null,null,null,null,null,"2 sur le terrain",null," (5 sur la feuille)"]
[null,null,null,null,null,"","",null,null,"N",2.5,"NUTTIN","P",10,null," Nationale 3",null,null,15.5,null,null,null,"+  1,5","+  2,5","+  1,5","+  0,5"]
[null,null,null,null,null,"","",null,null,"J",1,"SOULIE","J",11,null,null,null,null,"Si 16pts début match-handicap de 10pts",null,"Maxi 19 pts",null,null,null,null,null,"2 sur la feuille",null,"4 Maxi / terrain"]
[null,null,null,null,null,"","",null,null,null,null,null,null,12,null,null,null,null,null,null,"si cartes de couleurs",null,null,null,null,null,"2 sur le terrain",null," (5 sur la feuille)"]
[null,null,null,null,null,"","",null,null,"N",5,"LANTERI","S",13]
[null,null,null,null,null,"","",null,null,"N",1,"ADIASSE","G",14,null,"Inscrire dans la colonne de gauche les \"Statuts\" des joueurs de l'équipe"]
[null,null,null,null,null,"","",null,null,"J",2,"VIEIL","J",15,null,"J",null,null,"Pour les cartes Vertes",null,null,null,"Jeune joueur (U19 en Elite Nationale Bastide Médical)"]
[null,null,null,null,null,"","",null,null,null,null,null,null,16,null,null,null,null,null,null,null,null,"Joueur débutant, sélectionnable en Equipe de France"]
[null,null,null,null,null,"","",null,null,null,null,null,null,17,null,null,null,null,null,null,null,null,"seulement (attention à la date de validité juqu'à 22 ans révolu)"]
[null,null,null,null,null,"","",null,null,null,null,null,null,18,null,"JF",null,null,"Pour les cartes Jaunes",null,null,null,"Jeune joueuse (U19 en Elite Nationale Bastide Médical)"]
[null,null,null,null,null,"","",null,null,null,null,null,null,19,null,null,null,null,null,null,null,null,"Joueuse débutante, sélectionnable en Equipe de France"]
[null,null,null,null,null,"","",null,null,null,null,null,null,20,null,null,null,null,null,null,null,null,"seulement (attention à la date de validité juqu' à 22 ans révolu)"]
[null,null,null,null,null,"","",null,null,null,null,null,null,null,null,"F ou FET",null,null,"Pour les cartes roses",null,null,null,"Pour les femmes ou femmes étrangères <5pts  (Bonus 1,5 pts)"]
[null,null,null,null,null,"","",null,null,null,null,null,null,null,null,"En Nationale 2 et 3 uniquement (joueuses et joueurs de plus de 55 ans)"]
[null,null,null,null,null,null,null,null,null,null,null,null,null,null,null,"S",null,null,"Pour les hommes séniors",null,null,null," Français ou Etrangers (Bonus de 0,5pt)"]
[null,null,null,null,null,null,null,null,null,null,null,null,null,null,null,"FS",null,null,"   Pour les femmes seniors",null,null,null," (Bonus 2pts)      "]
[" Joueurs-joueuses valides de l'équipe (5 points)",null,null,null,null,null,null,null,null,null,null,null,null,null,null,"JS",null,null," Pour les jeunes hommes séniors",null,null,null," Débutants  (Bonus 2pts)  validité (<3pts 2ans)       ( > 3pts 1 an)"]
[{"$f":"IF($G$31=0,\"\",IF($G$31>2,\"Trop de valides sur le terrain\",\"OK\"))","v":""},null,null,null,null,null,null,null,null,null,null,null,null,null,null,"JFS",null,null," Pour les jeunes femmes séniors",null,null,null," Débutantes  (Bonus 3pts)  validité (<3pts 2ans)     ( > 3pts 1 an)"]
["Joueurs étrangers ",null,null,null,null,null,null,null,null,null,null,null,null,null,null,"Autres possibilités (sans Bonus)"]
[{"$f":"IF(F31=0,\"\",IF(F31>5,\"Trop de joueurs étrangers sur la feuille\",\"OK\"))","v":""},null,null,null,null,null,null,null,null,null,null,null,null,null,null,"ET",null,null,"Pour un joueur étranger"]
[null,null,null,null,null,{"$f":"SUM(F6:F30)","v":0},{"$f":"SUM(G6:G30)","v":0},null,null,null,null,null,null,null,null,"FID",null,null,"Pour un joueur fidèle"]
[null,null,null,null,null,null,null,null,null,null,null,null,null,null,null,"N",null,null,"Pour tous joueurs sans symbole sur la carte de classification"]

{"sheet":"MARSEILLE 2","index":78,"n_rows":32,"n_cols":29,"rows_kept":32,"cut":false,"hidden":false,"merged":[[23,15,23,29],[24,15,24,17],[25,15,25,17],[26,15,26,17],[1,0,2,0],[1,1,2,3],[1,9,1,13],[2,9,2,13],[5,15,6,17],[5,18,6,19],[5,22,6,22],[5,23,6,23],[5,20,5,21],[5,26,5,27],[5,24,6,24],[5,28,6,29],[7,15,8,17],[7,18,8,19],[7,22,8,22],[7,23,8,23],[0,15,0,29],[1,22,3,22],[1,23,3,23],[1,24,3,24],[1,25,3,25],[1,26,3,27],[1,28,3,29],[6,26,6,27],[7,20,7,21],[7,26,7,27],[7,24,8,24],[7,28,7,29],[8,28,8,29],[8,20,8,21],[8,26,8,27],[6,20,6,21],[9,15,10,17],[9,18,10,19],[9,22,10,22],[9,23,10,23],[10,20,10,21],[9,20,9,21],[9,26,9,27],[9,24,10,24],[9,25,10,25],[9,28,9,29],[10,28,10,29],[10,26,10,27],[11,15,14,17],[11,18,11,19],[11,22,14,22],[11,23,14,23],[12,18,14,19],[12,20,12,21],[13,20,13,21],[14,20,14,21],[11,20,11,21],[11,26,11,27],[11,24,14,24],[11,25,14,25],[11,28,11,29],[12,26,12,27],[12,28,12,29],[13,26,13,27],[13,28,13,29],[14,26,14,27],[14,28,14,29],[16,15,18,17],[16,18,18,21],[22,15,22,17],[15,15,15,29],[19,15,21,17],[19,18,21,21],[22,18,22,21],[30,15,30,17],[31,15,31,17],[29,0,29,4],[26,0,26,4],[27,0,27,4],[27,15,27,17],[28,0,28,4],[29,15,29,17],[28,15,28,29]]}
["MARSEILLE 2",null,null,null,null,null,null,null,null,null,null,null,null,null,null,"Saison 2023-2024"]
[null,"Joueur(es) participant à la rencontre",null,null,null,null,null,null,null,"Saisir votre liste complète en MAJUSCULES ",null,null,null,null,null,null,null,null,null,null,null,null,"Carte Verte","Carte Jaune","Carte Rose","Carte Bleue","5,0 Val",null,"Non Sélectionnables en EDF (hors Fidet)"]
[null,null,null,null,null,null,null,null,null,"Joueurs(es) qualifié(es) saison 2023 -2024",null,null,null,null,null,null,null,null,"Avec une date de validité"]
[]
["Statuts","Classif.","          Noms      /    Prénoms",null,"Numéros","ET","VALID","",null,"Statuts","Classif.","          Noms      /    Prénoms",null,"Numéros"]
[null,null,null,null,null,{"$f":"IF(A6=\"ET\",1,\"\")","v":""},{"$f":"IF(B6=5,1,\"\")","v":""},"",null,null,null,null,null,4,null,"Elite Nationale Bastide Médical",null,null,14.5,null,"Maxi 17,5 pts",null,"+  1 ","+  2","+  1,5",null,"1 sur la feuille",null,"Pas de limite"]
[null,null,null,null,null,{"$f":"IF(A7=\"ET\",1,\"\")","v":""},{"$f":"IF(B7=5,1,\"\")","v":""},null,null,null,null,null,null,5,null,null,null,null,null,null,"si cartes de couleurs",null,null,null,null,null,"et terrain"]
[null,null,null,null,null,{"$f":"IF(A8=\"ET\",1,\"\")","v":""},"","",null,"J",2,"AOUKILI","W",6,null," Nationale 1",null,null,14.5,null,"Maxi 17,5 pts",null,"+  1 ,5","+  2,5","+  1,5",null,"1 sur la feuille",null,"4  Maxi / terrain     "]
[null,null,null,null,null,"","",null,null,"N",4,"BOUSTILA","O",7,null,null,null,null,null,null,"si cartes de couleurs",null,null,null,null,null,"et terrain",null," (5 sur la feuille)"]
[null,null,null,null,null,"","","",null,"JF",4,"STEPHENS","M",8,null," Nationale 2",null,null,15,null,"Maxi 19 pts",null,"+  1,5","+  2,5","+  1,5","+  0,5","2 sur la feuille",null,"4  Maxi / terrain     "]
[null,null,null,null,null,"","","",null,"ET",1,"BENMERRAAH","A",9,null,null,null,null,null,null,"si cartes de couleurs",null,null,null,null,null,"2 sur le terrain",null," (5 sur la feuille)"]
[null,null,null,null,null,"","","",null,"J",3.5,"BENASIO","D",10,null," Nationale 3",null,null,15.5,null,null,null,"+  1,5","+  2,5","+  1,5","+  0,5"]
[null,null,null,null,null,"","","",null,"N",4,"OBERDORFF","F",11,null,null,null,null,"Si 16pts début match-handicap de 10pts",null,"Maxi 19 pts",null,null,null,null,null,"2 sur la feuille",null,"4 Maxi / terrain"]
[null,null,null,null,null,"","","",null,"N",3,"AMAH","K",12,null,null,null,null,null,null,"si cartes de couleurs",null,null,null,null,null,"2 sur le terrain",null," (5 sur la feuille)"]
[null,null,null,null,null,"","","",null,"N",3,"METOS","D",13]
[null,null,null,null,null,"","","",null,"ET",1.5,"BENARABI","T",14,null,"Inscrire dans la colonne de gauche les \"Statuts\" des joueurs de l'équipe"]
[null,null,null,null,null,"","","",null,"N",4.5,"HAMRANI","A",15,null,"J",null,null,"Pour les cartes Vertes",null,null,null,"Jeune joueur (U19 en Elite Nationale Bastide Médical)"]
[null,null,null,null,null,"","","",null,null,null,null,null,16,null,null,null,null,null,null,null,null,"Joueur débutant, sélectionnable en Equipe de France"]
[null,null,null,null,null,"","","",null,null,null,null,null,17,null,null,null,null,null,null,null,null,"seulement (attention à la date de validité juqu'à 22 ans révolu)"]
[null,null,null,null,null,"","",null,null,null,null,null,null,18,null,"JF",null,null,"Pour les cartes Jaunes",null,null,null,"Jeune joueuse (U19 en Elite Nationale Bastide Médical)"]
[null,null,null,null,null,"","","",null,null,null,null,null,19,null,null,null,null,null,null,null,null,"Joueuse débutante, sélectionnable en Equipe de France"]
[null,null,null,null,null,"","",null,null,null,null,null,null,20,null,null,null,null,null,null,null,null,"seulement (attention à la date de validité juqu' à 22 ans révolu)"]
[null,null,null,null,null,"","",null,null,null,null,null,null,null,null,"F ou FET",null,null,"Pour les cartes roses",null,null,null,"Pour les femmes ou femmes étrangères <5pts  (Bonus 1,5 pts)"]
[null,null,null,null,null,"","",null,null,null,null,null,null,null,null,"En Nationale 2 et 3 uniquement (joueuses et joueurs de plus de 55 ans)"]
[null,null,null,null,null,"","",null,null,null,null,null,null,null,null,"S",null,null,"Pour les hommes séniors",null,null,null," Français ou Etrangers (Bonus de 0,5pt)"]
[null,null,null,null,null,null,null,null,null,null,null,null,null,null,null,"FS",null,null,"   Pour les femmes seniors",null,null,null," (Bonus 2pts)      "]
[" Joueurs-joueuses valides de l'équipe (5 points)",null,null,null,null,null,null,null,null,null,null,null,null,null,null,"JS",null,null," Pour les jeunes hommes séniors",null,null,null," Débutants  (Bonus 2pts)  validité (<3pts 2ans)       ( > 3pts 1 an)"]
[{"$f":"IF($G$31=0,\"\",IF($G$31>2,\"Trop de valides sur le terrain\",\"OK\"))","v":""},null,null,null,null,null,null,null,null,null,null,null,null,null,null,"JFS",null,null," Pour les jeunes femmes séniors",null,null,null," Débutantes  (Bonus 3pts)  validité (<3pts 2ans)     ( > 3pts 1 an)"]
["Joueurs étrangers ",null,null,null,null,null,null,null,null,null,null,null,null,null,null,"Autres possibilités (sans Bonus)"]
[{"$f":"IF(F31=0,\"\",IF(F31>5,\"Trop de joueurs étrangers sur la feuille\",\"OK\"))","v":""},null,null,null,null,null,null,null,null,null,null,null,null,null,null,"ET",null,null,"Pour un joueur étranger"]
[null,null,null,null,null,{"$f":"SUM(F6:F25)","v":0},{"$f":"SUM(G6:G25)","v":0},null,null,null,null,null,null,null,null,"FID",null,null,"Pour un joueur fidèle"]
[null,null,null,null,null,null,null,null,null,null,null,null,null,null,null,"N",null,null,"Pour tous joueurs sans symbole sur la carte de classification"]

{"sheet":"MONTPELLIER","index":79,"n_rows":32,"n_cols":29,"rows_kept":32,"cut":false,"hidden":false,"merged":[[23,15,23,29],[24,15,24,17],[25,15,25,17],[26,15,26,17],[1,0,2,0],[1,1,2,3],[1,9,1,13],[2,9,2,13],[5,15,6,17],[5,18,6,19],[5,22,6,22],[5,23,6,23],[5,20,5,21],[5,26,5,27],[5,24,6,24],[5,28,6,29],[7,15,8,17],[7,18,8,19],[7,22,8,22],[7,23,8,23],[0,15,0,29],[1,22,3,22],[1,23,3,23],[1,24,3,24],[1,25,3,25],[1,26,3,27],[1,28,3,29],[6,26,6,27],[7,20,7,21],[7,26,7,27],[7,24,8,24],[7,28,7,29],[8,28,8,29],[8,20,8,21],[8,26,8,27],[6,20,6,21],[9,15,10,17],[9,18,10,19],[9,22,10,22],[9,23,10,23],[10,20,10,21],[9,20,9,21],[9,26,9,27],[9,24,10,24],[9,25,10,25],[9,28,9,29],[10,28,10,29],[10,26,10,27],[11,15,14,17],[11,18,11,19],[11,22,14,22],[11,23,14,23],[12,18,14,19],[12,20,12,21],[13,20,13,21],[14,20,14,21],[11,20,11,21],[11,26,11,27],[11,24,14,24],[11,25,14,25],[11,28,11,29],[12,26,12,27],[12,28,12,29],[13,26,13,27],[13,28,13,29],[14,26,14,27],[14,28,14,29],[16,15,18,17],[16,18,18,21],[22,15,22,17],[15,15,15,29],[19,15,21,17],[19,18,21,21],[22,18,22,21],[30,15,30,17],[31,15,31,17],[29,0,29,4],[26,0,26,4],[27,0,27,4],[27,15,27,17],[28,0,28,4],[29,15,29,17],[28,15,28,29]]}
["MONTPELLIER",null,null,null,null,null,null,null,null,null,null,null,null,null,null,"Saison 2023-2024"]
[null,"Joueur(es) participant à la rencontre",null,null,null,null,null,null,null,"Saisir votre liste complète en MAJUSCULES ",null,null,null,null,null,null,null,null,null,null,null,null,"Carte Verte","Carte Jaune","Carte Rose","Carte Bleue","5,0 Val",null,"Non Sélectionnables en EDF (hors Fidet)"]
[null,null,null,null,null,null,null,null,null,"Joueurs(es) qualifié(es) saison 2023 -2024",null,null,null,null,null,null,null,null,"Avec une date de validité"]
[]
["Statuts","Classif.","          Noms      /    Prénoms",null,"Numéros","ET","VALID","",null,"Statuts","Classif.","          Noms      /    Prénoms",null,"Numéros"]
[null,null,null,null,null,{"$f":"IF(A6=\"ET\",1,\"\")","v":""},{"$f":"IF(B6=5,1,\"\")","v":""},"",null,"N",1,"SCHWARZ",null,3,null,"Elite Nationale Bastide Médical",null,null,14.5,null,"Maxi 17,5 pts",null,"+  1 ","+  2","+  1,5",null,"1 sur la feuille",null,"Pas de limite"]
[null,null,null,null,null,{"$f":"IF(A7=\"ET\",1,\"\")","v":""},{"$f":"IF(B7=5,1,\"\")","v":""},null,null,null,null,null,null,4,null,null,null,null,null,null,"si cartes de couleurs",null,null,null,null,null,"et terrain"]
[null,null,null,null,null,{"$f":"IF(A8=\"ET\",1,\"\")","v":""},"","",null,null,null,null,null,5,null," Nationale 1",null,null,14.5,null,"Maxi 17,5 pts",null,"+  1 ,5","+  2,5","+  1,5",null,"1 sur la feuille",null,"4  Maxi / terrain     "]
[null,null,null,null,null,"","",null,null,"N",2.5,"LAMBOU",null,6,null,null,null,null,null,null,"si cartes de couleurs",null,null,null,null,null,"et terrain",null," (5 sur la feuille)"]
[null,null,null,null,null,"","","",null,"N",5,"GALLOIS-MONTBRUN","T",7,null," Nationale 2",null,null,15,null,"Maxi 19 pts",null,"+  1,5","+  2,5","+  1,5","+  0,5","2 sur la feuille",null,"4  Maxi / terrain     "]
[null,null,null,null,null,"","","",null,null,null,null,null,8,null,null,null,null,null,null,"si cartes de couleurs",null,null,null,null,null,"2 sur le terrain",null," (5 sur la feuille)"]
[null,null,null,null,null,"","","",null,null,null,null,null,9,null," Nationale 3",null,null,15.5,null,null,null,"+  1,5","+  2,5","+  1,5","+  0,5"]
[null,null,null,null,null,"","","",null,"N",3.5,"GALLOIS-MONTBRUN","J",10,null,null,null,null,"Si 16pts début match-handicap de 10pts",null,"Maxi 19 pts",null,null,null,null,null,"2 sur la feuille",null,"4 Maxi / terrain"]
[null,null,null,null,null,"","","",null,"N",3,"DUSCH",null,11,null,null,null,null,null,null,"si cartes de couleurs",null,null,null,null,null,"2 sur le terrain",null," (5 sur la feuille)"]
[null,null,null,null,null,"","","",null,null,null,null,null,12]
[null,null,null,null,null,"","","",null,"N",4,"BENDRISS","A",15,null,"Inscrire dans la colonne de gauche les \"Statuts\" des joueurs de l'équipe"]
[null,null,null,null,null,"","","",null,null,null,null,null,16,null,"J",null,null,"Pour les cartes Vertes",null,null,null,"Jeune joueur (U19 en Elite Nationale Bastide Médical)"]
[null,null,null,null,null,"","","",null,"N",2.5,"DECROIX","M",17,null,null,null,null,null,null,null,null,"Joueur débutant, sélectionnable en Equipe de France"]
[null,null,null,null,null,"","","",null,null,null,null,null,18,null,null,null,null,null,null,null,null,"seulement (attention à la date de validité juqu'à 22 ans révolu)"]
[null,null,null,null,null,"","",null,null,"FID",3,"REGRAGUI","T",19,null,"JF",null,null,"Pour les cartes Jaunes",null,null,null,"Jeune joueuse (U19 en Elite Nationale Bastide Médical)"]
[null,null,null,null,null,"","","",null,"S",4,"BACOUL","JC",24,null,null,null,null,null,null,null,null,"Joueuse débutante, sélectionnable en Equipe de France"]
[null,null,null,null,null,"","",null,null,"J",4.5,"SIERRA","D",28,null,null,null,null,null,null,null,null,"seulement (attention à la date de validité juqu' à 22 ans révolu)"]
[null,null,null,null,null,"","",null,null,"N",5,"ROBERGEAU","D",31,null,"F ou FET",null,null,"Pour les cartes roses",null,null,null,"Pour les femmes ou femmes étrangères <5pts  (Bonus 1,5 pts)"]
[null,null,null,null,null,"","",null,null,"N",2,"GUIHEUX",null,77,null,"En Nationale 2 et 3 uniquement (joueuses et joueurs de plus de 55 ans)"]
[null,null,null,null,null,"","",null,null,null,null,null,null,null,null,"S",null,null,"Pour les hommes séniors",null,null,null," Français ou Etrangers (Bonus de 0,5pt)"]
[null,null,null,null,null,null,null,null,null,null,null,null,null,null,null,"FS",null,null,"   Pour les femmes seniors",null,null,null," (Bonus 2pts)      "]
[" Joueurs-joueuses valides de l'équipe (5 points)",null,null,null,null,null,null,null,null,null,null,null,null,null,null,"JS",null,null," Pour les jeunes hommes séniors",null,null,null," Débutants  (Bonus 2pts)  validité (<3pts 2ans)       ( > 3pts 1 an)"]
[{"$f":"IF($G$31=0,\"\",IF($G$31>2,\"Trop de valides sur le terrain\",\"OK\"))","v":""},null,null,null,null,null,null,null,null,null,null,null,null,null,null,"JFS",null,null," Pour les jeunes femmes séniors",null,null,null," Débutantes  (Bonus 3pts)  validité (<3pts 2ans)     ( > 3pts 1 an)"]
["Joueurs étrangers ",null,null,null,null,null,null,null,null,null,null,null,null,null,null,"Autres possibilités (sans Bonus)"]
[{"$f":"IF(F31=0,\"\",IF(F31>5,\"Trop de joueurs étrangers sur la feuille\",\"OK\"))","v":""},null,null,null,null,null,null,null,null,null,null,null,null,null,null,"ET",null,null,"Pour un joueur étranger"]
[null,null,null,null,null,{"$f":"SUM(F6:F30)","v":0},{"$f":"SUM(G6:G30)","v":0},null,null,null,null,null,null,null,null,"FID",null,null,"Pour un joueur fidèle"]
[null,null,null,null,null,null,null,null,null,null,null,null,null,null,null,"N",null,null,"Pour tous joueurs sans symbole sur la carte de classification"]