{"text_format":"1","workbook":"xlsx","n_sheets":90,"sheets":["Accueil","Elite Nationale Bastide Médical","Nationale_1","Nationale_2_poule_A","Nationale_2_poule_B","Nationale_3_poule_A","Nationale_3_poule_B","Nationale_3_poule_C","Nationale_3_poule_D","Nationale_3_poule_E","Finale_Four_Nationale_2","Finale_Four_Nationale_3","Liste équipes","ENT CHALON DIJON BF","HURRICANE92","HYERES","LANNION","LE CANNET","LE PUY","LILLE","MARSEILLE","MEAUX","TOULOUSE","ENT BORDEAUX BLANQUEFORT","ENT CAUSSADE PAVIE","ENT CHALON DIJON BF 2","ENT LYON GUILHERAND","CAPSAAA","DOUAI","FEURS","MEAUX 2","MEYLAN","STRASBOURG","BESANÇON","CAPPELLE LA GRANDE","CORBEIL","LE PUY 2","STRASBOURG 2","VANDOEUVRE","AMIENS","AULNOYE","CAMBRAI","POLE NATIONAL","SAINT HERBLAIN","YFFINIAC","BERCK","CAPSAAA 2","CERGY PONTOISE","CHARLEVILLE","LILLE 2","ORLEANS","PARIS BASKET","REIMS","SUD OISE SPORTS ET HANDICAPS","VALENCIENNES","AUXERRE","BELFORT","ENT CHALON DIJON 3","JARNY ","HAGUENAU","MULHOUSE","THIONVILLE","TROYES","VANDOEUVRE 2","ANGERS","CHAMBRAY","EQUEURDREVILLE","ENT LAVAL RENNES","LANNION 2","NIORT","QUIMPER","SAINT POL DE LEON","PAYS BASQUE EUSKADI","ASMTH","ENT BORDEAUX BLANQUEFORT 2","ENT CAUSSADE PAVIE 2","LA ROCHELLE","MONTPELLIER","TOULOUSE 2","LE CANNET 2","HYERES 2","MARSEILLE 2","ANGLET finale","BLANQUEFORT finale","CAMBRAI finale","LE PUY 2 finale","LYON finale","ORLEANS finale","STRASBOURG finale","GUILHERAND"],"not_rendered":{"charts":0,"images":105,"macros":1,"external_links":2,"defined_names":111,"comments":0,"pivot_tables":0},"unopened":[],"bounds":{"document_bytes":16777216,"sheet_cells":100000,"rows_first":2000,"rows_last":500,"rows_between":2000,"halvings":0,"cell_chars":16384,"cell_head_chars":4096},"cells_cut":0,"cells_raw":0,"read":"whole","date_system":"1900"}

{"sheet":"Accueil","index":0,"n_rows":0,"n_cols":0,"rows_kept":0,"cut":false,"hidden":false,"merged":[]}

{"sheet":"Elite Nationale Bastide Médical","index":1,"n_rows":39,"n_cols":41,"rows_kept":39,"cut":false,"hidden":false,"merged":[[24,7,24,8],[26,11,27,11],[24,10,25,10],[24,30,25,30],[24,11,25,11],[26,10,27,10],[29,3,30,11],[8,25,8,26],[5,3,5,11],[5,23,5,31],[6,3,6,11],[6,23,6,31],[29,23,30,31],[27,3,27,8],[27,23,27,28],[24,31,25,31],[26,30,27,30],[26,31,27,31],[25,3,25,8],[26,3,26,8],[25,23,25,28],[26,23,26,28]]}
[]
[]
[]
[]
[]
[null,null,null,"Equipe A",null,null,null,null,null,null,null,null,null,null,null,null,null,null,null,null,null,null,null,"Equipe B"]
[null,null,null,"MEAUX",null,null,null,null,null,null,null,null,null,null,null,null,null,null,null,null,null,null,null,"LE CANNET"]
[]
[null,null,null,"Carte","Pts","   Noms         /          Prénoms",null,"N°","Valeur","entrée en jeu","Sans Abattement","Bonus",null,"J","JF","F-FET","S-SF",null,"Valide","ET",null,null,null,"Carte","Pts","   Noms         /          Prénoms",null,"N°","Valeur","entrée en jeu","Sans Abattement","Bonus",null,"J","JF","F-FET","S-SF",null,"Valide","ET"]
[{"$f":"IF('Liste équipes'!A2=\"\",\"\",'Liste équipes'!A2)","v":""}]
[{"$f":"IF('Liste équipes'!A3=\"\",\"\",'Liste équipes'!A3)","v":"ENT CHALON DIJON BF"},null,null,null,null,null,null,null,{"$f":"IF(AND(D11=\"VAL\",E11<5),\"faux\",IF(D11=\"n\",E11,IF(D11=\"j\",E11,IF(D11=\"jf\",E11,IF(D11=\"f\",E11,IF(D11=\"fet\",E11,IF(D11=\"et\",E11,IF(AND(D11=\"\",E11=\"\"),\"\",E11))))))))","v":""},null,{"$f":"IF(AND(J11=\"X\",E11>0),I11,\"\")","v":""},{"$f":"IF(AND(J11=\"X\",D11=\"J\",E11<5),1,IF(AND(J11=\"X\",D11=\"JF\",E11<5),2,IF(AND(J11=\"X\",D11=\"F\",E11<5),1.5,IF(AND(J11=\"X\",D11=\"FET\",E11<5),1.5,\"\"))))","v":""},null,{"$f":"IF(AND(J11=\"X\",D11=\"J\"),1,\"\")","v":""},{"$f":"IF(AND(J11=\"X\",D11=\"JF\"),1,IF(AND(J11=\"X\",D11=\"SF\"),1,\"\"))","v":""},{"$f":"IF(AND(J11=\"X\",D11=\"F\"),1,IF(AND(J11=\"X\",D11=\"FET\"),1,\"\"))","v":""},{"$f":"IF(AND(J11=\"X\",D11=\"S\"),1,\"\")","v":""},{"$f":"IF(AND(J11=\"X\",E11>0),1,\"\")","v":""},{"$f":"IF(E11=5,1,\"\")","v":""},{"$f":"IF(AND(J11=\"X\",D11=\"ET\"),1,\"\")","v":""},null,null,null,null,null,null,null,null,{"$f":"IF(AND(X11=\"VAL\",Y11<5),\"faux\",IF(X11=\"n\",Y11,IF(X11=\"j\",Y11,IF(X11=\"jf\",Y11,IF(X11=\"f\",Y11,IF(X11=\"fet\",Y11,IF(X11=\"et\",Y11,IF(AND(X11=\"\",Y11=\"\"),\"\",Y11))))))))","v":""},null,{"$f":"IF(AND(AD11=\"X\",Y11>0),AC11,\"\")","v":""},{"$f":"IF(AND(AD11=\"X\",X11=\"J\",Y11<5),1,IF(AND(AD11=\"X\",X11=\"JF\",Y11<5),2,IF(AND(AD11=\"X\",X11=\"F\",Y11<5),1.5,IF(AND(AD11=\"X\",X11=\"FET\",Y11<5),1.5,\"\"))))","v":""},null,{"$f":"IF(AND(AD11=\"X\",X11=\"J\"),1,\"\")","v":""},{"$f":"IF(AND(AD11=\"X\",X11=\"JF\"),1,IF(AND(AD11=\"X\",X11=\"SF\"),1,\"\"))","v":""},{"$f":"IF(AND(AD11=\"X\",X11=\"F\"),1,IF(AND(AD11=\"X\",X11=\"FET\"),1,\"\"))","v":""},{"$f":"IF(AND(AD11=\"X\",X11=\"S\"),1,\"\")","v":""},{"$f":"IF(AND(AD11=\"X\",Y11>0),1,\"\")","v":""},{"$f":"IF(Y11=5,1,\"\")","v":""},{"$f":"IF(AND(AD11=\"X\",X11=\"ET\"),1,\"\")","v":""},{"$f":"IF(AND(AD11=\"X\",X11=\"ET\"),1,\"\")","v":""}]
[{"$f":"IF('Liste équipes'!A4=\"\",\"\",'Liste équipes'!A4)","v":"HURRICANE92"},null,null,null,null,null,null,null,{"$f":"IF(AND(D12=\"VAL\",E12<5),\"faux\",IF(D12=\"n\",E12,IF(D12=\"j\",E12,IF(D12=\"jf\",E12,IF(D12=\"f\",E12,IF(D12=\"fet\",E12,IF(D12=\"et\",E12,IF(AND(D12=\"\",E12=\"\"),\"\",E12))))))))","v":""},null,{"$f":"IF(AND(J12=\"X\",E12>0),I12,\"\")","v":""},{"$f":"IF(AND(J12=\"X\",D12=\"J\",E12<5),1,IF(AND(J12=\"X\",D12=\"JF\",E12<5),2,IF(AND(J12=\"X\",D12=\"F\",E12<5),1.5,IF(AND(J12=\"X\",D12=\"FET\",E12<5),1.5,\"\"))))","v":""},null,{"$f":"IF(AND(J12=\"X\",D12=\"J\"),1,\"\")","v":""},{"$f":"IF(AND(J12=\"X\",D12=\"JF\"),1,\"\")","v":""},{"$f":"IF(AND(J12=\"X\",D12=\"F\"),1,IF(AND(J12=\"X\",D12=\"FET\"),1,\"\"))","v":""},{"$f":"IF(AND(J12=\"X\",D12=\"S\"),1,\"\")","v":""},{"$f":"IF(AND(J12=\"X\",E12>0),1,\"\")","v":""},{"$f":"IF(E12=5,1,\"\")","v":""},{"$f":"IF(AND(J12=\"X\",D12=\"ET\"),1,\"\")","v":""},null,null,null,null,null,null,null,null,{"$f":"IF(AND(X12=\"VAL\",Y12<5),\"faux\",IF(X12=\"n\",Y12,IF(X12=\"j\",Y12,IF(X12=\"jf\",Y12,IF(X12=\"f\",Y12,IF(X12=\"fet\",Y12,IF(X12=\"et\",Y12,IF(AND(X12=\"\",Y12=\"\"),\"\",Y12))))))))","v":""},null,{"$f":"IF(AND(AD12=\"X\",Y12>0),AC12,\"\")","v":""},{"$f":"IF(AND(AD12=\"X\",X12=\"J\",Y12<5),1,IF(AND(AD12=\"X\",X12=\"JF\",Y12<5),2,IF(AND(AD12=\"X\",X12=\"F\",Y12<5),1.5,IF(AND(AD12=\"X\",X12=\"FET\",Y12<5),1.5,\"\"))))","v":""},null,{"$f":"IF(AND(AD12=\"X\",X12=\"J\"),1,\"\")","v":""},{"$f":"IF(AND(AD12=\"X\",X12=\"JF\"),1,\"\")","v":""},{"$f":"IF(AND(AD12=\"X\",X12=\"F\"),1,IF(AND(AD12=\"X\",X12=\"FET\"),1,\"\"))","v":""},{"$f":"IF(AND(AD12=\"X\",X12=\"S\"),1,\"\")","v":""},{"$f":"IF(AND(AD12=\"X\",Y12>0),1,\"\")","v":""},{"$f":"IF(Y12=5,1,\"\")","v":""},{"$f":"IF(AND(AD12=\"X\",X12=\"ET\"),1,\"\")","v":""},{"$f":"IF(AND(AD12=\"X\",X12=\"ET\"),1,\"\")","v":""}]
[{"$f":"IF('Liste équipes'!A5=\"\",\"\",'Liste équipes'!A5)","v":"HYERES"},null,null,null,null,null,null,null,"",null,"","",null,"","","","","","","",null,null,null,null,null,null,null,null,"",null,"","",null,"","","","","","","",""]
[{"$f":"IF('Liste équipes'!A6=\"\",\"\",'Liste équipes'!A6)","v":"LANNION"},null,null,null,null,null,null,null,"",null,"","",null,"","","","","","","",null,null,null,null,null,null,null,null,"",null,"","",null,"","","","","","","",""]
[{"$f":"IF('Liste équipes'!A7=\"\",\"\",'Liste équipes'!A7)","v":"LE CANNET"},null,null,null,null,null,null,null,"",null,"","",null,"","","","","","","",null,null,null,null,null,null,null,null,"",null,"","",null,"","","","","","","",""]
[{"$f":"IF('Liste équipes'!A8=\"\",\"\",'Liste équipes'!A8)","v":"LE PUY"},null,null,null,null,null,null,null,"",null,"","",null,"","","","","","","",null,null,null,null,null,null,null,null,"",null,"","",null,"","","","","","","",""]
[{"$f":"IF('Liste équipes'!A9=\"\",\"\",'Liste équipes'!A9)","v":"LILLE"},null,null,null,null,null,null,null,"",null,"","",null,"","","","","","","",null,null,null,null,null,null,null,null,"",null,"","",null,"","","","","","","",""]
[{"$f":"IF('Liste équipes'!A10=\"\",\"\",'Liste équipes'!A10)","v":"MARSEILLE"},null,null,null,null,null,null,null,"",null,"","",null,"","","","","","","",null,null,null,null,null,null,null,null,"",null,"","",null,"","","","","","","",""]
[{"$f":"IF('Liste équipes'!A11=\"\",\"\",'Liste équipes'!A11)","v":"MEAUX"},null,null,null,null,null,null,null,"",null,"","",null,"","","","","","","",null,null,null,null,null,null,null,null,"",null,"","",null,"","","","","","","",""]
[{"$f":"IF('Liste équipes'!A12=\"\",\"\",'Liste équipes'!A12)","v":"TOULOUSE"},null,null,null,null,null,null,null,"",null,"","",null,"","","","","","","",null,null,null,null,null,null,null,null,"",null,"","",null,"","","","","","","",""]
[{"$f":"IF('Liste équipes'!A15=\"\",\"\",'Liste équipes'!A15)","v":""},null,null,null,null,null,null,null,"",null,"","",null,"","","","","","","",null,null,null,null,null,null,null,null,"",null,"","",null,"","","","","","","",""]
[{"$f":"IF('Liste équipes'!A16=\"\",\"\",'Liste équipes'!A16)","v":""},null,null,null,null,null,null,null,"",null,"","",null,"","","","","","","",null,null,null,null,null,null,null,null,"",null,"","",null,"","","","","","","",""]
[null,null,null,null,null,null,null,null,null,null,null,null,null,"","","","","","","",null,null,null,null,null,null,null,null,null,null,null,null,null,"","","","","","","",""]
[null,null,null,null,null,null,null,null,null,null,null,null,null,"","","","","","","",null,null,null,null,null,null,null,null,null,null,null,null,null,"","","","","","","",""]
[null,null,null,"  Nombre joueurs sur le terrain",null,null,{"$f":"IF(J25>5,\"\",\"OK\")","v":""},{"$f":"IF(R25>5,\"PAS OK\",\"\")","v":""},null,{"$f":"IF(L27=\"\",\"\",R25)","v":""},"Points en jeu","Points autorisés",null,{"$f":"SUM(N11:N24)","v":0},0,0,0,0,0,0,null,null,null,"  Nombre joueurs sur le terrain",null,null,{"$f":"IF(AD25>5,\"\",\"OK\")","v":""},{"$f":"IF(AL25>5,\"Pas OK >5\",\"\")","v":""},null,{"$f":"IF(AF27=\"\",\"\",AL25)","v":""},"Points en jeu","Points autorisés",null,{"$f":"SUM(AH11:AH24)","v":0},0,0,0,0,0,0,0]
[null,null,null,null,null,null,null,null,null,null,null,null,null,{"$f":"IF(N25=0,\"\",IF(N25=1,17,IF(N25=2,18.5,IF(N25=3,19,IF(N25>3,19,IF(N25>4,19,IF(N25>5,19,\"\")))))))","v":""},{"$f":"IF(O25=0,\"\",IF(O25=1,18,IF(O25=2,19,IF(O25=3,19,IF(O25=4,19,IF(O25=4,19,\"\"))))))","v":""},{"$f":"IF(P25=0,\"\",IF(P25=1,17,IF(P25=2,18.5,IF(P25=3,19,IF(P25=4,19,IF(P25=5,17.5,\"\"))))))","v":""},{"$f":"IF(Q25=0,\"\",IF(Q25=1,16,IF(Q25=2,16.5,IF(Q25=3,17,IF(Q25=4,17.5,IF(Q25=5,18,IF(Q25=6,18.5,IF(Q25=7,19,IF(Q25=8,19,IF(Q25=9,19,IF(Q25=10,19,IF(Q25=11,19,IF(Q25=12,19,\"\")))))))))))))","v":""},{"$f":"IF(AND(O26=16.5,P26=16),17.5,IF(AND(N26=15.5,P26=16),17,IF(AND(N26=15.5,O26=16.5),17.5,IF(AND(N26=16.5,P26=16),17.5,IF(AND(N25=2,O26=16.5),17.5,\"\")))))","v":""},null,null,null,null,null,null,null,null,null,null,null,null,null,null,null,{"$f":"IF(AH25=0,\"\",IF(AH25=1,17,IF(AH25=2,18.5,IF(AH25=3,19,IF(AH25>3,19,IF(AH25>4,19,IF(AH25>5,19,\"\")))))))","v":""},{"$f":"IF(AI25=0,\"\",IF(AI25=1,18,IF(AI25=2,19,IF(AI25=3,19,IF(AI25=4,19,IF(AI25=4,19,\"\"))))))","v":""},{"$f":"IF(AJ25=0,\"\",IF(AJ25=1,17,IF(AJ25=2,18.5,IF(AJ25=3,19,IF(AJ25=4,19,IF(AJ25=5,17.5,\"\"))))))","v":""},{"$f":"IF(AK25=0,\"\",IF(AK25=1,16,IF(AK25=2,16.5,IF(AK25=3,17,IF(AK25=4,17.5,IF(AK25=5,18,IF(AK25=6,18.5,IF(AK25=7,19,IF(AK25=8,19,IF(AK25=9,19,IF(AK25=10,19,IF(AK25=11,19,IF(AK25=12,19,\"\")))))))))))))","v":""},{"$f":"IF(AND(AI26=16.5,AJ26=16),17.5,IF(AND(AH26=15.5,AJ26=16),17,IF(AND(AH26=15.5,AI26=16.5),17.5,IF(AND(AH26=16.5,AJ26=16),17.5,IF(AND(AH25=2,AI26=16.5),17.5,\"\")))))","v":""}]
[null,null," ",{"$f":"IF(K27>L27,\"Trop de points en jeu\",\"\")","v":""},null,null,null,null,null,null,{"$f":"IF(O28>0,O28,\"\")","v":""},{"$f":"IF(O28=0,\"\",Q28)","v":""},null,{"$f":"SUM(N26)","v":0},{"$f":"SUM(O26)","v":0},{"$f":"SUM(P26)","v":0},{"$f":"SUM(Q26)","v":0},{"$f":"SUM(R26)","v":0},null,null,null,null," ",{"$f":"IF(AE27>AF27,\"Trop de points en jeu\",\"\")","v":""},null,null,null,null,null,null,{"$f":"IF(AI28>0,AI28,\"\")","v":""},{"$f":"IF(AI28=0,\"\",AK28)","v":""},null,{"$f":"SUM(AH26)","v":0},{"$f":"SUM(AI26)","v":0},{"$f":"SUM(AJ26)","v":0},{"$f":"SUM(AK26)","v":0},{"$f":"SUM(AL26)","v":0}]
[null,null,null,{"$f":"IF(S25>1,\"Trop de joueurs  valides inscrits sur la feuille\",\"\")","v":""},null,null,null,null,null,null,null,null,null,{"$f":"SUM(L11:L24)","v":0},{"$f":"SUM(K11:K24)","v":0},{"$f":"SUM(N28+14.5)","v":14.5},{"$f":"IF(P28>17.5,17.5,P28)","v":14.5},{"$f":"SUM(R25)","v":0},null,null,null,null,null,{"$f":"IF(AM25>1,\"Trop de joueurs  valides inscrits sur la feuille\",\"\")","v":""},null,null,null,null,null,null,null,null,null,{"$f":"SUM(AF11:AF24)","v":0},{"$f":"SUM(AE11:AE24)","v":0},{"$f":"SUM(AH28+14.5)","v":14.5},{"$f":"IF(AJ28>17.5,17.5,AJ28)","v":14.5}]
[]
[]
[]
[]
[]
[]
[]
[]
[]
[]
[null,null,null,null,null,null,null,null,null,","]

{"sheet":"Nationale_1","index":2,"n_rows":31,"n_cols":41,"rows_kept":31,"cut":false,"hidden":false,"merged":[[29,23,30,31],[29,3,30,11],[24,31,25,31],[26,30,27,30],[24,10,25,10],[24,30,25,30],[26,11,27,11],[25,3,25,8],[26,3,26,8],[25,23,25,28],[24,11,25,11],[27,23,27,28],[27,3,27,8],[26,10,27,10],[26,23,26,28],[26,31,27,31],[24,7,24,8],[5,23,5,31],[5,3,5,11],[6,3,6,11],[6,23,6,31],[8,25,8,26]]}
[]
[]
[]
[]
[]
[null,null,null,"Equipe A",null,null,null,null,null,null,null,null,null,null,null,null,null,null,null,null,null,null,null,"Equipe B"]
[null,null,null,"ENT BORDEAUX BLANQUEFORT",null,null,null,null,null,null,null,null,null,null,null,null,null,null,null,null,null,null,null,"CAPSAAA"]
[]
[null,null,null,"Carte","Pts","   Noms         /          Prénoms",null,"N°","Valeur","entrée en jeu","Sans Abattement","Bonus",null,"J","JF","F-FET","S-SF",null,"Valide","ET",null,null,null,"Carte","Pts","   Noms         /          Prénoms",null,"N°","Valeur","entrée en jeu","Sans Abattement","Bonus",null,"J","JF","F-FET","S-SF",null,"Valide","ET"]
[]
[null,null,null,null,null,null,null,null,{"$f":"IF(AND(D11=\"\",E11=5),5,IF(AND(D11=\"VAL\",E11<5),\"faux\",IF(D11=\"j\",E11,IF(D11=\"jf\",E11,IF(D11=\"f\",E11,IF(D11=\"fet\",E11,IF(D11=\"et\",E11,IF(AND(D11=\"\",E11=\"\"),\"\",E11))))))))","v":""},null,{"$f":"IF(AND(J11=\"X\",E11>0),I11,\"\")","v":""},{"$f":"IF(AND(J11=\"X\",D11=\"J\",E11<5),1.5,IF(AND(J11=\"X\",D11=\"JF\",E11<5),2.5,IF(AND(J11=\"X\",D11=\"F\",E11<5),1.5,IF(AND(J11=\"X\",D11=\"FET\",E11<5),1.5,\"\"))))","v":""},null,{"$f":"IF(AND(J11=\"X\",D11=\"J\"),1,\"\")","v":""},{"$f":"IF(AND(J11=\"X\",D11=\"JF\"),1,IF(AND(J11=\"X\",D11=\"SF\"),1,\"\"))","v":""},{"$f":"IF(AND(J11=\"X\",D11=\"F\"),1,IF(AND(J11=\"X\",D11=\"FET\"),1,\"\"))","v":""},{"$f":"IF(AND(J11=\"X\",D11=\"S\"),1,\"\")","v":""},{"$f":"IF(AND(J11=\"X\",E11>0),1,\"\")","v":""},{"$f":"IF(E11=5,1,\"\")","v":""},{"$f":"IF(AND(D11=\"ET\",J11=\"X\"),1,\"\")","v":""},{"$f":"IF(AND(J11=\"X\",D11=\"ET\"),1,\"\")","v":""},null,null,null,null,null,null,null,{"$f":"IF(AND(X11=\"\",Y11=5),5,IF(AND(X11=\"VAL\",Y11<5),\"faux\",IF(X11=\"j\",Y11,IF(X11=\"jf\",Y11,IF(X11=\"f\",Y11,IF(X11=\"fet\",Y11,IF(X11=\"et\",Y11,IF(AND(X11=\"\",Y11=\"\"),\"\",Y11))))))))","v":""},null,{"$f":"IF(AND(AD11=\"X\",Y11>0),AC11,\"\")","v":""},{"$f":"IF(AND(AD11=\"X\",X11=\"J\",Y11<5),1.5,IF(AND(AD11=\"X\",X11=\"JF\",Y11<5),2.5,IF(AND(AD11=\"X\",X11=\"F\",Y11<5),1.5,IF(AND(AD11=\"X\",X11=\"FET\",Y11<5),1.5,\"\"))))","v":""},null,{"$f":"IF(AND(AD11=\"X\",X11=\"J\"),1,\"\")","v":""},{"$f":"IF(AND(AD11=\"X\",X11=\"JF\"),1,IF(AND(AD11=\"X\",X11=\"SF\"),1,\"\"))","v":""},{"$f":"IF(AND(AD11=\"X\",X11=\"F\"),1,IF(AND(AD11=\"X\",X11=\"FET\"),1,\"\"))","v":""},{"$f":"IF(AND(AD11=\"X\",X11=\"S\"),1,\"\")","v":""},{"$f":"IF(AND(AD11=\"X\",Y11>0),1,\"\")","v":""},{"$f":"IF(Y11=5,1,\"\")","v":""},{"$f":"IF(AND(X11=\"ET\",AD11=\"X\"),1,\"\")","v":""},{"$f":"IF(AND(AD11=\"X\",X11=\"ET\"),1,\"\")","v":""}]
[{"$f":"IF('Liste équipes'!B3=\"\",\"\",'Liste équipes'!B3)","v":""},null,null,null,null,null,null,null,{"$f":"IF(AND(D12=\"\",E12=5),5,IF(AND(D12=\"VAL\",E12<5),\"faux\",IF(D12=\"j\",E12,IF(D12=\"jf\",E12,IF(D12=\"f\",E12,IF(D12=\"fet\",E12,IF(D12=\"et\",E12,IF(AND(D12=\"\",E12=\"\"),\"\",E12))))))))","v":""},null,{"$f":"IF(AND(J12=\"X\",E12>0),I12,\"\")","v":""},{"$f":"IF(AND(J12=\"X\",D12=\"J\",E12<5),1.5,IF(AND(J12=\"X\",D12=\"JF\",E12<5),2.5,IF(AND(J12=\"X\",D12=\"F\",E12<5),1.5,IF(AND(J12=\"X\",D12=\"FET\",E12<5),1.5,\"\"))))","v":""},null,{"$f":"IF(AND(J12=\"X\",D12=\"J\"),1,\"\")","v":""},{"$f":"IF(AND(J12=\"X\",D12=\"JF\"),1,\"\")","v":""},{"$f":"IF(AND(J12=\"X\",D12=\"F\"),1,IF(AND(J12=\"X\",D12=\"FET\"),1,\"\"))","v":""},{"$f":"IF(AND(J12=\"X\",D12=\"S\"),1,\"\")","v":""},{"$f":"IF(AND(J12=\"X\",E12>0),1,\"\")","v":""},{"$f":"IF(E12=5,1,\"\")","v":""},{"$f":"IF(AND(D12=\"ET\",J12=\"X\"),1,\"\")","v":""},{"$f":"IF(AND(J12=\"X\",D12=\"ET\"),1,\"\")","v":""},null,null,null,null,null,null,null,{"$f":"IF(AND(X12=\"\",Y12=5),5,IF(AND(X12=\"VAL\",Y12<5),\"faux\",IF(X12=\"j\",Y12,IF(X12=\"jf\",Y12,IF(X12=\"f\",Y12,IF(X12=\"fet\",Y12,IF(X12=\"et\",Y12,IF(AND(X12=\"\",Y12=\"\"),\"\",Y12))))))))","v":""},null,{"$f":"IF(AND(AD12=\"X\",Y12>0),AC12,\"\")","v":""},{"$f":"IF(AND(AD12=\"X\",X12=\"J\",Y12<5),1.5,IF(AND(AD12=\"X\",X12=\"JF\",Y12<5),2.5,IF(AND(AD12=\"X\",X12=\"F\",Y12<5),1.5,IF(AND(AD12=\"X\",X12=\"FET\",Y12<5),1.5,\"\"))))","v":""},null,{"$f":"IF(AND(AD12=\"X\",X12=\"J\"),1,\"\")","v":""},{"$f":"IF(AND(AD12=\"X\",X12=\"JF\"),1,\"\")","v":""},{"$f":"IF(AND(AD12=\"X\",X12=\"F\"),1,IF(AND(AD12=\"X\",X12=\"FET\"),1,\"\"))","v":""},{"$f":"IF(AND(AD12=\"X\",X12=\"S\"),1,\"\")","v":""},{"$f":"IF(AND(AD12=\"X\",Y12>0),1,\"\")","v":""},{"$f":"IF(Y12=5,1,\"\")","v":""},{"$f":"IF(AND(X12=\"ET\",AD12=\"X\"),1,\"\")","v":""},{"$f":"IF(AND(AD12=\"X\",X12=\"ET\"),1,\"\")","v":""}]
[{"$f":"IF('Liste équipes'!B4=\"\",\"\",'Liste équipes'!B4)","v":"ENT BORDEAUX BLANQUEFORT"},null,null,null,null,null,null,null,"",null,"","",null,"","","","","","","","",null,null,null,null,null,null,null,"",null,"","",null,"","","","","","","",""]
[{"$f":"IF('Liste équipes'!B5=\"\",\"\",'Liste équipes'!B5)","v":"CAPSAAA"},null,null,null,null,null,null,null,"",null,"","",null,"","","","","","","","",null,null,null,null,null,null,null,"",null,"","",null,"","","","","","","",""]
[{"$f":"IF('Liste équipes'!B6=\"\",\"\",'Liste équipes'!B6)","v":"ENT CAUSSADE PAVIE"},null,null,null,null,null,null,null,"",null,"","",null,"","","","","","","","",null,null,null,null,null,null,null,"",null,"","",null,"","","","","","","",""]
[{"$f":"IF('Liste équipes'!B7=\"\",\"\",'Liste équipes'!B7)","v":"ENT CHALON DIJON BF 2"},null,null,null,null,null,null,null,"",null,"","",null,"","","","","","","","",null,null,null,null,null,null,null,"",null,"","",null,"","","","","","","",""]
[{"$f":"IF('Liste équipes'!B8=\"\",\"\",'Liste équipes'!B8)","v":"ENT LYON GUILHERAND"},null,null,null,null,null,null,null,"",null,"","",null,"","","","","","","","",null,null,null,null,null,null,null,"",null,"","",null,"","","","","","","",""]
[{"$f":"IF('Liste équipes'!B9=\"\",\"\",'Liste équipes'!B9)","v":"DOUAI"},null,null,null,null,null,null,null,"",null,"","",null,"","","","","","","","",null,null,null,null,null,null,null,"",null,"","",null,"","","","","","","",""]
[{"$f":"IF('Liste équipes'!B10=\"\",\"\",'Liste équipes'!B10)","v":"FEURS"},null,null,null,null,null,null,null,"",null,"","",null,"","","","","","","","",null,null,null,null,null,null,null,"",null,"","",null,"","","","","","","",""]
[{"$f":"IF('Liste équipes'!B11=\"\",\"\",'Liste équipes'!B11)","v":"MEAUX 2"},null,null,null,null,null,null,null,"",null,"","",null,"","","","","","","","",null,null,null,null,null,null,null,"",null,"","",null,"","","","","","","",""]
[{"$f":"IF('Liste équipes'!B12=\"\",\"\",'Liste équipes'!B12)","v":"MEYLAN"},null,null,null,null,null,null,null,"",null,"","",null,"","","","","","","","",null,null,null,null,null,null,null,"",null,"","",null,"","","","","","","",""]
[{"$f":"IF('Liste équipes'!B13=\"\",\"\",'Liste équipes'!B13)","v":"STRASBOURG"},null,null,null,null,null,null,null,"",null,"","",null,"","","","","","","","",null,null,null,null,null,null,null,"",null,"","",null,"","","","","","","",""]
[null,null,null,null,null,null,null,null,null,null,null,null,null,"","","","","","","","",null,null,null,null,null,null,null,null,null,null,null,null,"","","","","","","",""]
[null,null,null,null,null,null,null,null,null,null,null,null,null,"","","","","","","","",null,null,null,null,null,null,null,null,null,null,null,null,"","","","","","","",""]
[null,null,null,"  Nombre joueurs sur le terrain",null,null,{"$f":"IF(J25>5,\"\",\"OK\")","v":""},{"$f":"IF(R25>5,\"PAS OK\",\"\")","v":""},null,{"$f":"IF(L27=\"\",\"\",R25)","v":""},"Points en jeu","Avec Bonus maxi 17 pts",null,{"$f":"SUM(N11:N24)","v":0},0,0,0,0,0,0,0,null,null,"  Nombre joueurs sur le terrain",null,null,{"$f":"IF(AD25>5,\"\",\"OK\")","v":""},{"$f":"IF(AL25>5,\"Pas OK >5\",\"\")","v":""},null,{"$f":"IF(AF27=\"\",\"\",AL25)","v":""},"Points en jeu","Avec Bonus maxi 17 pts",null,{"$f":"SUM(AH11:AH24)","v":0},0,0,0,0,0,0,0]
[null,null,null,{"$f":"IF(AND(I11=\"faux\",E11<4.5),\"Valide toujours 5 pts\",IF(AND(I12=\"faux\",E12<4.5),\"Valide toujours 5 pts\",IF(AND(I13=\"faux\",E13<4.5),\"Valide toujours 5 pts\",IF(AND(I14=\"faux\",E14<4.5),\"Valide toujours 5 pts\",IF(AND(I15=\"faux\",E15<4.5),\"Valide toujours 5 pts\",IF(AND(I16=\"faux\",E16<4.5),\"Valide toujours 5 pts\",IF(AND(I17=\"faux\",E17<4.5),\"Valide toujours 5 pts\",IF(AND(I18=\"faux\",E18<4.5),\"Valide toujours 5 pts\",IF(AND(I19=\"faux\",E19<4.5),\"Valide toujours 5 pts\",IF(AND(I20=\"faux\",E20<4.5),\"Valide toujours 5 pts\",IF(AND(I21=\"faux\",E21<4.5),\"Valide toujours 5 pts\",IF(AND(I22=\"faux\",E22<4.5),\"Valide toujours 5 pts\",\"\"))))))))))))","v":""},null,null,null,null,null,null,null,null,null,{"$f":"IF(N25=0,\"\",IF(N25=1,17,IF(N25=2,18.5,IF(N25=3,19,IF(N25>3,19,IF(N25>4,19,IF(N25>5,19,\"\")))))))","v":""},{"$f":"IF(O25=0,\"\",IF(O25=1,18,IF(O25=2,19,IF(O25=3,19,IF(O25=4,19,IF(O25=4,19,\"\"))))))","v":""},{"$f":"IF(P25=0,\"\",IF(P25=1,17,IF(P25=2,18.5,IF(P25=3,19,IF(P25=4,19,IF(P25=5,17.5,\"\"))))))","v":""},{"$f":"IF(Q25=0,\"\",IF(Q25=1,16,IF(Q25=2,16.5,IF(Q25=3,17,IF(Q25=4,17.5,IF(Q25=5,18,IF(Q25=6,18.5,IF(Q25=7,19,IF(Q25=8,19,IF(Q25=9,19,IF(Q25=10,19,IF(Q25=11,19,IF(Q25=12,19,\"\")))))))))))))","v":""},{"$f":"IF(AND(O26=16.5,P26=16),17.5,IF(AND(N26=15.5,P26=16),17,IF(AND(N26=15.5,O26=16.5),17.5,IF(AND(N26=16.5,P26=16),17.5,IF(AND(N25=2,O26=16.5),17.5,\"\")))))","v":""},null,null,null,null,null,{"$f":"IF(AND(AC11=\"faux\",Y11<4.5),\"Valide toujours 5 pts\",IF(AND(AC12=\"faux\",Y12<4.5),\"Valide toujours 5 pts\",IF(AND(AC13=\"faux\",Y13<4.5),\"Valide toujours 5 pts\",IF(AND(AC14=\"faux\",Y14<4.5),\"Valide toujours 5 pts\",IF(AND(AC15=\"faux\",Y15<4.5),\"Valide toujours 5 pts\",IF(AND(AC16=\"faux\",Y16<4.5),\"Valide toujours 5 pts\",IF(AND(AC17=\"faux\",Y17<4.5),\"Valide toujours 5 pts\",IF(AND(AC18=\"faux\",Y18<4.5),\"Valide toujours 5 pts\",IF(AND(AC19=\"faux\",Y19<4.5),\"Valide toujours 5 pts\",IF(AND(AC20=\"faux\",Y20<4.5),\"Valide toujours 5 pts\",IF(AND(AC21=\"faux\",Y21<4.5),\"Valide toujours 5 pts\",IF(AND(AC22=\"faux\",Y22<4.5),\"Valide toujours 5 pts\",\"\"))))))))))))","v":""},null,null,null,null,null,null,null,null,null,{"$f":"IF(AH25=0,\"\",IF(AH25=1,17,IF(AH25=2,18.5,IF(AH25=3,19,IF(AH25>3,19,IF(AH25>4,19,IF(AH25>5,19,\"\")))))))","v":""},{"$f":"IF(AI25=0,\"\",IF(AI25=1,18,IF(AI25=2,19,IF(AI25=3,19,IF(AI25=4,19,IF(AI25=4,19,\"\"))))))","v":""},{"$f":"IF(AJ25=0,\"\",IF(AJ25=1,17,IF(AJ25=2,18.5,IF(AJ25=3,19,IF(AJ25=4,19,IF(AJ25=5,17.5,\"\"))))))","v":""},{"$f":"IF(AK25=0,\"\",IF(AK25=1,16,IF(AK25=2,16.5,IF(AK25=3,17,IF(AK25=4,17.5,IF(AK25=5,18,IF(AK25=6,18.5,IF(AK25=7,19,IF(AK25=8,19,IF(AK25=9,19,IF(AK25=10,19,IF(AK25=11,19,IF(AK25=12,19,\"\")))))))))))))","v":""},{"$f":"IF(AND(AI26=16.5,AJ26=16),17.5,IF(AND(AH26=15.5,AJ26=16),17,IF(AND(AH26=15.5,AI26=16.5),17.5,IF(AND(AH26=16.5,AJ26=16),17.5,IF(AND(AH25=2,AI26=16.5),17.5,\"\")))))","v":""}]
[null,null," ",{"$f":"IF(K27>L27,\"Trop de points en jeu\",\"\")","v":""},null,null,null,null,null,null,{"$f":"IF(O28>0,O28,\"\")","v":""},{"$f":"IF(O28=0,\"\",Q28)","v":""},null,{"$f":"SUM(N26)","v":0},{"$f":"SUM(O26)","v":0},{"$f":"SUM(P26)","v":0},{"$f":"SUM(Q26)","v":0},{"$f":"SUM(R26)","v":0},null,null,null,null," ",{"$f":"IF(AE27>AF27,\"Trop de points en jeu\",\"\")","v":""},null,null,null,null,null,null,{"$f":"IF(AI28>0,AI28,\"\")","v":""},{"$f":"IF(AI28=0,\"\",AK28)","v":""},null,{"$f":"SUM(AH26)","v":0},{"$f":"SUM(AI26)","v":0},{"$f":"SUM(AJ26)","v":0},{"$f":"SUM(AK26)","v":0},{"$f":"SUM(AL26)","v":0}]
[null,null,null,{"$f":"IF(S25>1,\"Trop de joueurs  valides inscrits sur la feuille\",\"\")","v":""},null,null,null,null,null,null,null,null,null,{"$f":"SUM(L11:L24)","v":0},{"$f":"SUM(K11:K24)","v":0},{"$f":"SUM(N28+14.5)","v":14.5},{"$f":"IF(P28>17.5,17.5,P28)","v":14.5},{"$f":"SUM(R25)","v":0},null,{"$f":"SUM(T30:T31)","v":0},null,null,null,{"$f":"IF(AM25>1,\"Trop de joueurs  valides inscrits sur la feuille\",\"\")","v":""},null,null,null,null,null,null,null,null,null,{"$f":"SUM(AF11:AF24)","v":0},{"$f":"SUM(AE11:AE24)","v":0},{"$f":"SUM(AH28+14.5)","v":14.5},{"$f":"IF(AJ28>17.5,17.5,AJ28)","v":14.5},null,null,{"$f":"SUM(AN30:AN31)","v":0}]
[]
[null,null,null,{"$f":"IF(T28>5,\"Pas OK. Trop de joueurs étrangers sur la feuille (ET), vérifier la liste.\",IF(T25>4,\"Pas OK. Trop de joueurs étrangers en jeu (ET), vérifier la liste.\",\"\"))","v":""},null,null,null,null,null,null,null,null,null,{"$f":"IF(D11=\"ET\",1,\"\")","v":""},{"$f":"IF(D12=\"ET\",1,\"\")","v":""},{"$f":"IF(D13=\"ET\",1,\"\")","v":""},{"$f":"IF(D14=\"ET\",1,\"\")","v":""},{"$f":"IF(D15=\"ET\",1,\"\")","v":""},{"$f":"IF(D16=\"ET\",1,\"\")","v":""},{"$f":"SUM(N30:S30)","v":0},null,null,null,{"$f":"IF(AN28>5,\"Pas OK. Trop de joueurs étrangers sur la feuille (ET), vérifier la liste.\",IF(AN25>4,\"Pas OK. Trop de joueurs étrangers en jeu (ET), vérifier la liste.\",\"\"))","v":""},null,null,null,null,null,null,null,null,null,{"$f":"IF(X11=\"ET\",1,\"\")","v":""},{"$f":"IF(X12=\"ET\",1,\"\")","v":""},{"$f":"IF(X13=\"ET\",1,\"\")","v":""},{"$f":"IF(X14=\"ET\",1,\"\")","v":""},{"$f":"IF(X15=\"ET\",1,\"\")","v":""},{"$f":"IF(X16=\"ET\",1,\"\")","v":""},{"$f":"SUM(AH30:AM30)","v":0}]
[null,null,null,null,null,null,null,null,null,null,null,null,null,{"$f":"IF(D17=\"ET\",1,\"\")","v":""},{"$f":"IF(D18=\"ET\",1,\"\")","v":""},{"$f":"IF(D19=\"ET\",1,\"\")","v":""},{"$f":"IF(D20=\"ET\",1,\"\")","v":""},{"$f":"IF(D21=\"ET\",1,\"\")","v":""},{"$f":"IF(D22=\"ET\",1,\"\")","v":""},{"$f":"SUM(N31:S31)","v":0},null,null,null,null,null,null,null,null,null,null,null,null,null,{"$f":"IF(X17=\"ET\",1,\"\")","v":""},{"$f":"IF(X18=\"ET\",1,\"\")","v":""},{"$f":"IF(X19=\"ET\",1,\"\")","v":""},{"$f":"IF(X20=\"ET\",1,\"\")","v":""},{"$f":"IF(X21=\"ET\",1,\"\")","v":""},{"$f":"IF(X22=\"ET\",1,\"\")","v":""},{"$f":"SUM(AH31:AM31)","v":0}]

{"sheet":"Nationale_2_poule_A","index":3,"n_rows":31,"n_cols":42,"rows_kept":31,"cut":false,"hidden":false,"merged":[[34,23,40,23],[5,23,5,31],[26,3,26,8],[26,11,27,11],[25,23,25,28],[26,23,26,28],[26,31,27,31],[25,3,25,8],[6,3,6,11],[6,23,6,31],[5,3,5,11],[8,25,8,26],[24,10,25,10],[24,7,24,8],[24,11,25,11],[26,10,27,10],[29,3,30,11],[24,31,25,31],[26,30,27,30],[24,27,24,28],[24,30,25,30],[29,23,30,31],[27,23,27,28],[27,3,27,8]]}
[]
[]
[]
[]
[]
[null,null,null,"Equipe A",null,null,null,null,null,null,null,null,null,null,null,null,null,null,null,null,null,null,null,"Equipe B"]
[null,null,null,"VANDOEUVRE",null,null,null,null,null,null,null,null,null,null,null,null,null,null,null,null,null,null,null,"LE PUY 2"]
[]
[null,null,null,"Carte","Pts","   Noms         /          Prénoms",null,"N°","Valeur","entrée en jeu","Sans Abattement","Bonus",null,"J","JF","F-FET","S-SF",null,"Valide","ET",null,null,null,"Carte","Pts","   Noms         /          Prénoms",null,"N°","Valeur","entrée en jeu","Sans Abattement","Bonus",null,"J","JF","F-FET","S-SF",null,"Valide","ET"]
[]
[null,null,null,null,null,null,null,null,{"$f":"IF(AND(D11=\"\",E11=5),5,IF(AND(D11=\"VAL\",E11<5),\"faux\",IF(D11=\"j\",E11,IF(D11=\"jf\",E11,IF(D11=\"f\",E11,IF(D11=\"fet\",E11,IF(D11=\"et\",E11,IF(AND(D11=\"\",E11=\"\"),\"\",E11))))))))","v":""},null,{"$f":"IF(AND(J11=\"X\",E11>0),I11,\"\")","v":""},{"$f":"IF(AND(J11=\"X\",D11=\"J\",E11<5),1.5,IF(AND(J11=\"X\",D11=\"JS\",E11<5),2,IF(AND(J11=\"X\",D11=\"JF\",E11<5),2.5,IF(AND(J11=\"X\",D11=\"JFS\",E11<5),3,IF(AND(J11=\"X\",D11=\"F\",E11<5),1.5,IF(AND(J11=\"X\",D11=\"FET\",E11<5),1.5,IF(AND(J11=\"X\",D11=\"SFET\",E11<5),2,IF(AND(J11=\"X\",D11=\"SF\",E11<5),2,IF(AND(J11=\"X\",D11=\"FV\",E11=5),0.5,IF(AND(J11=\"X\",D11=\"S\",E11<5),0.5,IF(AND(J11=\"X\",D11=\"SET\",E11<5),0.5,IF(AND(J11=\"X\",D11=\"SFID\",E11<5),0.5,\"\"))))))))))))","v":""},null,{"$f":"IF(AND(J11=\"X\",D11=\"J\"),1,\"\")","v":""},{"$f":"IF(AND(J11=\"X\",D11=\"JF\"),1,IF(AND(J11=\"X\",D11=\"SF\"),1,\"\"))","v":""},{"$f":"IF(AND(J11=\"X\",D11=\"F\"),1,IF(AND(J11=\"X\",D11=\"FET\"),1,\"\"))","v":""},{"$f":"IF(AND(J11=\"X\",D11=\"S\"),1,\"\")","v":""},{"$f":"IF(AND(J11=\"X\",E11>0),1,\"\")","v":""},{"$f":"IF(E11=5,1,\"\")","v":""},{"$f":"IF(AND(D11=\"ET\",J11=\"X\"),1,\"\")","v":""},{"$f":"IF(AND(J11=\"X\",D11=\"ET\"),1,\"\")","v":""},null,null,null,null,null,null,null,{"$f":"IF(AND(X11=\"\",Y11=5),5,IF(AND(X11=\"VAL\",Y11<5),\"faux\",IF(X11=\"j\",Y11,IF(X11=\"jf\",Y11,IF(X11=\"f\",Y11,IF(X11=\"fet\",Y11,IF(X11=\"et\",Y11,IF(AND(X11=\"\",Y11=\"\"),\"\",Y11))))))))","v":""},null,{"$f":"IF(AND(AD11=\"X\",Y11>0),AC11,\"\")","v":""},{"$f":"IF(AND(AD11=\"X\",X11=\"J\",Y11<5),1.5,IF(AND(AD11=\"X\",X11=\"JS\",Y11<5),2,IF(AND(AD11=\"X\",X11=\"JF\",Y11<5),2.5,IF(AND(AD11=\"X\",X11=\"JFS\",Y11<5),3,IF(AND(AD11=\"X\",X11=\"F\",Y11<5),1.5,IF(AND(AD11=\"X\",X11=\"FET\",Y11<5),1.5,IF(AND(AD11=\"X\",X11=\"SFET\",Y11<5),2,IF(AND(AD11=\"X\",X11=\"SF\",Y11<5),2,IF(AND(AD11=\"X\",X11=\"FV\",Y11=5),0.5,IF(AND(AD11=\"X\",X11=\"S\",Y11<5),0.5,IF(AND(AD11=\"X\",X11=\"SET\",Y11<5),0.5,IF(AND(AD11=\"X\",X11=\"SFID\",Y11<5),0.5,\"\"))))))))))))","v":""},null,{"$f":"IF(AND(AD11=\"X\",X11=\"J\"),1,\"\")","v":""},{"$f":"IF(AND(AD11=\"X\",X11=\"JF\"),1,IF(AND(AD11=\"X\",X11=\"SF\"),1,\"\"))","v":""},{"$f":"IF(AND(AD11=\"X\",X11=\"F\"),1,IF(AND(AD11=\"X\",X11=\"FET\"),1,\"\"))","v":""},{"$f":"IF(AND(AD11=\"X\",X11=\"S\"),1,\"\")","v":""},{"$f":"IF(AND(AD11=\"X\",Y11>0),1,\"\")","v":""},{"$f":"IF(Y11=5,1,\"\")","v":""},{"$f":"IF(AND(X11=\"ET\",AD11=\"X\"),1,\"\")","v":""},{"$f":"IF(AND(AD11=\"X\",X11=\"ET\"),1,\"\")","v":""},{"$f":"IF(AND(AD11=\"X\",X11=\"ET\"),1,\"\")","v":""}]
[{"$f":"IF('Liste équipes'!C4=\"\",\"\",'Liste équipes'!C4)","v":"BESANÇON"},null,null,null,null,null,null,null,{"$f":"IF(AND(D12=\"\",E12=5),5,IF(AND(D12=\"VAL\",E12<5),\"faux\",IF(D12=\"n\",E12,IF(D12=\"j\",E12,IF(D12=\"jf\",E12,IF(D12=\"f\",E12,IF(D12=\"fet\",E12,IF(D12=\"et\",E12,IF(AND(D12=\"\",E12=\"\"),\"\",E12)))))))))","v":""},null,{"$f":"IF(AND(J12=\"X\",E12>0),I12,\"\")","v":""},{"$f":"IF(AND(J12=\"X\",D12=\"J\",E12<5),1.5,IF(AND(J12=\"X\",D12=\"JS\",E12<5),2,IF(AND(J12=\"X\",D12=\"JF\",E12<5),2.5,IF(AND(J12=\"X\",D12=\"JFS\",E12<5),3,IF(AND(J12=\"X\",D12=\"F\",E12<5),1.5,IF(AND(J12=\"X\",D12=\"FET\",E12<5),1.5,IF(AND(J12=\"X\",D12=\"SFET\",E12<5),2,IF(AND(J12=\"X\",D12=\"SF\",E12<5),2,IF(AND(J12=\"X\",D12=\"FV\",E12=5),0.5,IF(AND(J12=\"X\",D12=\"S\",E12<5),0.5,IF(AND(J12=\"X\",D12=\"SET\",E12<5),0.5,IF(AND(J12=\"X\",D12=\"SFID\",E12<5),0.5,\"\"))))))))))))","v":""},null,{"$f":"IF(AND(J12=\"X\",D12=\"J\"),1,\"\")","v":""},{"$f":"IF(AND(J12=\"X\",D12=\"JF\"),1,\"\")","v":""},{"$f":"IF(AND(J12=\"X\",D12=\"F\"),1,IF(AND(J12=\"X\",D12=\"FET\"),1,\"\"))","v":""},{"$f":"IF(AND(J12=\"X\",D12=\"S\"),1,\"\")","v":""},{"$f":"IF(AND(J12=\"X\",E12>0),1,\"\")","v":""},{"$f":"IF(E12=5,1,\"\")","v":""},{"$f":"IF(AND(D12=\"ET\",J12=\"X\"),1,\"\")","v":""},{"$f":"IF(AND(J12=\"X\",D12=\"ET\"),1,\"\")","v":""},null,null,null,null,null,null,null,{"$f":"IF(AND(X12=\"\",Y12=5),5,IF(AND(X12=\"VAL\",Y12<5),\"faux\",IF(X12=\"n\",Y12,IF(X12=\"j\",Y12,IF(X12=\"jf\",Y12,IF(X12=\"f\",Y12,IF(X12=\"fet\",Y12,IF(X12=\"et\",Y12,IF(AND(X12=\"\",Y12=\"\"),\"\",Y12)))))))))","v":""},null,{"$f":"IF(AND(AD12=\"X\",Y12>0),AC12,\"\")","v":""},{"$f":"IF(AND(AD12=\"X\",X12=\"J\",Y12<5),1.5,IF(AND(AD12=\"X\",X12=\"JS\",Y12<5),2,IF(AND(AD12=\"X\",X12=\"JF\",Y12<5),2.5,IF(AND(AD12=\"X\",X12=\"JFS\",Y12<5),3,IF(AND(AD12=\"X\",X12=\"F\",Y12<5),1.5,IF(AND(AD12=\"X\",X12=\"FET\",Y12<5),1.5,IF(AND(AD12=\"X\",X12=\"SFET\",Y12<5),2,IF(AND(AD12=\"X\",X12=\"SF\",Y12<5),2,IF(AND(AD12=\"X\",X12=\"FV\",Y12=5),0.5,IF(AND(AD12=\"X\",X12=\"S\",Y12<5),0.5,IF(AND(AD12=\"X\",X12=\"SET\",Y12<5),0.5,IF(AND(AD12=\"X\",X12=\"SFID\",Y12<5),0.5,\"\"))))))))))))","v":""},null,{"$f":"IF(AND(AD12=\"X\",X12=\"J\"),1,\"\")","v":""},{"$f":"IF(AND(AD12=\"X\",X12=\"JF\"),1,\"\")","v":""},{"$f":"IF(AND(AD12=\"X\",X12=\"F\"),1,IF(AND(AD12=\"X\",X12=\"FET\"),1,\"\"))","v":""},{"$f":"IF(AND(AD12=\"X\",X12=\"S\"),1,\"\")","v":""},{"$f":"IF(AND(AD12=\"X\",Y12>0),1,\"\")","v":""},{"$f":"IF(Y12=5,1,\"\")","v":""},{"$f":"IF(AND(X12=\"ET\",AD12=\"X\"),1,\"\")","v":""},{"$f":"IF(AND(AD12=\"X\",X12=\"ET\"),1,\"\")","v":""},{"$f":"IF(AND(AD12=\"X\",X12=\"ET\"),1,\"\")","v":""}]
[{"$f":"IF('Liste équipes'!C5=\"\",\"\",'Liste équipes'!C5)","v":"CAPPELLE LA GRANDE"},null,null,null,null,null,null,null,"",null,"","",null,"","","","","","","","",null,null,null,null,null,null,null,"",null,{"$f":"IF(AND(AD13=\"X\",Y13>0),AC13,\"\")","v":""},"",null,"","","","","","","","",""]
[{"$f":"IF('Liste équipes'!C6=\"\",\"\",'Liste équipes'!C6)","v":"LE PUY 2"},null,null,null,null,null,null,null,"",null,"","",null,"","","","","","","","",null,null,null,null,null,null,null,"",null,"","",null,"","","","","","","","",""]
[{"$f":"IF('Liste équipes'!C7=\"\",\"\",'Liste équipes'!C7)","v":"STRASBOURG 2"},null,null,null,null,null,null,null,"",null,"","",null,"","","","","","","","",null,null,null,null,null,null,null,"",null,"","",null,"","","","","","","","",""]
[{"$f":"IF('Liste équipes'!C8=\"\",\"\",'Liste équipes'!C8)","v":"VANDOEUVRE"},null,null,null,null,null,null,null,"",null,"","",null,"","","","","","","","",null,null,null,null,null,null,null,"",null,"","",null,"","","","","","","","",""]
[{"$f":"IF('Liste équipes'!C9=\"\",\"\",'Liste équipes'!C9)","v":""},null,null,null,null,null,null,null,"",null,"","",null,"","","","","","","","",null,null,null,null,null,null,null,{"$f":"IF(AND(X17=\"\",Y17=5),5,IF(AND(X17=\"VAL\",Y17<5),\"faux\",IF(X17=\"j\",Y17,IF(X17=\"jf\",Y17,IF(X17=\"f\",Y17,IF(X17=\"fet\",Y17,IF(X17=\"et\",Y17,IF(AND(X17=\"\",Y17=\"\"),\"\",Y17))))))))","v":""},null,"","",null,"","","","","","","","",""]
[null,null,null,null,null,null,null,null,"",null,"","",null,"","","","","","","","",null,null,null,null,null,null,null,"",null,"","",null,"","","","","","","","",""]
[null,null,null,null,null,null,null,null,"",null,"","",null,"","","","","","","","",null,null,null,null,null,null,null,"",null,"","",null,"","","","","","","","",""]
[null,null,null,null,null,null,null,null,"",null,"","",null,"","","","","","","","",null,null,null,null,null,null,null,"",null,"","",null,"","","","","","","","",""]
[null,null,null,null,null,null,null,null,"",null,"","",null,"","","","","","","","",null,null,null,null,null,null,null,"",null,"","",null,"","","","","","","","",""]
[null,null,null,null,null,null,null,null,{"$f":"IF(AND(D22=\"\",E22=5),5,IF(AND(D22=\"VAL\",E22<5),\"faux\",IF(D22=\"j\",E22,IF(D22=\"jf\",E22,IF(D22=\"f\",E22,IF(D22=\"fet\",E22,IF(D22=\"et\",E22,IF(AND(D22=\"\",E22=\"\"),\"\",E22))))))))","v":""},null,"","",null,"","","","","","","","",null,null,null,null,null,null,null,{"$f":"IF(AND(X22=\"\",Y22=5),5,IF(AND(X22=\"VAL\",Y22<5),\"faux\",IF(X22=\"j\",Y22,IF(X22=\"jf\",Y22,IF(X22=\"f\",Y22,IF(X22=\"fet\",Y22,IF(X22=\"et\",Y22,IF(AND(X22=\"\",Y22=\"\"),\"\",Y22))))))))","v":""},null,"","",null,"","","","","","","","",""]
[null,null,null,null,null,null,null,null,null,null,null,"",null,"","","","","","","","",null,null,null,null,null,null,null,null,null,null,"",null,"","","","","","","","",""]
[null,null,null,null,null,null,null,null,null,null,null,"",null,"","","","","","","","",null,null,null,null,null,null,null,null,null,null,"",null,"","","","","","","","",""]
[null,null,null,"  Nombre joueurs sur le terrain",null,null,{"$f":"IF(J25>5,\"\",\"OK\")","v":""},{"$f":"IF(R25>5,\"PAS OK\",\"\")","v":""},null,{"$f":"IF(L27=\"\",\"\",R25)","v":""},"Points en jeu","Avec Bonus maxi 19 pts",null,{"$f":"SUM(N11:N24)","v":0},0,0,0,0,0,0,0,null,null,"  Nombre joueurs sur le terrain",null,null,{"$f":"IF(AD25>5,\"\",\"OK\")","v":""},{"$f":"IF(AL25>5,\"PAS OK\",\"\")","v":""},null,{"$f":"IF(AF27=\"\",\"\",AL25)","v":""},"Points en jeu","Avec Bonus maxi 19 pts",null,{"$f":"SUM(AH11:AH24)","v":0},0,0,0,0,0,0,0,0]
[null,null,null,null,null,null,null,null,null,null,null,null,null,{"$f":"IF(N25=0,\"\",IF(N25=1,17,IF(N25=2,18.5,IF(N25=3,19,IF(N25>3,19,IF(N25>4,19,IF(N25>5,19,\"\")))))))","v":""},{"$f":"IF(O25=0,\"\",IF(O25=1,18,IF(O25=2,19,IF(O25=3,19,IF(O25=4,19,IF(O25=4,19,\"\"))))))","v":""},{"$f":"IF(P25=0,\"\",IF(P25=1,17,IF(P25=2,18.5,IF(P25=3,19,IF(P25=4,19,IF(P25=5,17.5,\"\"))))))","v":""},{"$f":"IF(Q25=0,\"\",IF(Q25=1,16,IF(Q25=2,16.5,IF(Q25=3,17,IF(Q25=4,17.5,IF(Q25=5,18,IF(Q25=6,18.5,IF(Q25=7,19,IF(Q25=8,19,IF(Q25=9,19,IF(Q25=10,19,IF(Q25=11,19,IF(Q25=12,19,\"\")))))))))))))","v":""},{"$f":"IF(AND(O26=16.5,P26=16),17.5,IF(AND(N26=15.5,P26=16),17,IF(AND(N26=15.5,O26=16.5),17.5,IF(AND(N26=16.5,P26=16),17.5,IF(AND(N25=2,O26=16.5),17.5,\"\")))))","v":""},null,null,null,null,null,null,null,null,null,null,null,null,null,null,null,{"$f":"IF(AH25=0,\"\",IF(AH25=1,17,IF(AH25=2,18.5,IF(AH25=3,19,IF(AH25>3,19,IF(AH25>4,19,IF(AH25>5,19,\"\")))))))","v":""},{"$f":"IF(AI25=0,\"\",IF(AI25=1,18,IF(AI25=2,19,IF(AI25=3,19,IF(AI25=4,19,IF(AI25=4,19,\"\"))))))","v":""},{"$f":"IF(AJ25=0,\"\",IF(AJ25=1,17,IF(AJ25=2,18.5,IF(AJ25=3,19,IF(AJ25=4,19,IF(AJ25=5,17.5,\"\"))))))","v":""},{"$f":"IF(AK25=0,\"\",IF(AK25=1,16,IF(AK25=2,16.5,IF(AK25=3,17,IF(AK25=4,17.5,IF(AK25=5,18,IF(AK25=6,18.5,IF(AK25=7,19,IF(AK25=8,19,IF(AK25=9,19,IF(AK25=10,19,IF(AK25=11,19,IF(AK25=12,19,\"\")))))))))))))","v":""},{"$f":"IF(AND(AI26=16.5,AJ26=16),17.5,IF(AND(AH26=15.5,AJ26=16),17,IF(AND(AH26=15.5,AI26=16.5),17.5,IF(AND(AH26=16.5,AJ26=16),17.5,IF(AND(AH25=2,AI26=16.5),17.5,\"\")))))","v":""}]
[null,null," ",{"$f":"IF(K27>L27,\"Trop de points en jeu\",\"\")","v":""},null,null,null,null,null,null,{"$f":"IF(O28>0,O28,\"\")","v":""},{"$f":"IF(O28=0,\"\",Q28)","v":""},null,{"$f":"SUM(N26)","v":0},{"$f":"SUM(O26)","v":0},{"$f":"SUM(P26)","v":0},{"$f":"SUM(Q26)","v":0},{"$f":"SUM(R26)","v":0},null,null,null,null," ",{"$f":"IF(AE27>AF27,\"Trop de points en jeu\",\"\")","v":""},null,null,null,null,null,null,{"$f":"IF(AI28>0,AI28,\"\")","v":""},{"$f":"IF(AI28=0,\"\",AK28)","v":""},null,{"$f":"SUM(AH26)","v":0},{"$f":"SUM(AI26)","v":0},{"$f":"SUM(AJ26)","v":0},{"$f":"SUM(AK26)","v":0},{"$f":"SUM(AL26)","v":0}]
[null,null,null,{"$f":"IF(S25>2,\"Trop de joueurs  valides inscrits sur la feuille\",\"\")","v":""},null,null,null,null,null,null,null,null,null,{"$f":"SUM(L11:L24)","v":0},{"$f":"SUM(K11:K24)","v":0},{"$f":"SUM(N28+15)","v":15},{"$f":"IF(P28>19,19,P28)","v":15},null,null,{"$f":"SUM(T30:T31)","v":0},null,null,null,{"$f":"IF(AM25>2,\"Trop de joueurs  valides inscrits sur la feuille\",\"\")","v":""},null,null,null,null,null,null,null,null,null,{"$f":"SUM(AF11:AF24)","v":0},{"$f":"SUM(AE11:AE24)","v":0},{"$f":"SUM(AH28+15)","v":15},{"$f":"IF(AJ28>19,19,AJ28)","v":15},null,null,{"$f":"SUM(AN30:AN31)","v":0}]
[]
[null,null,null,{"$f":"IF(T28>5,\"Pas OK. Trop de joueurs étrangers sur la feuille (ET), vérifier la liste.\",IF(T25>4,\"Pas OK. Trop de joueurs étrangers en jeu (ET), vérifier la liste.\",\"\"))","v":""},null,null,null,null,null,null,null,null,null,{"$f":"IF(D11=\"ET\",1,\"\")","v":""},{"$f":"IF(D12=\"ET\",1,\"\")","v":""},{"$f":"IF(D13=\"ET\",1,\"\")","v":""},{"$f":"IF(D14=\"ET\",1,\"\")","v":""},{"$f":"IF(D15=\"ET\",1,\"\")","v":""},{"$f":"IF(D16=\"ET\",1,\"\")","v":""},{"$f":"SUM(N30:S30)","v":0},null,null,null,{"$f":"IF(AN28>5,\"Pas OK. Trop de joueurs étrangers sur la feuille (ET), vérifier la liste.\",IF(AN25>4,\"Pas OK. Trop de joueurs étrangers en jeu (ET), vérifier la liste.\",\"\"))","v":""},null,null,null,null,null,null,null,null,null,{"$f":"IF(X11=\"ET\",1,\"\")","v":""},{"$f":"IF(X12=\"ET\",1,\"\")","v":""},{"$f":"IF(X13=\"ET\",1,\"\")","v":""},{"$f":"IF(X14=\"ET\",1,\"\")","v":""},{"$f":"IF(X15=\"ET\",1,\"\")","v":""},{"$f":"IF(X16=\"ET\",1,\"\")","v":""},{"$f":"SUM(AH30:AM30)","v":0}]
[null,null,null,null,null,null,null,null,null,null,null,null,null,{"$f":"IF(D17=\"ET\",1,\"\")","v":""},{"$f":"IF(D18=\"ET\",1,\"\")","v":""},{"$f":"IF(D19=\"ET\",1,\"\")","v":""},{"$f":"IF(D20=\"ET\",1,\"\")","v":""},{"$f":"IF(D21=\"ET\",1,\"\")","v":""},{"$f":"IF(D22=\"ET\",1,\"\")","v":""},{"$f":"SUM(N31:S31)","v":0},null,null,null,null,null,null,null,null,null,null,null,null,null,{"$f":"IF(X17=\"ET\",1,\"\")","v":""},{"$f":"IF(X18=\"ET\",1,\"\")","v":""},{"$f":"IF(X19=\"ET\",1,\"\")","v":""},{"$f":"IF(X20=\"ET\",1,\"\")","v":""},{"$f":"IF(X21=\"ET\",1,\"\")","v":""},{"$f":"IF(X22=\"ET\",1,\"\")","v":""},{"$f":"SUM(AH31:AM31)","v":0}]

{"sheet":"Nationale_2_poule_B","index":4,"n_rows":31,"n_cols":41,"rows_kept":31,"cut":false,"hidden":false,"merged":[[34,23,40,23],[26,3,26,8],[26,11,27,11],[26,23,26,28],[26,31,27,31],[26,10,27,10],[26,30,27,30],[29,3,30,11],[29,23,30,31],[27,3,27,8],[27,23,27,28],[5,3,5,11],[5,23,5,31],[6,3,6,11],[6,23,6,31],[25,3,25,8],[25,23,25,28],[8,25,8,26],[24,10,25,10],[24,30,25,30],[24,7,24,8],[24,11,25,11],[24,27,24,28],[24,31,25,31]]}
["x"]
[]
[]
[]
[]
[null,null,null,"Equipe A",null,null,null,null,null,null,null,null,null,null,null,null,null,null,null,null,null,null,null,"Equipe B"]
[null,null,null,"AMIENS",null,null,null,null,null,null,null,null,null,null,null,null,null,null,null,null,null,null,null,"AMIENS"]
[]
[null,null,null,"Carte","Pts","   Noms         /          Prénoms",null,"N°","Valeur","entrée en jeu","Sans Abattement","Bonus",null,"J","JF","F-FET","S-SF",null,"Valide","ET",null,null,null,"Carte","Pts","   Noms         /          Prénoms",null,"N°","Valeur","entrée en jeu","Sans Abattement","Bonus",null,"J","JF","F-FET","S-SF",null,"Valide","ET"]
[]
[{"$f":"IF('Liste équipes'!D3=\"\",\"\",'Liste équipes'!D3)","v":""},null,null,null,null,null,null,null,{"$f":"IF(AND(D11=\"\",E11=5),5,IF(AND(D11=\"VAL\",E11<5),\"faux\",IF(D11=\"j\",E11,IF(D11=\"jf\",E11,IF(D11=\"f\",E11,IF(D11=\"fet\",E11,IF(D11=\"et\",E11,IF(AND(D11=\"\",E11=\"\"),\"\",E11))))))))","v":""},null,{"$f":"IF(AND(J11=\"X\",E11>0),I11,\"\")","v":""},{"$f":"IF(AND(J11=\"X\",D11=\"J\",E11<5),1.5,IF(AND(J11=\"X\",D11=\"JS\",E11<5),2,IF(AND(J11=\"X\",D11=\"JF\",E11<5),2.5,IF(AND(J11=\"X\",D11=\"JFS\",E11<5),3,IF(AND(J11=\"X\",D11=\"F\",E11<5),1.5,IF(AND(J11=\"X\",D11=\"FET\",E11<5),1.5,IF(AND(J11=\"X\",D11=\"SFET\",E11<5),2,IF(AND(J11=\"X\",D11=\"SF\",E11<5),2,IF(AND(J11=\"X\",D11=\"FV\",E11=5),0.5,IF(AND(J11=\"X\",D11=\"S\",E11<5),0.5,IF(AND(J11=\"X\",D11=\"SET\",E11<5),0.5,IF(AND(J11=\"X\",D11=\"SFID\",E11<5),0.5,\"\"))))))))))))","v":""},null,{"$f":"IF(AND(J11=\"X\",D11=\"J\"),1,\"\")","v":""},{"$f":"IF(AND(J11=\"X\",D11=\"JF\"),1,IF(AND(J11=\"X\",D11=\"SF\"),1,\"\"))","v":""},{"$f":"IF(AND(J11=\"X\",D11=\"F\"),1,IF(AND(J11=\"X\",D11=\"FET\"),1,\"\"))","v":""},{"$f":"IF(AND(J11=\"X\",D11=\"S\"),1,\"\")","v":""},{"$f":"IF(AND(J11=\"X\",E11>0),1,\"\")","v":""},{"$f":"IF(E11=5,1,\"\")","v":""},{"$f":"IF(AND(D11=\"ET\",J11=\"X\"),1,\"\")","v":""},{"$f":"IF(AND(J11=\"X\",D11=\"ET\"),1,\"\")","v":""},null,null,null,null,null,null,null,{"$f":"IF(AND(X11=\"\",Y11=5),5,IF(AND(X11=\"VAL\",Y11<5),\"faux\",IF(X11=\"n\",Y11,IF(X11=\"j\",Y11,IF(X11=\"jf\",Y11,IF(X11=\"f\",Y11,IF(X11=\"fet\",Y11,IF(X11=\"et\",Y11,IF(AND(X11=\"\",Y11=\"\"),\"\",Y11)))))))))","v":""},null,{"$f":"IF(AND(AD11=\"X\",Y11>0),AC11,\"\")","v":""},{"$f":"IF(AND(AD11=\"X\",X11=\"J\",Y11<5),1.5,IF(AND(AD11=\"X\",X11=\"JS\",Y11<5),2,IF(AND(AD11=\"X\",X11=\"JF\",Y11<5),2.5,IF(AND(AD11=\"X\",X11=\"JFS\",Y11<5),3,IF(AND(AD11=\"X\",X11=\"F\",Y11<5),1.5,IF(AND(AD11=\"X\",X11=\"FET\",Y11<5),1.5,IF(AND(AD11=\"X\",X11=\"SFET\",Y11<5),2,IF(AND(AD11=\"X\",X11=\"SF\",Y11<5),2,IF(AND(AD11=\"X\",X11=\"FV\",Y11=5),0.5,IF(AND(AD11=\"X\",X11=\"S\",Y11<5),0.5,IF(AND(AD11=\"X\",X11=\"SET\",Y11<5),0.5,IF(AND(AD11=\"X\",X11=\"SFID\",Y11<5),0.5,\"\"))))))))))))","v":""},null,{"$f":"IF(AND(AD11=\"X\",X11=\"J\"),1,\"\")","v":""},{"$f":"IF(AND(AD11=\"X\",X11=\"JF\"),1,IF(AND(AD11=\"X\",X11=\"SF\"),1,\"\"))","v":""},{"$f":"IF(AND(AD11=\"X\",X11=\"F\"),1,IF(AND(AD11=\"X\",X11=\"FET\"),1,\"\"))","v":""},{"$f":"IF(AND(AD11=\"X\",X11=\"S\"),1,\"\")","v":""},{"$f":"IF(AND(AD11=\"X\",Y11>0),1,\"\")","v":""},{"$f":"IF(Y11=5,1,\"\")","v":""},{"$f":"IF(AND(X11=\"ET\",AD11=\"X\"),1,\"\")","v":""},{"$f":"IF(AND(AD11=\"X\",X11=\"ET\"),1,\"\")","v":""}]
[{"$f":"IF('Liste équipes'!D4=\"\",\"\",'Liste équipes'!D4)","v":"AMIENS"},null,null,null,null,null,null,null,{"$f":"IF(AND(D12=\"\",E12=5),5,IF(AND(D12=\"VAL\",E12<5),\"faux\",IF(D12=\"j\",E12,IF(D12=\"jf\",E12,IF(D12=\"f\",E12,IF(D12=\"fet\",E12,IF(D12=\"et\",E12,IF(AND(D12=\"\",E12=\"\"),\"\",E12))))))))","v":""},null,{"$f":"IF(AND(J12=\"X\",E12>0),I12,\"\")","v":""},{"$f":"IF(AND(J12=\"X\",D12=\"J\",E12<5),1.5,IF(AND(J12=\"X\",D12=\"JS\",E12<5),2,IF(AND(J12=\"X\",D12=\"JF\",E12<5),2.5,IF(AND(J12=\"X\",D12=\"JFS\",E12<5),3,IF(AND(J12=\"X\",D12=\"F\",E12<5),1.5,IF(AND(J12=\"X\",D12=\"FET\",E12<5),1.5,IF(AND(J12=\"X\",D12=\"SFET\",E12<5),2,IF(AND(J12=\"X\",D12=\"SF\",E12<5),2,IF(AND(J12=\"X\",D12=\"FV\",E12=5),0.5,IF(AND(J12=\"X\",D12=\"S\",E12<5),0.5,IF(AND(J12=\"X\",D12=\"SET\",E12<5),0.5,IF(AND(J12=\"X\",D12=\"SFID\",E12<5),0.5,\"\"))))))))))))","v":""},null,{"$f":"IF(AND(J12=\"X\",D12=\"J\"),1,\"\")","v":""},{"$f":"IF(AND(J12=\"X\",D12=\"JF\"),1,\"\")","v":""},{"$f":"IF(AND(J12=\"X\",D12=\"F\"),1,IF(AND(J12=\"X\",D12=\"FET\"),1,\"\"))","v":""},{"$f":"IF(AND(J12=\"X\",D12=\"S\"),1,\"\")","v":""},{"$f":"IF(AND(J12=\"X\",E12>0),1,\"\")","v":""},{"$f":"IF(E12=5,1,\"\")","v":""},{"$f":"IF(AND(D12=\"ET\",J12=\"X\"),1,\"\")","v":""},{"$f":"IF(AND(J12=\"X\",D12=\"ET\"),1,\"\")","v":""},null,null,null,null,null,null,null,"",null,{"$f":"IF(AND(AD12=\"X\",Y12>0),AC12,\"\")","v":""},{"$f":"IF(AND(AD12=\"X\",X12=\"J\",Y12<5),1.5,IF(AND(AD12=\"X\",X12=\"JS\",Y12<5),2,IF(AND(AD12=\"X\",X12=\"JF\",Y12<5),2.5,IF(AND(AD12=\"X\",X12=\"JFS\",Y12<5),3,IF(AND(AD12=\"X\",X12=\"F\",Y12<5),1.5,IF(AND(AD12=\"X\",X12=\"FET\",Y12<5),1.5,IF(AND(AD12=\"X\",X12=\"SFET\",Y12<5),2,IF(AND(AD12=\"X\",X12=\"SF\",Y12<5),2,IF(AND(AD12=\"X\",X12=\"FV\",Y12=5),0.5,IF(AND(AD12=\"X\",X12=\"S\",Y12<5),0.5,IF(AND(AD12=\"X\",X12=\"SET\",Y12<5),0.5,IF(AND(AD12=\"X\",X12=\"SFID\",Y12<5),0.5,\"\"))))))))))))","v":""},null,{"$f":"IF(AND(AD12=\"X\",X12=\"J\"),1,\"\")","v":""},{"$f":"IF(AND(AD12=\"X\",X12=\"JF\"),1,\"\")","v":""},{"$f":"IF(AND(AD12=\"X\",X12=\"F\"),1,IF(AND(AD12=\"X\",X12=\"FET\"),1,\"\"))","v":""},{"$f":"IF(AND(AD12=\"X\",X12=\"S\"),1,\"\")","v":""},{"$f":"IF(AND(AD12=\"X\",Y12>0),1,\"\")","v":""},{"$f":"IF(Y12=5,1,\"\")","v":""},{"$f":"IF(AND(X12=\"ET\",AD12=\"X\"),1,\"\")","v":""},{"$f":"IF(AND(AD12=\"X\",X12=\"ET\"),1,\"\")","v":""}]
[{"$f":"IF('Liste équipes'!D5=\"\",\"\",'Liste équipes'!D5)","v":"AULNOYE"},null,null,null,null,null,null,null,"",null,"","",null,"","","","","","","","",null,null,null,null,null,null,null,"",null,{"$f":"IF(AND(AD13=\"X\",Y13>0),AC13,\"\")","v":""},"",null,"","","","","","","",""]
[{"$f":"IF('Liste équipes'!D6=\"\",\"\",'Liste équipes'!D6)","v":"CAMBRAI"},null,null,null,null,null,null,null,"",null,"","",null,"","","","","","","","",null,null,null,null,null,null,null,"",null,"","",null,"","","","","","","",""]
[{"$f":"IF('Liste équipes'!D7=\"\",\"\",'Liste équipes'!D7)","v":"POLE NATIONAL"},null,null,null,null,null,null,null,"",null,"","",null,"","","","","","","","",null,null,null,null,null,null,null,"",null,"","",null,"","","","","","","",""]
[{"$f":"IF('Liste équipes'!D8=\"\",\"\",'Liste équipes'!D8)","v":"SAINT HERBLAIN"},null,null,null,null,null,null,null,"",null,"","",null,"","","","","","","","",null,null,null,null,null,null,null,"",null,"","",null,"","","","","","","",""]
[{"$f":"IF('Liste équipes'!D9=\"\",\"\",'Liste équipes'!D9)","v":"YFFINIAC"},null,null,null,null,null,null,null,"",null,"","",null,"","","","","","","","",null,null,null,null,null,null,null,"",null,"","",null,"","","","","","","",""]
[null,null,null,null,null,null,null,null,"",null,"","",null,"","","","","","","","",null,null,null,null,null,null,null,"",null,"","",null,"","","","","","","",""]
[null,null,null,null,null,null,null,null,"",null,"","",null,"","","","","","","","",null,null,null,null,null,null,null,"",null,"","",null,"","","","","","","",""]
[null,null,null,null,null,null,null,null,"",null,"","",null,"","","","","","","","",null,null,null,null,null,null,null,"",null,"","",null,"","","","","","","",""]
[null,null,null,null,null,null,null,null,"",null,"","",null,"","","","","","","","",null,null,null,null,null,null,null,"",null,"","",null,"","","","","","","",""]
[null,null,null,null,null,null,null,null,{"$f":"IF(AND(D22=\"\",E22=5),5,IF(AND(D22=\"VAL\",E22<5),\"faux\",IF(D22=\"j\",E22,IF(D22=\"jf\",E22,IF(D22=\"f\",E22,IF(D22=\"fet\",E22,IF(D22=\"et\",E22,IF(AND(D22=\"\",E22=\"\"),\"\",E22))))))))","v":""},null,"","",null,"","","","","","","","",null,null,null,null,null,null,null,{"$f":"IF(AND(X22=\"\",Y22=5),5,IF(AND(X22=\"VAL\",Y22<5),\"faux\",IF(X22=\"n\",Y22,IF(X22=\"j\",Y22,IF(X22=\"jf\",Y22,IF(X22=\"f\",Y22,IF(X22=\"fet\",Y22,IF(X22=\"et\",Y22,IF(AND(X22=\"\",Y22=\"\"),\"\",Y22)))))))))","v":""},null,"","",null,"","","","","","","",""]
[null,null,null,null,null,null,null,null,null,null,null,"",null,"","","","","","","","",null,null,null,null,null,null,null,null,null,null,"",null,"","","","","","","",""]
[null,null,null,null,null,null,null,null,null,null,null,"",null,"","","","","","","","",null,null,null,null,null,null,null,null,null,null,"",null,"","","","","","","",""]
[null,null,null,"  Nombre joueurs sur le terrain",null,null,{"$f":"IF(J25>5,\"\",\"OK\")","v":""},{"$f":"IF(R25>5,\"PAS OK\",\"\")","v":""},null,{"$f":"IF(L27=\"\",\"\",R25)","v":""},"Points en jeu","Avec Bonus maxi 19 pts",null,{"$f":"SUM(N11:N24)","v":0},0,0,0,0,0,0,0,null,null,"  Nombre joueurs sur le terrain",null,null,{"$f":"IF(AD25>5,\"\",\"OK\")","v":""},{"$f":"IF(AL25>5,\"PAS OK\",\"\")","v":""},null,{"$f":"IF(AF27=\"\",\"\",AL25)","v":""},"Points en jeu","Avec Bonus maxi 19 pts",null,{"$f":"SUM(AH11:AH24)","v":0},0,0,0,0,0,0,0]
[null,null,null,null,null,null,null,null,null,null,null,null,null,{"$f":"IF(N25=0,\"\",IF(N25=1,17,IF(N25=2,18.5,IF(N25=3,19,IF(N25>3,19,IF(N25>4,19,IF(N25>5,19,\"\")))))))","v":""},{"$f":"IF(O25=0,\"\",IF(O25=1,18,IF(O25=2,19,IF(O25=3,19,IF(O25=4,19,IF(O25=4,19,\"\"))))))","v":""},{"$f":"IF(P25=0,\"\",IF(P25=1,17,IF(P25=2,18.5,IF(P25=3,19,IF(P25=4,19,IF(P25=5,17.5,\"\"))))))","v":""},{"$f":"IF(Q25=0,\"\",IF(Q25=1,16,IF(Q25=2,16.5,IF(Q25=3,17,IF(Q25=4,17.5,IF(Q25=5,18,IF(Q25=6,18.5,IF(Q25=7,19,IF(Q25=8,19,IF(Q25=9,19,IF(Q25=10,19,IF(Q25=11,19,IF(Q25=12,19,\"\")))))))))))))","v":""},{"$f":"IF(AND(O26=16.5,P26=16),17.5,IF(AND(N26=15.5,P26=16),17,IF(AND(N26=15.5,O26=16.5),17.5,IF(AND(N26=16.5,P26=16),17.5,IF(AND(N25=2,O26=16.5),17.5,\"\")))))","v":""},null,null,null,null,null,null,null,null,null,null,null,null,null,null,null,{"$f":"IF(AH25=0,\"\",IF(AH25=1,17,IF(AH25=2,18.5,IF(AH25=3,19,IF(AH25>3,19,IF(AH25>4,19,IF(AH25>5,19,\"\")))))))","v":""},{"$f":"IF(AI25=0,\"\",IF(AI25=1,18,IF(AI25=2,19,IF(AI25=3,19,IF(AI25=4,19,IF(AI25=4,19,\"\"))))))","v":""},{"$f":"IF(AJ25=0,\"\",IF(AJ25=1,17,IF(AJ25=2,18.5,IF(AJ25=3,19,IF(AJ25=4,19,IF(AJ25=5,17.5,\"\"))))))","v":""},{"$f":"IF(AK25=0,\"\",IF(AK25=1,16,IF(AK25=2,16.5,IF(AK25=3,17,IF(AK25=4,17.5,IF(AK25=5,18,IF(AK25=6,18.5,IF(AK25=7,19,IF(AK25=8,19,IF(AK25=9,19,IF(AK25=10,19,IF(AK25=11,19,IF(AK25=12,19,\"\")))))))))))))","v":""},{"$f":"IF(AND(AI26=16.5,AJ26=16),17.5,IF(AND(AH26=15.5,AJ26=16),17,IF(AND(AH26=15.5,AI26=16.5),17.5,IF(AND(AH26=16.5,AJ26=16),17.5,IF(AND(AH25=2,AI26=16.5),17.5,\"\")))))","v":""}]
[null,null," ",{"$f":"IF(K27>L27,\"Trop de points en jeu\",\"\")","v":""},null,null,null,null,null,null,{"$f":"IF(O28>0,O28,\"\")","v":""},{"$f":"IF(O28=0,\"\",Q28)","v":""},null,{"$f":"SUM(N26)","v":0},{"$f":"SUM(O26)","v":0},{"$f":"SUM(P26)","v":0},{"$f":"SUM(Q26)","v":0},{"$f":"SUM(R26)","v":0},null,null,null,null," ",{"$f":"IF(AE27>AF27,\"Trop de points en jeu\",\"\")","v":""},null,null,null,null,null,null,{"$f":"IF(AI28>0,AI28,\"\")","v":""},{"$f":"IF(AI28=0,\"\",AK28)","v":""},null,{"$f":"SUM(AH26)","v":0},{"$f":"SUM(AI26)","v":0},{"$f":"SUM(AJ26)","v":0},{"$f":"SUM(AK26)","v":0},{"$f":"SUM(AL26)","v":0}]
[null,null,null,{"$f":"IF(S25>2,\"Trop de joueurs  valides inscrits sur la feuille\",\"\")","v":""},null,null,null,null,null,null,null,null,null,{"$f":"SUM(L11:L24)","v":0},{"$f":"SUM(K11:K24)","v":0},{"$f":"SUM(N28+15)","v":15},{"$f":"IF(P28>19,19,P28)","v":15},null,null,{"$f":"SUM(T30:T31)","v":0},null,null,null,{"$f":"IF(AM25>2,\"Trop de joueurs  valides inscrits sur la feuille\",\"\")","v":""},null,null,null,null,null,null,null,null,null,{"$f":"SUM(AF11:AF24)","v":0},{"$f":"SUM(AE11:AE24)","v":0},{"$f":"SUM(AH28+15)","v":15},{"$f":"IF(AJ28>19,19,AJ28)","v":15},null,null,{"$f":"SUM(AN30:AN31)","v":0}]
[]
[null,null,null,{"$f":"IF(T28>5,\"Pas OK. Trop de joueurs étrangers sur la feuille (ET), vérifier la liste.\",IF(T25>4,\"Pas OK. Trop de joueurs étrangers en jeu (ET), vérifier la liste.\",\"\"))","v":""},null,null,null,null,null,null,null,null,null,{"$f":"IF(D11=\"ET\",1,\"\")","v":""},{"$f":"IF(D12=\"ET\",1,\"\")","v":""},{"$f":"IF(D13=\"ET\",1,\"\")","v":""},{"$f":"IF(D14=\"ET\",1,\"\")","v":""},{"$f":"IF(D15=\"ET\",1,\"\")","v":""},{"$f":"IF(D16=\"ET\",1,\"\")","v":""},{"$f":"SUM(N30:S30)","v":0},null,null,null,{"$f":"IF(AN28>5,\"Pas OK. Trop de joueurs étrangers sur la feuille (ET), vérifier la liste.\",IF(AN25>4,\"Pas OK. Trop de joueurs étrangers en jeu (ET), vérifier la liste.\",\"\"))","v":""},null,null,null,null,null,null,null,null,null,{"$f":"IF(X11=\"ET\",1,\"\")","v":""},{"$f":"IF(X12=\"ET\",1,\"\")","v":""},{"$f":"IF(X13=\"ET\",1,\"\")","v":""},{"$f":"IF(X14=\"ET\",1,\"\")","v":""},{"$f":"IF(X15=\"ET\",1,\"\")","v":""},{"$f":"IF(X16=\"ET\",1,\"\")","v":""},{"$f":"SUM(AH30:AM30)","v":0}]
[null,null,null,null,null,null,null,null,null,null,null,null,null,{"$f":"IF(D17=\"ET\",1,\"\")","v":""},{"$f":"IF(D18=\"ET\",1,\"\")","v":""},{"$f":"IF(D19=\"ET\",1,\"\")","v":""},{"$f":"IF(D20=\"ET\",1,\"\")","v":""},{"$f":"IF(D21=\"ET\",1,\"\")","v":""},{"$f":"IF(D22=\"ET\",1,\"\")","v":""},{"$f":"SUM(N31:S31)","v":0},null,null,null,null,null,null,null,null,null,null,null,null,null,{"$f":"IF(X17=\"ET\",1,\"\")","v":""},{"$f":"IF(X18=\"ET\",1,\"\")","v":""},{"$f":"IF(X19=\"ET\",1,\"\")","v":""},{"$f":"IF(X20=\"ET\",1,\"\")","v":""},{"$f":"IF(X21=\"ET\",1,\"\")","v":""},{"$f":"IF(X22=\"ET\",1,\"\")","v":""},{"$f":"SUM(AH31:AM31)","v":0}]

{"sheet":"Nationale_3_poule_A","index":5,"n_rows":31,"n_cols":41,"rows_kept":31,"cut":false,"hidden":false,"merged":[[5,3,5,11],[5,23,5,31],[6,3,6,11],[6,23,6,31],[25,3,25,8],[25,23,25,28],[8,25,8,26],[24,10,25,10],[24,30,25,30],[24,11,25,11],[24,31,25,31],[24,7,24,8],[24,27,24,28],[34,23,40,23],[26,3,26,8],[26,11,27,11],[26,23,26,28],[26,31,27,31],[26,10,27,10],[26,30,27,30],[29,3,30,11],[29,23,30,31],[27,3,27,8],[27,23,27,28]]}
[]
[]
[]
[]
[]
[null,null,null,"Equipe A",null,null,null,null,null,null,null,null,null,null,null,null,null,null,null,null,null,null,null,"Equipe B"]
[null,null,null,"BERCK",null,null,null,null,null,null,null,null,null,null,null,null,null,null,null,null,null,null,null,"BERCK"]
[]
[null,null,null,"Carte","Pts","   Noms         /          Prénoms",null,"N°","Valeur","entrée en jeu","Sans Abattement","Bonus",null,"J","JF","F-FET","S-SF",null,"Valide","ET",null,null,null,"Carte","Pts","   Noms         /          Prénoms",null,"N°","Valeur","entrée en jeu","Sans Abattement","Bonus",null,"J","JF","F-FET","S-SF",null,"Valide","ET"]
[]
[null,null,null,null,null,null,null,null,{"$f":"IF(AND(D11=\"\",E11=5),5,IF(AND(D11=\"VAL\",E11<5),\"faux\",IF(D11=\"j\",E11,IF(D11=\"jf\",E11,IF(D11=\"f\",E11,IF(D11=\"fet\",E11,IF(D11=\"et\",E11,IF(AND(D11=\"\",E11=\"\"),\"\",E11))))))))","v":""},null,{"$f":"IF(AND(J11=\"X\",E11>0),I11,\"\")","v":""},{"$f":"IF(AND(J11=\"X\",D11=\"J\",E11<5),1.5,IF(AND(J11=\"X\",D11=\"JS\",E11<5),2,IF(AND(J11=\"X\",D11=\"JF\",E11<5),2.5,IF(AND(J11=\"X\",D11=\"JFS\",E11<5),3,IF(AND(J11=\"X\",D11=\"F\",E11<5),1.5,IF(AND(J11=\"X\",D11=\"FET\",E11<5),1.5,IF(AND(J11=\"X\",D11=\"SFET\",E11<5),2,IF(AND(J11=\"X\",D11=\"SF\",E11<5),2,IF(AND(J11=\"X\",D11=\"FV\",E11=5),0.5,IF(AND(J11=\"X\",D11=\"S\",E11<5),0.5,IF(AND(J11=\"X\",D11=\"SET\",E11<5),0.5,IF(AND(J11=\"X\",D11=\"SFID\",E11<5),0.5,\"\"))))))))))))","v":""},null,{"$f":"IF(AND(J11=\"X\",D11=\"J\"),1,\"\")","v":""},{"$f":"IF(AND(J11=\"X\",D11=\"JF\"),1,IF(AND(J11=\"X\",D11=\"SF\"),1,\"\"))","v":""},{"$f":"IF(AND(J11=\"X\",D11=\"F\"),1,IF(AND(J11=\"X\",D11=\"FET\"),1,\"\"))","v":""},{"$f":"IF(AND(J11=\"X\",D11=\"S\"),1,\"\")","v":""},{"$f":"IF(AND(J11=\"X\",E11>0),1,\"\")","v":""},{"$f":"IF(E11=5,1,\"\")","v":""},{"$f":"IF(D11=\"ET\",1,\"\")","v":""},{"$f":"IF(AND(J11=\"X\",D11=\"ET\"),1,\"\")","v":""},null,null,null,null,null,null,null,{"$f":"IF(AND(X11=\"\",Y11=5),5,IF(AND(X11=\"VAL\",Y11<5),\"faux\",IF(X11=\"j\",Y11,IF(X11=\"jf\",Y11,IF(X11=\"f\",Y11,IF(X11=\"fet\",Y11,IF(X11=\"et\",Y11,IF(AND(X11=\"\",Y11=\"\"),\"\",Y11))))))))","v":""},null,{"$f":"IF(AND(AD11=\"X\",Y11>0),AC11,\"\")","v":""},{"$f":"IF(AND(AD11=\"X\",X11=\"J\",Y11<5),1.5,IF(AND(AD11=\"X\",X11=\"JS\",Y11<5),2,IF(AND(AD11=\"X\",X11=\"JF\",Y11<5),2.5,IF(AND(AD11=\"X\",X11=\"JFS\",Y11<5),3,IF(AND(AD11=\"X\",X11=\"F\",Y11<5),1.5,IF(AND(AD11=\"X\",X11=\"FET\",Y11<5),1.5,IF(AND(AD11=\"X\",X11=\"SFET\",Y11<5),2,IF(AND(AD11=\"X\",X11=\"SF\",Y11<5),2,IF(AND(AD11=\"X\",X11=\"FV\",Y11=5),0.5,IF(AND(AD11=\"X\",X11=\"S\",Y11<5),0.5,IF(AND(AD11=\"X\",X11=\"SET\",Y11<5),0.5,IF(AND(AD11=\"X\",X11=\"SFID\",Y11<5),0.5,\"\"))))))))))))","v":""},null,{"$f":"IF(AND(AD11=\"X\",X11=\"J\"),1,\"\")","v":""},{"$f":"IF(AND(AD11=\"X\",X11=\"JF\"),1,IF(AND(AD11=\"X\",X11=\"SF\"),1,\"\"))","v":""},{"$f":"IF(AND(AD11=\"X\",X11=\"F\"),1,IF(AND(AD11=\"X\",X11=\"FET\"),1,\"\"))","v":""},{"$f":"IF(AND(AD11=\"X\",X11=\"S\"),1,\"\")","v":""},{"$f":"IF(AND(AD11=\"X\",Y11>0),1,\"\")","v":""},{"$f":"IF(Y11=5,1,\"\")","v":""},{"$f":"IF(X11=\"ET\",1,\"\")","v":""},{"$f":"IF(AND(AD11=\"X\",X11=\"ET\"),1,\"\")","v":""}]
[{"$f":"IF('Liste équipes'!E4=\"\",\"\",'Liste équipes'!E4)","v":"BERCK"},null,null,null,null,null,null,null,{"$f":"IF(AND(D12=\"\",E12=5),5,IF(AND(D12=\"VAL\",E12<5),\"faux\",IF(D12=\"j\",E12,IF(D12=\"jf\",E12,IF(D12=\"f\",E12,IF(D12=\"fet\",E12,IF(D12=\"et\",E12,IF(AND(D12=\"\",E12=\"\"),\"\",E12))))))))","v":""},null,{"$f":"IF(AND(J12=\"X\",E12>0),I12,\"\")","v":""},{"$f":"IF(AND(J12=\"X\",D12=\"J\",E12<5),1.5,IF(AND(J12=\"X\",D12=\"JS\",E12<5),2,IF(AND(J12=\"X\",D12=\"JF\",E12<5),2.5,IF(AND(J12=\"X\",D12=\"JFS\",E12<5),3,IF(AND(J12=\"X\",D12=\"F\",E12<5),1.5,IF(AND(J12=\"X\",D12=\"FET\",E12<5),1.5,IF(AND(J12=\"X\",D12=\"SFET\",E12<5),2,IF(AND(J12=\"X\",D12=\"SF\",E12<5),2,IF(AND(J12=\"X\",D12=\"FV\",E12=5),0.5,IF(AND(J12=\"X\",D12=\"S\",E12<5),0.5,IF(AND(J12=\"X\",D12=\"SET\",E12<5),0.5,IF(AND(J12=\"X\",D12=\"SFID\",E12<5),0.5,\"\"))))))))))))","v":""},null,"",{"$f":"IF(AND(J12=\"X\",D12=\"JF\"),1,\"\")","v":""},"","","","","",{"$f":"IF(AND(J12=\"X\",D12=\"ET\"),1,\"\")","v":""},null,null,null,null,null,null,null,{"$f":"IF(AND(X12=\"\",Y12=5),5,IF(AND(X12=\"VAL\",Y12<5),\"faux\",IF(X12=\"j\",Y12,IF(X12=\"jf\",Y12,IF(X12=\"f\",Y12,IF(X12=\"fet\",Y12,IF(X12=\"et\",Y12,IF(AND(X12=\"\",Y12=\"\"),\"\",Y12))))))))","v":""},null,{"$f":"IF(AND(AD12=\"X\",Y12>0),AC12,\"\")","v":""},{"$f":"IF(AND(AD12=\"X\",X12=\"J\",Y12<5),1.5,IF(AND(AD12=\"X\",X12=\"JS\",Y12<5),2,IF(AND(AD12=\"X\",X12=\"JF\",Y12<5),2.5,IF(AND(AD12=\"X\",X12=\"JFS\",Y12<5),3,IF(AND(AD12=\"X\",X12=\"F\",Y12<5),1.5,IF(AND(AD12=\"X\",X12=\"FET\",Y12<5),1.5,IF(AND(AD12=\"X\",X12=\"SFET\",Y12<5),2,IF(AND(AD12=\"X\",X12=\"SF\",Y12<5),2,IF(AND(AD12=\"X\",X12=\"FV\",Y12=5),0.5,IF(AND(AD12=\"X\",X12=\"S\",Y12<5),0.5,IF(AND(AD12=\"X\",X12=\"SET\",Y12<5),0.5,IF(AND(AD12=\"X\",X12=\"SFID\",Y12<5),0.5,\"\"))))))))))))","v":""},null,"",{"$f":"IF(AND(AD12=\"X\",X12=\"JF\"),1,\"\")","v":""},"","","","","",{"$f":"IF(AND(AD12=\"X\",X12=\"ET\"),1,\"\")","v":""}]
[{"$f":"IF('Liste équipes'!E5=\"\",\"\",'Liste équipes'!E5)","v":"CAPSAAA 2"},null,null,null,null,null,null,null,{"$f":"IF(AND(D13=\"\",E13=5),5,IF(AND(D13=\"VAL\",E13<5),\"faux\",IF(D13=\"j\",E13,IF(D13=\"jf\",E13,IF(D13=\"f\",E13,IF(D13=\"fet\",E13,IF(D13=\"et\",E13,IF(AND(D13=\"\",E13=\"\"),\"\",E13))))))))","v":""},null,"",{"$f":"IF(AND(J13=\"X\",D13=\"J\",E13<5),1.5,IF(AND(J13=\"X\",D13=\"JS\",E13<5),2,IF(AND(J13=\"X\",D13=\"JF\",E13<5),2.5,IF(AND(J13=\"X\",D13=\"JFS\",E13<5),3,IF(AND(J13=\"X\",D13=\"F\",E13<5),1.5,IF(AND(J13=\"X\",D13=\"FET\",E13<5),1.5,IF(AND(J13=\"X\",D13=\"SFET\",E13<5),2,IF(AND(J13=\"X\",D13=\"SF\",E13<5),2,IF(AND(J13=\"X\",D13=\"FV\",E13=5),0.5,IF(AND(J13=\"X\",D13=\"S\",E13<5),0.5,IF(AND(J13=\"X\",D13=\"SET\",E13<5),0.5,IF(AND(J13=\"X\",D13=\"SFID\",E13<5),0.5,\"\"))))))))))))","v":""},null,"","","","","","","","",null,null,null,null,null,null,null,"",null,{"$f":"IF(AND(AD13=\"X\",Y13>0),AC13,\"\")","v":""},"",null,"","","","","","","",""]
[{"$f":"IF('Liste équipes'!E6=\"\",\"\",'Liste équipes'!E6)","v":"CERGY PONTOISE"},null,null,null,null,null,null,null,"",null,"","",null,"","","","","","","","",null,null,null,null,null,null,null,"",null,"","",null,"","","","","","","",""]
[{"$f":"IF('Liste équipes'!E7=\"\",\"\",'Liste équipes'!E7)","v":"CHARLEVILLE"},null,null,null,null,null,null,null,"",null,"","",null,"","","","","","","","",null,null,null,null,null,null,null,"",null,"","",null,"","","","","","","",""]
[{"$f":"IF('Liste équipes'!E8=\"\",\"\",'Liste équipes'!E8)","v":"LILLE 2"},null,null,null,null,null,null,null,"",null,"","",null,"","","","","","","","",null,null,null,null,null,null,null,"",null,"","",null,"","","","","","","",""]
[{"$f":"IF('Liste équipes'!E9=\"\",\"\",'Liste équipes'!E9)","v":"ORLEANS"},null,null,null,null,null,null,null,"",null,"","",null,"","","","","","","","",null,null,null,null,null,null,null,"",null,"","",null,"","","","","","","",""]
[{"$f":"IF('Liste équipes'!E10=\"\",\"\",'Liste équipes'!E10)","v":"PARIS BASKET"},null,null,null,null,null,null,null,"",null,"","",null,"","","","","","","","",null,null,null,null,null,null,null,"",null,"","",null,"","","","","","","",""]
[{"$f":"IF('Liste équipes'!E11=\"\",\"\",'Liste équipes'!E11)","v":"REIMS"},null,null,null,null,null,null,null,"",null,"","",null,"","","","","","","","",null,null,null,null,null,null,null,"",null,"","",null,"","","","","","","",""]
[{"$f":"IF('Liste équipes'!E12=\"\",\"\",'Liste équipes'!E12)","v":"SUD OISE SPORTS ET HANDICAPS"},null,null,null,null,null,null,null,"",null,"","",null,"","","","","","","","",null,null,null,null,null,null,null,"",null,"","",null,"","","","","","","",""]
[{"$f":"IF('Liste équipes'!E13=\"\",\"\",'Liste équipes'!E13)","v":"VALENCIENNES"},null,null,null,null,null,null,null,"",null,"","",null,"","","","","","","","",null,null,null,null,null,null,null,"",null,"","",null,"","","","","","","",""]
[{"$f":"IF('Liste équipes'!E14=\"\",\"\",'Liste équipes'!E14)","v":""},null,null,null,null,null,null,null,{"$f":"IF(AND(D22=\"\",E22=5),5,IF(AND(D22=\"VAL\",E22<5),\"faux\",IF(D22=\"j\",E22,IF(D22=\"jf\",E22,IF(D22=\"f\",E22,IF(D22=\"fet\",E22,IF(D22=\"et\",E22,IF(AND(D22=\"\",E22=\"\"),\"\",E22))))))))","v":""},null,"","",null,"","","","","","","","",null,null,null,null,null,null,null,{"$f":"IF(AND(X22=\"\",Y22=5),5,IF(AND(X22=\"VAL\",Y22<5),\"faux\",IF(X22=\"j\",Y22,IF(X22=\"jf\",Y22,IF(X22=\"f\",Y22,IF(X22=\"fet\",Y22,IF(X22=\"et\",Y22,IF(AND(X22=\"\",Y22=\"\"),\"\",Y22))))))))","v":""},null,"","",null,"","","","","","","",""]
[{"$f":"IF('Liste équipes'!E15=\"\",\"\",'Liste équipes'!E15)","v":""},null,null,null,null,null,null,null,null,null,null,null,null,"","","","","","","","",null,null,null,null,null,null,null,null,null,null,null,null,"","","","","","","",""]
[null,null,null,null,null,null,null,null,null,null,null,null,null,"","","","","","","","",null,null,null,null,null,null,null,null,null,null,null,null,"","","","","","","",""]
[null,null,null,"  Nombre joueurs sur le terrain",null,null,{"$f":"IF(J25>5,\"\",\"OK\")","v":""},{"$f":"IF(R25>5,\"PAS OK\",\"\")","v":""},null,{"$f":"IF(L27=\"\",\"\",R25)","v":""},"Points en jeu","Avec Bonus maxi 19 pts",null,{"$f":"SUM(N11:N24)","v":0},0,0,0,0,0,0,0,null,null,"  Nombre joueurs sur le terrain",null,null,{"$f":"IF(AD25>5,\"\",\"OK\")","v":""},{"$f":"IF(AL25>5,\"PAS OK\",\"\")","v":""},null,{"$f":"IF(AF27=\"\",\"\",AL25)","v":""},"Points en jeu","Avec Bonus maxi 19 pts",null,{"$f":"SUM(AH11:AH24)","v":0},0,0,0,0,0,0,0]
[null,null,null,null,null,null,null,null,null,null,null,null,null,{"$f":"IF(N25=0,\"\",IF(N25=1,17,IF(N25=2,18.5,IF(N25=3,19,IF(N25>3,19,IF(N25>4,19,IF(N25>5,19,\"\")))))))","v":""},{"$f":"IF(O25=0,\"\",IF(O25=1,18,IF(O25=2,19,IF(O25=3,19,IF(O25=4,19,IF(O25=4,19,\"\"))))))","v":""},{"$f":"IF(P25=0,\"\",IF(P25=1,17,IF(P25=2,18.5,IF(P25=3,19,IF(P25=4,19,IF(P25=5,17.5,\"\"))))))","v":""},{"$f":"IF(Q25=0,\"\",IF(Q25=1,16,IF(Q25=2,16.5,IF(Q25=3,17,IF(Q25=4,17.5,IF(Q25=5,18,IF(Q25=6,18.5,IF(Q25=7,19,IF(Q25=8,19,IF(Q25=9,19,IF(Q25=10,19,IF(Q25=11,19,IF(Q25=12,19,\"\")))))))))))))","v":""},{"$f":"IF(AND(O26=16.5,P26=16),17.5,IF(AND(N26=15.5,P26=16),17,IF(AND(N26=15.5,O26=16.5),17.5,IF(AND(N26=16.5,P26=16),17.5,IF(AND(N25=2,O26=16.5),17.5,\"\")))))","v":""},null,null,null,null,null,null,null,null,null,null,null,null,null,null,null,{"$f":"IF(AH25=0,\"\",IF(AH25=1,17,IF(AH25=2,18.5,IF(AH25=3,19,IF(AH25>3,19,IF(AH25>4,19,IF(AH25>5,19,\"\")))))))","v":""},{"$f":"IF(AI25=0,\"\",IF(AI25=1,18,IF(AI25=2,19,IF(AI25=3,19,IF(AI25=4,19,IF(AI25=4,19,\"\"))))))","v":""},{"$f":"IF(AJ25=0,\"\",IF(AJ25=1,17,IF(AJ25=2,18.5,IF(AJ25=3,19,IF(AJ25=4,19,IF(AJ25=5,17.5,\"\"))))))","v":""},{"$f":"IF(AK25=0,\"\",IF(AK25=1,16,IF(AK25=2,16.5,IF(AK25=3,17,IF(AK25=4,17.5,IF(AK25=5,18,IF(AK25=6,18.5,IF(AK25=7,19,IF(AK25=8,19,IF(AK25=9,19,IF(AK25=10,19,IF(AK25=11,19,IF(AK25=12,19,\"\")))))))))))))","v":""},{"$f":"IF(AND(AI26=16.5,AJ26=16),17.5,IF(AND(AH26=15.5,AJ26=16),17,IF(AND(AH26=15.5,AI26=16.5),17.5,IF(AND(AH26=16.5,AJ26=16),17.5,IF(AND(AH25=2,AI26=16.5),17.5,\"\")))))","v":""}]
[null,null," ",{"$f":"IF(K27>L27,\"Trop de points en jeu\",\"\")","v":""},null,null,null,null,null,null,{"$f":"IF(O28>0,O28,\"\")","v":""},{"$f":"IF(O28=0,\"\",Q28)","v":""},null,{"$f":"SUM(N26)","v":0},{"$f":"SUM(O26)","v":0},{"$f":"SUM(P26)","v":0},{"$f":"SUM(Q26)","v":0},{"$f":"SUM(R26)","v":0},null,null,null,null," ",{"$f":"IF(AE27>AF27,\"Trop de points en jeu\",\"\")","v":""},null,null,null,null,null,null,{"$f":"IF(AI28>0,AI28,\"\")","v":""},{"$f":"IF(AI28=0,\"\",AK28)","v":""},null,{"$f":"SUM(AH26)","v":0},{"$f":"SUM(AI26)","v":0},{"$f":"SUM(AJ26)","v":0},{"$f":"SUM(AK26)","v":0},{"$f":"SUM(AL26)","v":0}]
[null,null,null,{"$f":"IF(S25>2,\"Trop de joueurs  valides inscrits sur la feuille\",\"\")","v":""},null,null,null,null,null,null,null,null,null,{"$f":"SUM(L11:L24)","v":0},{"$f":"SUM(K11:K24)","v":0},{"$f":"SUM(N28+15.5)","v":15.5},{"$f":"IF(P28>19,19,P28)","v":15.5},null,null,{"$f":"SUM(T30:T31)","v":0},null,null,null,{"$f":"IF(AM25>2,\"Trop de joueurs  valides inscrits sur la feuille\",\"\")","v":""},null,null,null,null,null,null,null,null,null,{"$f":"SUM(AF11:AF24)","v":0},{"$f":"SUM(AE11:AE24)","v":0},{"$f":"SUM(AH28+15.5)","v":15.5},{"$f":"IF(AJ28>19,19,AJ28)","v":15.5},null,null,{"$f":"SUM(AN30:AN31)","v":0}]
[]
[null,null,null,{"$f":"IF(T25>5,\" Pas OK. Trop de joueurs (5 points), vérifier la liste de l'équipe.\",IF(U25>4,\"Pas OK. Trop de joueurs étrangers en jeu (ET), vérifier la liste.\",\"\"))","v":""},null,null,null,null,null,null,null,null,null,{"$f":"IF(D11=\"ET\",1,\"\")","v":""},{"$f":"IF(D12=\"ET\",1,\"\")","v":""},{"$f":"IF(D13=\"ET\",1,\"\")","v":""},{"$f":"IF(D14=\"ET\",1,\"\")","v":""},{"$f":"IF(D15=\"ET\",1,\"\")","v":""},{"$f":"IF(D16=\"ET\",1,\"\")","v":""},{"$f":"SUM(N30:S30)","v":0},null,null,null,{"$f":"IF(AN25>5,\" Pas OK. Trop de joueurs (5 points), vérifier la liste de l'équipe.\",IF(AO25>4,\"Pas OK. Trop de joueurs étrangers en jeu (ET), vérifier la liste.\",\"\"))","v":""},null,null,null,null,null,null,null,null,null,{"$f":"IF(X11=\"ET\",1,\"\")","v":""},{"$f":"IF(X12=\"ET\",1,\"\")","v":""},{"$f":"IF(X13=\"ET\",1,\"\")","v":""},{"$f":"IF(X14=\"ET\",1,\"\")","v":""},{"$f":"IF(X15=\"ET\",1,\"\")","v":""},{"$f":"IF(X16=\"ET\",1,\"\")","v":""},{"$f":"SUM(AH30:AM30)","v":0}]
[null,null,null,null,null,null,null,null,null,null,null,null,null,{"$f":"IF(D17=\"ET\",1,\"\")","v":""},{"$f":"IF(D18=\"ET\",1,\"\")","v":""},{"$f":"IF(D19=\"ET\",1,\"\")","v":""},{"$f":"IF(D20=\"ET\",1,\"\")","v":""},{"$f":"IF(D21=\"ET\",1,\"\")","v":""},{"$f":"IF(D22=\"ET\",1,\"\")","v":""},{"$f":"SUM(N31:S31)","v":0},null,null,null,null,null,null,null,null,null,null,null,null,null,{"$f":"IF(X17=\"ET\",1,\"\")","v":""},{"$f":"IF(X18=\"ET\",1,\"\")","v":""},{"$f":"IF(X19=\"ET\",1,\"\")","v":""},{"$f":"IF(X20=\"ET\",1,\"\")","v":""},{"$f":"IF(X21=\"ET\",1,\"\")","v":""},{"$f":"IF(X22=\"ET\",1,\"\")","v":""},{"$f":"SUM(AH31:AM31)","v":0}]

{"sheet":"Nationale_3_poule_B","index":6,"n_rows":31,"n_cols":41,"rows_kept":31,"cut":false,"hidden":false,"merged":[[5,3,5,11],[5,23,5,31],[6,3,6,11],[6,23,6,31],[25,3,25,8],[25,23,25,28],[8,25,8,26],[24,10,25,10],[24,30,25,30],[24,11,25,11],[24,31,25,31],[24,7,24,8],[24,27,24,28],[34,23,40,23],[26,3,26,8],[26,11,27,11],[26,23,26,28],[26,31,27,31],[26,10,27,10],[26,30,27,30],[29,3,30,11],[29,23,30,31],[27,3,27,8],[27,23,27,28]]}
[]
[]
[]
[]
[]
[null,null,null,"Equipe A",null,null,null,null,null,null,null,null,null,null,null,null,null,null,null,null,null,null,null,"Equipe B"]
[null,null,null,"VANDOEUVRE 2",null,null,null,null,null,null,null,null,null,null,null,null,null,null,null,null,null,null,null,"TROYES"]
[]
[null,null,null,"Carte","Pts","   Noms         /          Prénoms",null,"N°","Valeur","entrée en jeu","Sans Abattement","Bonus",null,"J","JF","F-FET","S-SF",null,"Valide","ET",null,null,null,"Carte","Pts","   Noms         /          Prénoms",null,"N°","Valeur","entrée en jeu","Sans Abattement","Bonus",null,"J","JF","F-FET","S-SF",null,"Valide","ET"]
[]
[{"$f":"IF('Liste équipes'!F3=\"\",\"\",'Liste équipes'!F3)","v":"AUXERRE"},null,null,null,null,null,null,null,{"$f":"IF(AND(D11=\"\",E11=5),5,IF(AND(D11=\"VAL\",E11<5),\"faux\",IF(D11=\"j\",E11,IF(D11=\"jf\",E11,IF(D11=\"f\",E11,IF(D11=\"fet\",E11,IF(D11=\"et\",E11,IF(AND(D11=\"\",E11=\"\"),\"\",E11))))))))","v":""},null,{"$f":"IF(AND(J11=\"X\",E11>0),I11,\"\")","v":""},{"$f":"IF(AND(J11=\"X\",D11=\"J\",E11<5),1.5,IF(AND(J11=\"X\",D11=\"JS\",E11<5),2,IF(AND(J11=\"X\",D11=\"JF\",E11<5),2.5,IF(AND(J11=\"X\",D11=\"JFS\",E11<5),3,IF(AND(J11=\"X\",D11=\"F\",E11<5),1.5,IF(AND(J11=\"X\",D11=\"FET\",E11<5),1.5,IF(AND(J11=\"X\",D11=\"SFET\",E11<5),2,IF(AND(J11=\"X\",D11=\"SF\",E11<5),2,IF(AND(J11=\"X\",D11=\"FV\",E11=5),0.5,IF(AND(J11=\"X\",D11=\"S\",E11<5),0.5,IF(AND(J11=\"X\",D11=\"SET\",E11<5),0.5,IF(AND(J11=\"X\",D11=\"SFID\",E11<5),0.5,\"\"))))))))))))","v":""},null,{"$f":"IF(AND(J11=\"X\",D11=\"J\"),1,\"\")","v":""},{"$f":"IF(AND(J11=\"X\",D11=\"JF\"),1,IF(AND(J11=\"X\",D11=\"SF\"),1,\"\"))","v":""},{"$f":"IF(AND(J11=\"X\",D11=\"F\"),1,IF(AND(J11=\"X\",D11=\"FET\"),1,\"\"))","v":""},{"$f":"IF(AND(J11=\"X\",D11=\"S\"),1,\"\")","v":""},{"$f":"IF(AND(J11=\"X\",E11>0),1,\"\")","v":""},{"$f":"IF(E11=5,1,\"\")","v":""},{"$f":"IF(D11=\"ET\",1,\"\")","v":""},{"$f":"IF(AND(J11=\"X\",D11=\"ET\"),1,\"\")","v":""},null,null,null,null,null,null,null,{"$f":"IF(AND(X11=\"\",Y11=5),5,IF(AND(X11=\"VAL\",Y11<5),\"faux\",IF(X11=\"j\",Y11,IF(X11=\"jf\",Y11,IF(X11=\"f\",Y11,IF(X11=\"fet\",Y11,IF(X11=\"et\",Y11,IF(AND(X11=\"\",Y11=\"\"),\"\",Y11))))))))","v":""},null,{"$f":"IF(AND(AD11=\"X\",Y11>0),AC11,\"\")","v":""},{"$f":"IF(AND(AD11=\"X\",X11=\"J\",Y11<5),1.5,IF(AND(AD11=\"X\",X11=\"JS\",Y11<5),2,IF(AND(AD11=\"X\",X11=\"JF\",Y11<5),2.5,IF(AND(AD11=\"X\",X11=\"JFS\",Y11<5),3,IF(AND(AD11=\"X\",X11=\"F\",Y11<5),1.5,IF(AND(AD11=\"X\",X11=\"FET\",Y11<5),1.5,IF(AND(AD11=\"X\",X11=\"SFET\",Y11<5),2,IF(AND(AD11=\"X\",X11=\"SF\",Y11<5),2,IF(AND(AD11=\"X\",X11=\"FV\",Y11=5),0.5,IF(AND(AD11=\"X\",X11=\"S\",Y11<5),0.5,IF(AND(AD11=\"X\",X11=\"SET\",Y11<5),0.5,IF(AND(AD11=\"X\",X11=\"SFID\",Y11<5),0.5,\"\"))))))))))))","v":""},null,{"$f":"IF(AND(AD11=\"X\",X11=\"J\"),1,\"\")","v":""},{"$f":"IF(AND(AD11=\"X\",X11=\"JF\"),1,IF(AND(AD11=\"X\",X11=\"SF\"),1,\"\"))","v":""},{"$f":"IF(AND(AD11=\"X\",X11=\"F\"),1,IF(AND(AD11=\"X\",X11=\"FET\"),1,\"\"))","v":""},{"$f":"IF(AND(AD11=\"X\",X11=\"S\"),1,\"\")","v":""},{"$f":"IF(AND(AD11=\"X\",Y11>0),1,\"\")","v":""},{"$f":"IF(Y11=5,1,\"\")","v":""},{"$f":"IF(X11=\"ET\",1,\"\")","v":""},{"$f":"IF(AND(AD11=\"X\",X11=\"ET\"),1,\"\")","v":""}]
[{"$f":"IF('Liste équipes'!F4=\"\",\"\",'Liste équipes'!F4)","v":"BELFORT"},null,null,null,null,null,null,null,{"$f":"IF(AND(D12=\"\",E12=5),5,IF(AND(D12=\"VAL\",E12<5),\"faux\",IF(D12=\"j\",E12,IF(D12=\"jf\",E12,IF(D12=\"f\",E12,IF(D12=\"fet\",E12,IF(D12=\"et\",E12,IF(AND(D12=\"\",E12=\"\"),\"\",E12))))))))","v":""},null,{"$f":"IF(AND(J12=\"X\",E12>0),I12,\"\")","v":""},{"$f":"IF(AND(J12=\"X\",D12=\"J\",E12<5),1.5,IF(AND(J12=\"X\",D12=\"JS\",E12<5),2,IF(AND(J12=\"X\",D12=\"JF\",E12<5),2.5,IF(AND(J12=\"X\",D12=\"JFS\",E12<5),3,IF(AND(J12=\"X\",D12=\"F\",E12<5),1.5,IF(AND(J12=\"X\",D12=\"FET\",E12<5),1.5,IF(AND(J12=\"X\",D12=\"SFET\",E12<5),2,IF(AND(J12=\"X\",D12=\"SF\",E12<5),2,IF(AND(J12=\"X\",D12=\"FV\",E12=5),0.5,IF(AND(J12=\"X\",D12=\"S\",E12<5),0.5,IF(AND(J12=\"X\",D12=\"SET\",E12<5),0.5,IF(AND(J12=\"X\",D12=\"SFID\",E12<5),0.5,\"\"))))))))))))","v":""},null,"",{"$f":"IF(AND(J12=\"X\",D12=\"JF\"),1,\"\")","v":""},"","","","","",{"$f":"IF(AND(J12=\"X\",D12=\"ET\"),1,\"\")","v":""},null,null,null,null,null,null,null,{"$f":"IF(AND(X12=\"\",Y12=5),5,IF(AND(X12=\"VAL\",Y12<5),\"faux\",IF(X12=\"j\",Y12,IF(X12=\"jf\",Y12,IF(X12=\"f\",Y12,IF(X12=\"fet\",Y12,IF(X12=\"et\",Y12,IF(AND(X12=\"\",Y12=\"\"),\"\",Y12))))))))","v":""},null,{"$f":"IF(AND(AD12=\"X\",Y12>0),AC12,\"\")","v":""},{"$f":"IF(AND(AD12=\"X\",X12=\"J\",Y12<5),1.5,IF(AND(AD12=\"X\",X12=\"JS\",Y12<5),2,IF(AND(AD12=\"X\",X12=\"JF\",Y12<5),2.5,IF(AND(AD12=\"X\",X12=\"JFS\",Y12<5),3,IF(AND(AD12=\"X\",X12=\"F\",Y12<5),1.5,IF(AND(AD12=\"X\",X12=\"FET\",Y12<5),1.5,IF(AND(AD12=\"X\",X12=\"SFET\",Y12<5),2,IF(AND(AD12=\"X\",X12=\"SF\",Y12<5),2,IF(AND(AD12=\"X\",X12=\"FV\",Y12=5),0.5,IF(AND(AD12=\"X\",X12=\"S\",Y12<5),0.5,IF(AND(AD12=\"X\",X12=\"SET\",Y12<5),0.5,IF(AND(AD12=\"X\",X12=\"SFID\",Y12<5),0.5,\"\"))))))))))))","v":""},null,"",{"$f":"IF(AND(AD12=\"X\",X12=\"JF\"),1,\"\")","v":""},"","","","","",{"$f":"IF(AND(AD12=\"X\",X12=\"ET\"),1,\"\")","v":""}]
[{"$f":"IF('Liste équipes'!F5=\"\",\"\",'Liste équipes'!F5)","v":"CHARLEVILLE"},null,null,null,null,null,null,null,{"$f":"IF(AND(D13=\"\",E13=5),5,IF(AND(D13=\"VAL\",E13<5),\"faux\",IF(D13=\"j\",E13,IF(D13=\"jf\",E13,IF(D13=\"f\",E13,IF(D13=\"fet\",E13,IF(D13=\"et\",E13,IF(AND(D13=\"\",E13=\"\"),\"\",E13))))))))","v":""},null,"",{"$f":"IF(AND(J13=\"X\",D13=\"J\",E13<5),1.5,IF(AND(J13=\"X\",D13=\"JS\",E13<5),2,IF(AND(J13=\"X\",D13=\"JF\",E13<5),2.5,IF(AND(J13=\"X\",D13=\"JFS\",E13<5),3,IF(AND(J13=\"X\",D13=\"F\",E13<5),1.5,IF(AND(J13=\"X\",D13=\"FET\",E13<5),1.5,IF(AND(J13=\"X\",D13=\"SFET\",E13<5),2,IF(AND(J13=\"X\",D13=\"SF\",E13<5),2,IF(AND(J13=\"X\",D13=\"FV\",E13=5),0.5,IF(AND(J13=\"X\",D13=\"S\",E13<5),0.5,IF(AND(J13=\"X\",D13=\"SET\",E13<5),0.5,IF(AND(J13=\"X\",D13=\"SFID\",E13<5),0.5,\"\"))))))))))))","v":""},null,"","","","","","","","",null,null,null,null,null,null,null,"",null,{"$f":"IF(AND(AD13=\"X\",Y13>0),AC13,\"\")","v":""},{"$f":"IF(AND(AD13=\"X\",X13=\"J\",Y13<5),1.5,IF(AND(AD13=\"X\",X13=\"JS\",Y13<5),2,IF(AND(AD13=\"X\",X13=\"JF\",Y13<5),2.5,IF(AND(AD13=\"X\",X13=\"JFS\",Y13<5),3,IF(AND(AD13=\"X\",X13=\"F\",Y13<5),1.5,IF(AND(AD13=\"X\",X13=\"FET\",Y13<5),1.5,IF(AND(AD13=\"X\",X13=\"SFET\",Y13<5),2,IF(AND(AD13=\"X\",X13=\"SF\",Y13<5),2,IF(AND(AD13=\"X\",X13=\"FV\",Y13=5),0.5,IF(AND(AD13=\"X\",X13=\"S\",Y13<5),0.5,IF(AND(AD13=\"X\",X13=\"SET\",Y13<5),0.5,IF(AND(AD13=\"X\",X13=\"SFID\",Y13<5),0.5,\"\"))))))))))))","v":""},null,"","","","","","","",""]
[{"$f":"IF('Liste équipes'!F6=\"\",\"\",'Liste équipes'!F6)","v":"ENT CHALON DIJON 3"},null,null,null,null,null,null,null,"",null,"","",null,"","","","","","","","",null,null,null,null,null,null,null,"",null,"","",null,"","","","","","","",""]
[{"$f":"IF('Liste équipes'!F7=\"\",\"\",'Liste équipes'!F7)","v":"HAGUENAU"},null,null,null,null,null,null,null,"",null,"","",null,"","","","","","","","",null,null,null,null,null,null,null,"",null,"","",null,"","","","","","","",""]
[{"$f":"IF('Liste équipes'!F8=\"\",\"\",'Liste équipes'!F8)","v":"MULHOUSE"},null,null,null,null,null,null,null,"",null,"","",null,"","","","","","","","",null,null,null,null,null,null,null,"",null,"","",null,"","","","","","","",""]
[{"$f":"IF('Liste équipes'!F9=\"\",\"\",'Liste équipes'!F9)","v":"THIONVILLE"},null,null,null,null,null,null,null,"",null,"","",null,"","","","","","","","",null,null,null,null,null,null,null,"",null,"","",null,"","","","","","","",""]
[{"$f":"IF('Liste équipes'!F10=\"\",\"\",'Liste équipes'!F10)","v":"TROYES"},null,null,null,null,null,null,null,"",null,"","",null,"","","","","","","","",null,null,null,null,null,null,null,"",null,"","",null,"","","","","","","",""]
[{"$f":"IF('Liste équipes'!F11=\"\",\"\",'Liste équipes'!F11)","v":"VANDOEUVRE 2"},null,null,null,null,null,null,null,"",null,"","",null,"","","","","","","","",null,null,null,null,null,null,null,"",null,"","",null,"","","","","","","",""]
[null,null,null,null,null,null,null,null,"",null,"","",null,"","","","","","","","",null,null,null,null,null,null,null,"",null,"","",null,"","","","","","","",""]
[null,null,null,null,null,null,null,null,"",null,"","",null,"","","","","","","","",null,null,null,null,null,null,null,"",null,"","",null,"","","","","","","",""]
[null,null,null,null,null,null,null,null,"",null,"","",null,"","","","","","","","",null,null,null,null,null,null,null,"",null,"","",null,"","","","","","","",""]
[null,null,null,null,null,null,null,null,null,null,null,null,null,"","","","","","","","",null,null,null,null,null,null,null,null,null,null,null,null,"","","","","","","",""]
[null,null,null,null,null,null,null,null,null,null,null,null,null,"","","","","","","","",null,null,null,null,null,null,null,null,null,null,null,null,"","","","","","","",""]
[null,null,null,"  Nombre joueurs sur le terrain",null,null,{"$f":"IF(J25>5,\"\",\"OK\")","v":""},{"$f":"IF(R25>5,\"PAS OK\",\"\")","v":""},null,{"$f":"IF(L27=\"\",\"\",R25)","v":""},"Points en jeu","Points autorisés maxi 19",null,{"$f":"SUM(N11:N24)","v":0},0,0,0,0,0,0,0,null,null,"  Nombre joueurs sur le terrain",null,null,{"$f":"IF(AD25>5,\"\",\"OK\")","v":""},{"$f":"IF(AL25>5,\"PAS OK\",\"\")","v":""},null,{"$f":"IF(AF27=\"\",\"\",AL25)","v":""},"Points en jeu","Points autorisés maxi 19",null,{"$f":"SUM(AH11:AH24)","v":0},0,0,0,0,0,0,0]
[null,null,null,null,null,null,null,null,null,null,null,null,null,{"$f":"IF(N25=0,\"\",IF(N25=1,17,IF(N25=2,18.5,IF(N25=3,19,IF(N25>3,19,IF(N25>4,19,IF(N25>5,19,\"\")))))))","v":""},{"$f":"IF(O25=0,\"\",IF(O25=1,18,IF(O25=2,19,IF(O25=3,19,IF(O25=4,19,IF(O25=4,19,\"\"))))))","v":""},{"$f":"IF(P25=0,\"\",IF(P25=1,17,IF(P25=2,18.5,IF(P25=3,19,IF(P25=4,19,IF(P25=5,17.5,\"\"))))))","v":""},{"$f":"IF(Q25=0,\"\",IF(Q25=1,16,IF(Q25=2,16.5,IF(Q25=3,17,IF(Q25=4,17.5,IF(Q25=5,18,IF(Q25=6,18.5,IF(Q25=7,19,IF(Q25=8,19,IF(Q25=9,19,IF(Q25=10,19,IF(Q25=11,19,IF(Q25=12,19,\"\")))))))))))))","v":""},{"$f":"IF(AND(O26=16.5,P26=16),17.5,IF(AND(N26=15.5,P26=16),17,IF(AND(N26=15.5,O26=16.5),17.5,IF(AND(N26=16.5,P26=16),17.5,IF(AND(N25=2,O26=16.5),17.5,\"\")))))","v":""},null,null,null,null,null,null,null,null,null,null,null,null,null,null,null,{"$f":"IF(AH25=0,\"\",IF(AH25=1,17,IF(AH25=2,18.5,IF(AH25=3,19,IF(AH25>3,19,IF(AH25>4,19,IF(AH25>5,19,\"\")))))))","v":""},{"$f":"IF(AI25=0,\"\",IF(AI25=1,18,IF(AI25=2,19,IF(AI25=3,19,IF(AI25=4,19,IF(AI25=4,19,\"\"))))))","v":""},{"$f":"IF(AJ25=0,\"\",IF(AJ25=1,17,IF(AJ25=2,18.5,IF(AJ25=3,19,IF(AJ25=4,19,IF(AJ25=5,17.5,\"\"))))))","v":""},{"$f":"IF(AK25=0,\"\",IF(AK25=1,16,IF(AK25=2,16.5,IF(AK25=3,17,IF(AK25=4,17.5,IF(AK25=5,18,IF(AK25=6,18.5,IF(AK25=7,19,IF(AK25=8,19,IF(AK25=9,19,IF(AK25=10,19,IF(AK25=11,19,IF(AK25=12,19,\"\")))))))))))))","v":""},{"$f":"IF(AND(AI26=16.5,AJ26=16),17.5,IF(AND(AH26=15.5,AJ26=16),17,IF(AND(AH26=15.5,AI26=16.5),17.5,IF(AND(AH26=16.5,AJ26=16),17.5,IF(AND(AH25=2,AI26=16.5),17.5,\"\")))))","v":""}]
[null,null," ",{"$f":"IF(K27>L27,\"Trop de points en jeu\",\"\")","v":""},null,null,null,null,null,null,{"$f":"IF(O28>0,O28,\"\")","v":""},{"$f":"IF(O28=0,\"\",Q28)","v":""},null,{"$f":"SUM(N26)","v":0},{"$f":"SUM(O26)","v":0},{"$f":"SUM(P26)","v":0},{"$f":"SUM(Q26)","v":0},{"$f":"SUM(R26)","v":0},null,null,null,null," ",{"$f":"IF(AE27>AF27,\"Trop de points en jeu\",\"\")","v":""},null,null,null,null,null,null,{"$f":"IF(AI28>0,AI28,\"\")","v":""},{"$f":"IF(AI28=0,\"\",AK28)","v":""},null,{"$f":"SUM(AH26)","v":0},{"$f":"SUM(AI26)","v":0},{"$f":"SUM(AJ26)","v":0},{"$f":"SUM(AK26)","v":0},{"$f":"SUM(AL26)","v":0}]
[null,null,null,{"$f":"IF(S25>2,\"Trop de joueurs  valides inscrits sur la feuille\",\"\")","v":""},null,null,null,null,null,null,null,null,null,{"$f":"SUM(L11:L24)","v":0},{"$f":"SUM(K11:K24)","v":0},{"$f":"SUM(N28+15.5)","v":15.5},{"$f":"IF(P28>19,19,P28)","v":15.5},null,null,{"$f":"SUM(T30:T31)","v":0},null,null,null,{"$f":"IF(AM25>2,\"Trop de joueurs  valides inscrits sur la feuille\",\"\")","v":""},null,null,null,null,null,null,null,null,null,{"$f":"SUM(AF11:AF24)","v":0},{"$f":"SUM(AE11:AE24)","v":0},{"$f":"SUM(AH28+15.5)","v":15.5},{"$f":"IF(AJ28>19,19,AJ28)","v":15.5},null,null,{"$f":"SUM(AN30:AN31)","v":0}]
[]
[null,null,null,{"$f":"IF(T25>5,\" Pas OK. Trop de joueurs (5 points), vérifier la liste de l'équipe.\",IF(U25>4,\"Pas OK. Trop de joueurs étrangers en jeu (ET), vérifier la liste.\",\"\"))","v":""},null,null,null,null,null,null,null,null,null,{"$f":"IF(D11=\"ET\",1,\"\")","v":""},{"$f":"IF(D12=\"ET\",1,\"\")","v":""},{"$f":"IF(D13=\"ET\",1,\"\")","v":""},{"$f":"IF(D14=\"ET\",1,\"\")","v":""},{"$f":"IF(D15=\"ET\",1,\"\")","v":""},{"$f":"IF(D16=\"ET\",1,\"\")","v":""},{"$f":"SUM(N30:S30)","v":0},null,null,null,{"$f":"IF(AN25>5,\" Pas OK. Trop de joueurs (5 points), vérifier la liste de l'équipe.\",IF(AO25>4,\"Pas OK. Trop de joueurs étrangers en jeu (ET), vérifier la liste.\",\"\"))","v":""},null,null,null,null,null,null,null,null,null,{"$f":"IF(X11=\"ET\",1,\"\")","v":""},{"$f":"IF(X12=\"ET\",1,\"\")","v":""},{"$f":"IF(X13=\"ET\",1,\"\")","v":""},{"$f":"IF(X14=\"ET\",1,\"\")","v":""},{"$f":"IF(X15=\"ET\",1,\"\")","v":""},{"$f":"IF(X16=\"ET\",1,\"\")","v":""},{"$f":"SUM(AH30:AM30)","v":0}]
[null,null,null,null,null,null,null,null,null,null,null,null,null,{"$f":"IF(D17=\"ET\",1,\"\")","v":""},{"$f":"IF(D18=\"ET\",1,\"\")","v":""},{"$f":"IF(D19=\"ET\",1,\"\")","v":""},{"$f":"IF(D20=\"ET\",1,\"\")","v":""},{"$f":"IF(D21=\"ET\",1,\"\")","v":""},{"$f":"IF(D22=\"ET\",1,\"\")","v":""},{"$f":"SUM(N31:S31)","v":0},null,null,null,null,null,null,null,null,null,null,null,null,null,{"$f":"IF(X17=\"ET\",1,\"\")","v":""},{"$f":"IF(X18=\"ET\",1,\"\")","v":""},{"$f":"IF(X19=\"ET\",1,\"\")","v":""},{"$f":"IF(X20=\"ET\",1,\"\")","v":""},{"$f":"IF(X21=\"ET\",1,\"\")","v":""},{"$f":"IF(X22=\"ET\",1,\"\")","v":""},{"$f":"SUM(AH31:AM31)","v":0}]

{"sheet":"Nationale_3_poule_C","index":7,"n_rows":31,"n_cols":41,"rows_kept":31,"cut":false,"hidden":false,"merged":[[5,3,5,11],[5,23,5,31],[6,3,6,11],[6,23,6,31],[25,3,25,8],[25,23,25,28],[8,25,8,26],[24,10,25,10],[24,30,25,30],[24,11,25,11],[24,31,25,31],[24,7,24,8],[24,27,24,28],[34,23,40,23],[26,3,26,8],[26,11,27,11],[26,23,26,28],[26,31,27,31],[26,10,27,10],[26,30,27,30],[29,3,30,11],[29,23,30,31],[27,3,27,8],[27,23,27,28]]}
[]
[]
[]
[]
[]
[null,null,null,"Equipe A",null,null,null,null,null,null,null,null,null,null,null,null,null,null,null,null,null,null,null,"Equipe B"]
[null,null,null,"SAINT POL DE LEON",null,null,null,null,null,null,null,null,null,null,null,null,null,null,null,null,null,null,null,"SAINT POL DE LEON"]
[]
[null,null,null,"Carte","Pts","   Noms         /          Prénoms",null,"N°","Valeur","entrée en jeu","Sans Abattement","Bonus",null,"J","JF","F-FET","S-SF",null,"Valide","ET",null,null,null,"Carte","Pts","   Noms         /          Prénoms",null,"N°","Valeur","entrée en jeu","Sans Abattement","Bonus",null,"J","JF","F-FET","S-SF",null,"Valide","ET"]
[null,null,null,null,null,null,null,null,null,null,null,null,null,null,null,null,null,null,null,null,null,null,null,null,2]
[{"$f":"IF('Liste équipes'!G3=\"\",\"\",'Liste équipes'!G3)","v":""},null,null,null,null,null,null,null,{"$f":"IF(AND(D11=\"\",E11=5),5,IF(AND(D11=\"VAL\",E11<5),\"faux\",IF(D11=\"j\",E11,IF(D11=\"jf\",E11,IF(D11=\"f\",E11,IF(D11=\"fet\",E11,IF(D11=\"et\",E11,IF(AND(D11=\"\",E11=\"\"),\"\",E11))))))))","v":""},null,{"$f":"IF(AND(J11=\"X\",E11>0),I11,\"\")","v":""},{"$f":"IF(AND(J11=\"X\",D11=\"J\",E11<5),1.5,IF(AND(J11=\"X\",D11=\"JS\",E11<5),2,IF(AND(J11=\"X\",D11=\"JF\",E11<5),2.5,IF(AND(J11=\"X\",D11=\"JFS\",E11<5),3,IF(AND(J11=\"X\",D11=\"F\",E11<5),1.5,IF(AND(J11=\"X\",D11=\"FET\",E11<5),1.5,IF(AND(J11=\"X\",D11=\"SFET\",E11<5),2,IF(AND(J11=\"X\",D11=\"SF\",E11<5),2,IF(AND(J11=\"X\",D11=\"FV\",E11=5),0.5,IF(AND(J11=\"X\",D11=\"S\",E11<5),0.5,IF(AND(J11=\"X\",D11=\"SET\",E11<5),0.5,IF(AND(J11=\"X\",D11=\"SFID\",E11<5),0.5,\"\"))))))))))))","v":""},null,{"$f":"IF(AND(J11=\"X\",D11=\"J\"),1,\"\")","v":""},{"$f":"IF(AND(J11=\"X\",D11=\"JF\"),1,IF(AND(J11=\"X\",D11=\"SF\"),1,\"\"))","v":""},{"$f":"IF(AND(J11=\"X\",D11=\"F\"),1,IF(AND(J11=\"X\",D11=\"FET\"),1,\"\"))","v":""},{"$f":"IF(AND(J11=\"X\",D11=\"S\"),1,\"\")","v":""},{"$f":"IF(AND(J11=\"X\",E11>0),1,\"\")","v":""},{"$f":"IF(E11=5,1,\"\")","v":""},{"$f":"IF(D11=\"ET\",1,\"\")","v":""},{"$f":"IF(AND(J11=\"X\",D11=\"ET\"),1,\"\")","v":""},null,null,null,null,null,null,null,{"$f":"IF(AND(X11=\"\",Y11=5),5,IF(AND(X11=\"VAL\",Y11<5),\"faux\",IF(X11=\"j\",Y11,IF(X11=\"jf\",Y11,IF(X11=\"f\",Y11,IF(X11=\"fet\",Y11,IF(X11=\"et\",Y11,IF(AND(X11=\"\",Y11=\"\"),\"\",Y11))))))))","v":""},null,{"$f":"IF(AND(AD11=\"X\",Y11>0),AC11,\"\")","v":""},{"$f":"IF(AND(AD11=\"X\",X11=\"J\",Y11<5),1.5,IF(AND(AD11=\"X\",X11=\"JS\",Y11<5),2,IF(AND(AD11=\"X\",X11=\"JF\",Y11<5),2.5,IF(AND(AD11=\"X\",X11=\"JFS\",Y11<5),3,IF(AND(AD11=\"X\",X11=\"F\",Y11<5),1.5,IF(AND(AD11=\"X\",X11=\"FET\",Y11<5),1.5,IF(AND(AD11=\"X\",X11=\"SFET\",Y11<5),2,IF(AND(AD11=\"X\",X11=\"SF\",Y11<5),2,IF(AND(AD11=\"X\",X11=\"FV\",Y11=5),0.5,IF(AND(AD11=\"X\",X11=\"S\",Y11<5),0.5,IF(AND(AD11=\"X\",X11=\"SET\",Y11<5),0.5,IF(AND(AD11=\"X\",X11=\"SFID\",Y11<5),0.5,\"\"))))))))))))","v":""},null,{"$f":"IF(AND(AD11=\"X\",X11=\"J\"),1,\"\")","v":""},{"$f":"IF(AND(AD11=\"X\",X11=\"JF\"),1,IF(AND(AD11=\"X\",X11=\"SF\"),1,\"\"))","v":""},{"$f":"IF(AND(AD11=\"X\",X11=\"F\"),1,IF(AND(AD11=\"X\",X11=\"FET\"),1,\"\"))","v":""},{"$f":"IF(AND(AD11=\"X\",X11=\"S\"),1,\"\")","v":""},{"$f":"IF(AND(AD11=\"X\",Y11>0),1,\"\")","v":""},{"$f":"IF(Y11=5,1,\"\")","v":""},{"$f":"IF(X11=\"ET\",1,\"\")","v":""},{"$f":"IF(AND(AD11=\"X\",X11=\"ET\"),1,\"\")","v":""}]
[{"$f":"IF('Liste équipes'!G4=\"\",\"\",'Liste équipes'!G4)","v":"ANGERS"},null,null,null,null,null,null,null,{"$f":"IF(AND(D12=\"\",E12=5),5,IF(AND(D12=\"VAL\",E12<5),\"faux\",IF(D12=\"j\",E12,IF(D12=\"jf\",E12,IF(D12=\"f\",E12,IF(D12=\"fet\",E12,IF(D12=\"et\",E12,IF(AND(D12=\"\",E12=\"\"),\"\",E12))))))))","v":""},null,{"$f":"IF(AND(J12=\"X\",E12>0),I12,\"\")","v":""},{"$f":"IF(AND(J12=\"X\",D12=\"J\",E12<5),1.5,IF(AND(J12=\"X\",D12=\"JS\",E12<5),2,IF(AND(J12=\"X\",D12=\"JF\",E12<5),2.5,IF(AND(J12=\"X\",D12=\"JFS\",E12<5),3,IF(AND(J12=\"X\",D12=\"F\",E12<5),1.5,IF(AND(J12=\"X\",D12=\"FET\",E12<5),1.5,IF(AND(J12=\"X\",D12=\"SFET\",E12<5),2,IF(AND(J12=\"X\",D12=\"SF\",E12<5),2,IF(AND(J12=\"X\",D12=\"FV\",E12=5),0.5,IF(AND(J12=\"X\",D12=\"S\",E12<5),0.5,IF(AND(J12=\"X\",D12=\"SET\",E12<5),0.5,IF(AND(J12=\"X\",D12=\"SFID\",E12<5),0.5,\"\"))))))))))))","v":""},null,"",{"$f":"IF(AND(J12=\"X\",D12=\"JF\"),1,\"\")","v":""},"","","","","",{"$f":"IF(AND(J12=\"X\",D12=\"ET\"),1,\"\")","v":""},null,null,null,null,null,null,null,{"$f":"IF(AND(X12=\"\",Y12=5),5,IF(AND(X12=\"VAL\",Y12<5),\"faux\",IF(X12=\"j\",Y12,IF(X12=\"jf\",Y12,IF(X12=\"f\",Y12,IF(X12=\"fet\",Y12,IF(X12=\"et\",Y12,IF(AND(X12=\"\",Y12=\"\"),\"\",Y12))))))))","v":""},null,{"$f":"IF(AND(AD12=\"X\",Y12>0),AC12,\"\")","v":""},{"$f":"IF(AND(AD12=\"X\",X12=\"J\",Y12<5),1.5,IF(AND(AD12=\"X\",X12=\"JS\",Y12<5),2,IF(AND(AD12=\"X\",X12=\"JF\",Y12<5),2.5,IF(AND(AD12=\"X\",X12=\"JFS\",Y12<5),3,IF(AND(AD12=\"X\",X12=\"F\",Y12<5),1.5,IF(AND(AD12=\"X\",X12=\"FET\",Y12<5),1.5,IF(AND(AD12=\"X\",X12=\"SFET\",Y12<5),2,IF(AND(AD12=\"X\",X12=\"SF\",Y12<5),2,IF(AND(AD12=\"X\",X12=\"FV\",Y12=5),0.5,IF(AND(AD12=\"X\",X12=\"S\",Y12<5),0.5,IF(AND(AD12=\"X\",X12=\"SET\",Y12<5),0.5,IF(AND(AD12=\"X\",X12=\"SFID\",Y12<5),0.5,\"\"))))))))))))","v":""},null,"",{"$f":"IF(AND(AD12=\"X\",X12=\"JF\"),1,\"\")","v":""},"","","","","",{"$f":"IF(AND(AD12=\"X\",X12=\"ET\"),1,\"\")","v":""}]
[{"$f":"IF('Liste équipes'!G5=\"\",\"\",'Liste équipes'!G5)","v":"CHAMBRAY"},null,null,null,null,null,null,null,{"$f":"IF(AND(D13=\"\",E13=5),5,IF(AND(D13=\"VAL\",E13<5),\"faux\",IF(D13=\"j\",E13,IF(D13=\"jf\",E13,IF(D13=\"f\",E13,IF(D13=\"fet\",E13,IF(D13=\"et\",E13,IF(AND(D13=\"\",E13=\"\"),\"\",E13))))))))","v":""},null,"",{"$f":"IF(AND(J13=\"X\",D13=\"J\",E13<5),1.5,IF(AND(J13=\"X\",D13=\"JS\",E13<5),2,IF(AND(J13=\"X\",D13=\"JF\",E13<5),2.5,IF(AND(J13=\"X\",D13=\"JFS\",E13<5),3,IF(AND(J13=\"X\",D13=\"F\",E13<5),1.5,IF(AND(J13=\"X\",D13=\"FET\",E13<5),1.5,IF(AND(J13=\"X\",D13=\"SFET\",E13<5),2,IF(AND(J13=\"X\",D13=\"SF\",E13<5),2,IF(AND(J13=\"X\",D13=\"FV\",E13=5),0.5,IF(AND(J13=\"X\",D13=\"S\",E13<5),0.5,IF(AND(J13=\"X\",D13=\"SET\",E13<5),0.5,IF(AND(J13=\"X\",D13=\"SFID\",E13<5),0.5,\"\"))))))))))))","v":""},null,"","","","","","","","",null,null,null,null,null,null,null,"",null,{"$f":"IF(AND(AD13=\"X\",Y13>0),AC13,\"\")","v":""},"",null,"","","","","","","",""]
[{"$f":"IF('Liste équipes'!G6=\"\",\"\",'Liste équipes'!G6)","v":"Ent LAVAL RENNES"},null,null,null,null,null,null,null,"",null,"","",null,"","","","","","","","",null,null,null,null,null,null,null,"",null,"","",null,"","","","","","","",""]
[{"$f":"IF('Liste équipes'!G7=\"\",\"\",'Liste équipes'!G7)","v":"EQUEURDREVILLE"},null,null,null,null,null,null,null,"",null,"","",null,"","","","","","","","",null,null,null,null,null,null,null,"",null,"","",null,"","","","","","","",""]
[{"$f":"IF('Liste équipes'!G8=\"\",\"\",'Liste équipes'!G8)","v":"LANNION 2"},null,null,null,null,null,null,null,"",null,"","",null,"","","","","","","","",null,null,null,null,null,null,null,"",null,"","",null,"","","","","","","",""]
[{"$f":"IF('Liste équipes'!G9=\"\",\"\",'Liste équipes'!G9)","v":"NIORT"},null,null,null,null,null,null,null,"",null,"","",null,"","","","","","","","",null,null,null,null,null,null,null,"",null,"","",null,"","","","","","","",""]
[{"$f":"IF('Liste équipes'!G10=\"\",\"\",'Liste équipes'!G10)","v":"QUIMPER"},null,null,null,null,null,null,null,"",null,"","",null,"","","","","","","","",null,null,null,null,null,null,null,"",null,"","",null,"","","","","","","",""]
[{"$f":"IF('Liste équipes'!G11=\"\",\"\",'Liste équipes'!G11)","v":"SAINT POL DE LEON"},null,null,null,null,null,null,null,"",null,"","",null,"","","","","","","","",null,null,null,null,null,null,null,"",null,"","",null,"","","","","","","",""]
[{"$f":"IF('Liste équipes'!G12=\"\",\"\",'Liste équipes'!G12)","v":""},null,null,null,null,null,null,null,"",null,"","",null,"","","","","","","","",null,null,null,null,null,null,null,"",null,"","",null,"","","","","","","",""]
[{"$f":"IF('Liste équipes'!G13=\"\",\"\",'Liste équipes'!G13)","v":""},null,null,null,null,null,null,null,"",null,"","",null,"","","","","","","","",null,null,null,null,null,null,null,"",null,"","",null,"","","","","","","",""]
[{"$f":"IF('Liste équipes'!G14=\"\",\"\",'Liste équipes'!G14)","v":""},null,null,null,null,null,null,null,"",null,"","",null,"","","","","","","","",null,null,null,null,null,null,null,"",null,"","",null,"","","","","","","",""]
[{"$f":"IF('Liste équipes'!G15=\"\",\"\",'Liste équipes'!G15)","v":""},null,null,null,null,null,null,null,null,null,null,null,null,{"$f":"IF(AND(J23=\"X\",D23=\"J\"),1,\"\")","v":""},{"$f":"IF(AND(J23=\"X\",D23=\"JF\"),1,\"\")","v":""},{"$f":"IF(AND(J23=\"X\",D23=\"F\"),1,IF(AND(J23=\"X\",D23=\"FET\"),1,\"\"))","v":""},{"$f":"IF(AND(J23=\"X\",D23=\"S\"),1,\"\")","v":""},{"$f":"IF(AND(J23=\"X\",E23>0),1,\"\")","v":""},{"$f":"IF(E23=5,1,\"\")","v":""},{"$f":"IF(D23=\"ET\",1,\"\")","v":""},"",null,null,null,null,null,null,null,null,null,null,null,null,"","","","","","","",""]
[null,null,null,null,null,null,null,null,null,null,null,null,null,{"$f":"IF(AND(J24=\"X\",D24=\"J\"),1,\"\")","v":""},{"$f":"IF(AND(J24=\"X\",D24=\"JF\"),1,\"\")","v":""},{"$f":"IF(AND(J24=\"X\",D24=\"F\"),1,IF(AND(J24=\"X\",D24=\"FET\"),1,\"\"))","v":""},{"$f":"IF(AND(J24=\"X\",D24=\"S\"),1,\"\")","v":""},{"$f":"IF(AND(J24=\"X\",E24>0),1,\"\")","v":""},{"$f":"IF(E24=5,1,\"\")","v":""},{"$f":"IF(D24=\"ET\",1,\"\")","v":""},"",null,null,null,null,null,null,null,null,null,null,null,null,"","","","","","","",""]
[null,null,null,"  Nombre joueurs sur le terrain",null,null,{"$f":"IF(J25>5,\"\",\"OK\")","v":""},{"$f":"IF(R25>5,\"PAS OK\",\"\")","v":""},null,{"$f":"IF(L27=\"\",\"\",R25)","v":""},"Points en jeu","Points autorisés maxi 19",null,{"$f":"SUM(N11:N24)","v":0},0,0,0,0,0,0,0,null,null,"  Nombre joueurs sur le terrain",null,null,{"$f":"IF(AD25>5,\"\",\"OK\")","v":""},{"$f":"IF(AL25>5,\"PAS OK\",\"\")","v":""},null,{"$f":"IF(AF27=\"\",\"\",AL25)","v":""},"Points en jeu","Points autorisés maxi 19",null,{"$f":"SUM(AH11:AH24)","v":0},0,0,0,0,0,0,0]
[null,null,null,null,null,null,null,null,null,null,null,null,null,{"$f":"IF(N25=0,\"\",IF(N25=1,17,IF(N25=2,18.5,IF(N25=3,19,IF(N25>3,19,IF(N25>4,19,IF(N25>5,19,\"\")))))))","v":""},{"$f":"IF(O25=0,\"\",IF(O25=1,18,IF(O25=2,19,IF(O25=3,19,IF(O25=4,19,IF(O25=4,19,\"\"))))))","v":""},{"$f":"IF(P25=0,\"\",IF(P25=1,17,IF(P25=2,18.5,IF(P25=3,19,IF(P25=4,19,IF(P25=5,17.5,\"\"))))))","v":""},{"$f":"IF(Q25=0,\"\",IF(Q25=1,16,IF(Q25=2,16.5,IF(Q25=3,17,IF(Q25=4,17.5,IF(Q25=5,18,IF(Q25=6,18.5,IF(Q25=7,19,IF(Q25=8,19,IF(Q25=9,19,IF(Q25=10,19,IF(Q25=11,19,IF(Q25=12,19,\"\")))))))))))))","v":""},{"$f":"IF(AND(O26=16.5,P26=16),17.5,IF(AND(N26=15.5,P26=16),17,IF(AND(N26=15.5,O26=16.5),17.5,IF(AND(N26=16.5,P26=16),17.5,IF(AND(N25=2,O26=16.5),17.5,\"\")))))","v":""},null,null,null,null,null,null,null,null,null,null,null,null,null,null,null,{"$f":"IF(AH25=0,\"\",IF(AH25=1,17,IF(AH25=2,18.5,IF(AH25=3,19,IF(AH25>3,19,IF(AH25>4,19,IF(AH25>5,19,\"\")))))))","v":""},{"$f":"IF(AI25=0,\"\",IF(AI25=1,18,IF(AI25=2,19,IF(AI25=3,19,IF(AI25=4,19,IF(AI25=4,19,\"\"))))))","v":""},{"$f":"IF(AJ25=0,\"\",IF(AJ25=1,17,IF(AJ25=2,18.5,IF(AJ25=3,19,IF(AJ25=4,19,IF(AJ25=5,17.5,\"\"))))))","v":""},{"$f":"IF(AK25=0,\"\",IF(AK25=1,16,IF(AK25=2,16.5,IF(AK25=3,17,IF(AK25=4,17.5,IF(AK25=5,18,IF(AK25=6,18.5,IF(AK25=7,19,IF(AK25=8,19,IF(AK25=9,19,IF(AK25=10,19,IF(AK25=11,19,IF(AK25=12,19,\"\")))))))))))))","v":""},{"$f":"IF(AND(AI26=16.5,AJ26=16),17.5,IF(AND(AH26=15.5,AJ26=16),17,IF(AND(AH26=15.5,AI26=16.5),17.5,IF(AND(AH26=16.5,AJ26=16),17.5,IF(AND(AH25=2,AI26=16.5),17.5,\"\")))))","v":""}]
[null,null," ",{"$f":"IF(K27>L27,\"Trop de points en jeu\",\"\")","v":""},null,null,null,null,null,null,{"$f":"IF(O28>0,O28,\"\")","v":""},{"$f":"IF(O28=0,\"\",Q28)","v":""},null,{"$f":"SUM(N26)","v":0},{"$f":"SUM(O26)","v":0},{"$f":"SUM(P26)","v":0},{"$f":"SUM(Q26)","v":0},{"$f":"SUM(R26)","v":0},null,null,null,null," ",{"$f":"IF(AE27>AF27,\"Trop de points en jeu\",\"\")","v":""},null,null,null,null,null,null,{"$f":"IF(AI28>0,AI28,\"\")","v":""},{"$f":"IF(AI28=0,\"\",AK28)","v":""},null,{"$f":"SUM(AH26)","v":0},{"$f":"SUM(AI26)","v":0},{"$f":"SUM(AJ26)","v":0},{"$f":"SUM(AK26)","v":0},{"$f":"SUM(AL26)","v":0}]
[null,null,null,{"$f":"IF(S25>2,\"Trop de joueurs  valides inscrits sur la feuille\",\"\")","v":""},null,null,null,null,null,null,null,null,null,{"$f":"SUM(L11:L24)","v":0},{"$f":"SUM(K11:K24)","v":0},{"$f":"SUM(N28+15.5)","v":15.5},{"$f":"IF(P28>19,19,P28)","v":15.5},null,null,{"$f":"SUM(T30:T31)","v":0},null,null,null,{"$f":"IF(AM25>2,\"Trop de joueurs  valides inscrits sur la feuille\",\"\")","v":""},null,null,null,null,null,null,null,null,null,{"$f":"SUM(AF11:AF24)","v":0},{"$f":"SUM(AE11:AE24)","v":0},{"$f":"SUM(AH28+15.5)","v":15.5},{"$f":"IF(AJ28>19,19,AJ28)","v":15.5},null,null,{"$f":"SUM(AN30:AN31)","v":0}]
[]
[null,null,null,{"$f":"IF(T25>5,\" Pas OK. Trop de joueurs (5 points), vérifier la liste de l'équipe.\",IF(U25>4,\"Pas OK. Trop de joueurs étrangers en jeu (ET), vérifier la liste.\",\"\"))","v":""},null,null,null,null,null,null,null,null,null,{"$f":"IF(D11=\"ET\",1,\"\")","v":""},{"$f":"IF(D12=\"ET\",1,\"\")","v":""},{"$f":"IF(D13=\"ET\",1,\"\")","v":""},{"$f":"IF(D14=\"ET\",1,\"\")","v":""},{"$f":"IF(D15=\"ET\",1,\"\")","v":""},{"$f":"IF(D16=\"ET\",1,\"\")","v":""},{"$f":"SUM(N30:S30)","v":0},null,null,null,{"$f":"IF(AN25>5,\" Pas OK. Trop de joueurs (5 points), vérifier la liste de l'équipe.\",IF(AO25>4,\"Pas OK. Trop de joueurs étrangers en jeu (ET), vérifier la liste.\",\"\"))","v":""},null,null,null,null,null,null,null,null,null,{"$f":"IF(X11=\"ET\",1,\"\")","v":""},{"$f":"IF(X12=\"ET\",1,\"\")","v":""},{"$f":"IF(X13=\"ET\",1,\"\")","v":""},{"$f":"IF(X14=\"ET\",1,\"\")","v":""},{"$f":"IF(X15=\"ET\",1,\"\")","v":""},{"$f":"IF(X16=\"ET\",1,\"\")","v":""},{"$f":"SUM(AH30:AM30)","v":0}]
[null,null,null,null,null,null,null,null,null,null,null,null,null,{"$f":"IF(D17=\"ET\",1,\"\")","v":""},{"$f":"IF(D18=\"ET\",1,\"\")","v":""},{"$f":"IF(D19=\"ET\",1,\"\")","v":""},{"$f":"IF(D20=\"ET\",1,\"\")","v":""},{"$f":"IF(D21=\"ET\",1,\"\")","v":""},{"$f":"IF(D22=\"ET\",1,\"\")","v":""},{"$f":"SUM(N31:S31)","v":0},null,null,null,null,null,null,null,null,null,null,null,null,null,{"$f":"IF(X17=\"ET\",1,\"\")","v":""},{"$f":"IF(X18=\"ET\",1,\"\")","v":""},{"$f":"IF(X19=\"ET\",1,\"\")","v":""},{"$f":"IF(X20=\"ET\",1,\"\")","v":""},{"$f":"IF(X21=\"ET\",1,\"\")","v":""},{"$f":"IF(X22=\"ET\",1,\"\")","v":""},{"$f":"SUM(AH31:AM31)","v":0}]

{"sheet":"Nationale_3_poule_D","index":8,"n_rows":31,"n_cols":41,"rows_kept":31,"cut":false,"hidden":false,"merged":[[5,3,5,11],[5,23,5,31],[6,3,6,11],[6,23,6,31],[25,3,25,8],[25,23,25,28],[8,25,8,26],[24,10,25,10],[24,30,25,30],[24,7,24,8],[24,11,25,11],[24,27,24,28],[24,31,25,31],[34,23,40,23],[26,3,26,8],[26,11,27,11],[26,23,26,28],[26,31,27,31],[26,10,27,10],[26,30,27,30],[29,3,30,11],[29,23,30,31],[27,3,27,8],[27,23,27,28]]}
[]
[]
[]
[]
[]
[null,null,null,"Equipe A",null,null,null,null,null,null,null,null,null,null,null,null,null,null,null,null,null,null,null,"Equipe B"]
[null,null,null,"TOULOUSE 2",null,null,null,null,null,null,null,null,null,null,null,null,null,null,null,null,null,null,null,"TOULOUSE 2"]
[]
[null,null,null,"Carte","Pts","   Noms         /          Prénoms",null,"N°","Valeur","entrée en jeu","Sans Abattement","Bonus",null,"J","JF","F-FET","S-SF",null,"Valide","ET",null,null,null,"Carte","Pts","   Noms         /          Prénoms",null,"N°","Valeur","entrée en jeu","Sans Abattement","Bonus",null,"J","JF","F-FET","S-SF",null,"Valide","ET"]
[]
[{"$f":"IF('Liste équipes'!H3=\"\",\"\",'Liste équipes'!H3)","v":""},null,null,null,null,null,null,null,{"$f":"IF(AND(D11=\"\",E11=5),5,IF(AND(D11=\"VAL\",E11<5),\"faux\",IF(D11=\"j\",E11,IF(D11=\"jf\",E11,IF(D11=\"f\",E11,IF(D11=\"fet\",E11,IF(D11=\"et\",E11,IF(AND(D11=\"\",E11=\"\"),\"\",E11))))))))","v":""},null,{"$f":"IF(AND(J11=\"X\",E11>0),I11,\"\")","v":""},{"$f":"IF(AND(J11=\"X\",D11=\"J\",E11<5),1.5,IF(AND(J11=\"X\",D11=\"JS\",E11<5),2,IF(AND(J11=\"X\",D11=\"JF\",E11<5),2.5,IF(AND(J11=\"X\",D11=\"JFS\",E11<5),3,IF(AND(J11=\"X\",D11=\"F\",E11<5),1.5,IF(AND(J11=\"X\",D11=\"FET\",E11<5),1.5,IF(AND(J11=\"X\",D11=\"SFET\",E11<5),2,IF(AND(J11=\"X\",D11=\"SF\",E11<5),2,IF(AND(J11=\"X\",D11=\"FV\",E11=5),0.5,IF(AND(J11=\"X\",D11=\"S\",E11<5),0.5,IF(AND(J11=\"X\",D11=\"SET\",E11<5),0.5,IF(AND(J11=\"X\",D11=\"SFID\",E11<5),0.5,\"\"))))))))))))","v":""},null,{"$f":"IF(AND(J11=\"X\",D11=\"J\"),1,\"\")","v":""},{"$f":"IF(AND(J11=\"X\",D11=\"JF\"),1,IF(AND(J11=\"X\",D11=\"SF\"),1,\"\"))","v":""},{"$f":"IF(AND(J11=\"X\",D11=\"F\"),1,IF(AND(J11=\"X\",D11=\"FET\"),1,\"\"))","v":""},{"$f":"IF(AND(J11=\"X\",D11=\"S\"),1,\"\")","v":""},{"$f":"IF(AND(J11=\"X\",E11>0),1,\"\")","v":""},{"$f":"IF(E11=5,1,\"\")","v":""},{"$f":"IF(D11=\"ET\",1,\"\")","v":""},{"$f":"IF(AND(J11=\"X\",D11=\"ET\"),1,\"\")","v":""},null,null,null,null,null,null,null,{"$f":"IF(AND(X11=\"\",Y11=5),5,IF(AND(X11=\"VAL\",Y11<5),\"faux\",IF(X11=\"j\",Y11,IF(X11=\"jf\",Y11,IF(X11=\"f\",Y11,IF(X11=\"fet\",Y11,IF(X11=\"et\",Y11,IF(AND(X11=\"\",Y11=\"\"),\"\",Y11))))))))","v":""},null,{"$f":"IF(AND(AD11=\"X\",Y11>0),AC11,\"\")","v":""},{"$f":"IF(AND(AD11=\"X\",X11=\"J\",Y11<5),1.5,IF(AND(AD11=\"X\",X11=\"JS\",Y11<5),2,IF(AND(AD11=\"X\",X11=\"JF\",Y11<5),2.5,IF(AND(AD11=\"X\",X11=\"JFS\",Y11<5),3,IF(AND(AD11=\"X\",X11=\"F\",Y11<5),1.5,IF(AND(AD11=\"X\",X11=\"FET\",Y11<5),1.5,IF(AND(AD11=\"X\",X11=\"SFET\",Y11<5),2,IF(AND(AD11=\"X\",X11=\"SF\",Y11<5),2,IF(AND(AD11=\"X\",X11=\"FV\",Y11=5),0.5,IF(AND(AD11=\"X\",X11=\"S\",Y11<5),0.5,IF(AND(AD11=\"X\",X11=\"SET\",Y11<5),0.5,IF(AND(AD11=\"X\",X11=\"SFID\",Y11<5),0.5,\"\"))))))))))))","v":""},null,{"$f":"IF(AND(AD11=\"X\",X11=\"J\"),1,\"\")","v":""},{"$f":"IF(AND(AD11=\"X\",X11=\"JF\"),1,IF(AND(AD11=\"X\",X11=\"SF\"),1,\"\"))","v":""},{"$f":"IF(AND(AD11=\"X\",X11=\"F\"),1,IF(AND(AD11=\"X\",X11=\"FET\"),1,\"\"))","v":""},{"$f":"IF(AND(AD11=\"X\",X11=\"S\"),1,\"\")","v":""},{"$f":"IF(AND(AD11=\"X\",Y11>0),1,\"\")","v":""},{"$f":"IF(Y11=5,1,\"\")","v":""},{"$f":"IF(X11=\"ET\",1,\"\")","v":""},{"$f":"IF(AND(AD11=\"X\",X11=\"ET\"),1,\"\")","v":""}]
[{"$f":"IF('Liste équipes'!H4=\"\",\"\",'Liste équipes'!H4)","v":"PAYS BASQUE EUSKADI"},null,null,null,null,null,null,null,{"$f":"IF(AND(D12=\"\",E12=5),5,IF(AND(D12=\"VAL\",E12<5),\"faux\",IF(D12=\"j\",E12,IF(D12=\"jf\",E12,IF(D12=\"f\",E12,IF(D12=\"fet\",E12,IF(D12=\"et\",E12,IF(AND(D12=\"\",E12=\"\"),\"\",E12))))))))","v":""},null,{"$f":"IF(AND(J12=\"X\",E12>0),I12,\"\")","v":""},{"$f":"IF(AND(J12=\"X\",D12=\"J\",E12<5),1.5,IF(AND(J12=\"X\",D12=\"JS\",E12<5),2,IF(AND(J12=\"X\",D12=\"JF\",E12<5),2.5,IF(AND(J12=\"X\",D12=\"JFS\",E12<5),3,IF(AND(J12=\"X\",D12=\"F\",E12<5),1.5,IF(AND(J12=\"X\",D12=\"FET\",E12<5),1.5,IF(AND(J12=\"X\",D12=\"SFET\",E12<5),2,IF(AND(J12=\"X\",D12=\"SF\",E12<5),2,IF(AND(J12=\"X\",D12=\"FV\",E12=5),0.5,IF(AND(J12=\"X\",D12=\"S\",E12<5),0.5,IF(AND(J12=\"X\",D12=\"SET\",E12<5),0.5,IF(AND(J12=\"X\",D12=\"SFID\",E12<5),0.5,\"\"))))))))))))","v":""},null,"",{"$f":"IF(AND(J12=\"X\",D12=\"JF\"),1,\"\")","v":""},"","","","","",{"$f":"IF(AND(J12=\"X\",D12=\"ET\"),1,\"\")","v":""},null,null,null,null,null,null,null,{"$f":"IF(AND(X12=\"\",Y12=5),5,IF(AND(X12=\"VAL\",Y12<5),\"faux\",IF(X12=\"j\",Y12,IF(X12=\"jf\",Y12,IF(X12=\"f\",Y12,IF(X12=\"fet\",Y12,IF(X12=\"et\",Y12,IF(AND(X12=\"\",Y12=\"\"),\"\",Y12))))))))","v":""},null,{"$f":"IF(AND(AD12=\"X\",Y12>0),AC12,\"\")","v":""},{"$f":"IF(AND(AD12=\"X\",X12=\"J\",Y12<5),1.5,IF(AND(AD12=\"X\",X12=\"JS\",Y12<5),2,IF(AND(AD12=\"X\",X12=\"JF\",Y12<5),2.5,IF(AND(AD12=\"X\",X12=\"JFS\",Y12<5),3,IF(AND(AD12=\"X\",X12=\"F\",Y12<5),1.5,IF(AND(AD12=\"X\",X12=\"FET\",Y12<5),1.5,IF(AND(AD12=\"X\",X12=\"SFET\",Y12<5),2,IF(AND(AD12=\"X\",X12=\"SF\",Y12<5),2,IF(AND(AD12=\"X\",X12=\"FV\",Y12=5),0.5,IF(AND(AD12=\"X\",X12=\"S\",Y12<5),0.5,IF(AND(AD12=\"X\",X12=\"SET\",Y12<5),0.5,IF(AND(AD12=\"X\",X12=\"SFID\",Y12<5),0.5,\"\"))))))))))))","v":""},null,"",{"$f":"IF(AND(AD12=\"X\",X12=\"JF\"),1,\"\")","v":""},"","","","","",{"$f":"IF(AND(AD12=\"X\",X12=\"ET\"),1,\"\")","v":""}]
[{"$f":"IF('Liste équipes'!H5=\"\",\"\",'Liste équipes'!H5)","v":"ASMTH"},null,null,null,null,null,null,null,{"$f":"IF(AND(D13=\"\",E13=5),5,IF(AND(D13=\"VAL\",E13<5),\"faux\",IF(D13=\"j\",E13,IF(D13=\"jf\",E13,IF(D13=\"f\",E13,IF(D13=\"fet\",E13,IF(D13=\"et\",E13,IF(AND(D13=\"\",E13=\"\"),\"\",E13))))))))","v":""},null,"",{"$f":"IF(AND(J13=\"X\",D13=\"J\",E13<5),1.5,IF(AND(J13=\"X\",D13=\"JS\",E13<5),2,IF(AND(J13=\"X\",D13=\"JF\",E13<5),2.5,IF(AND(J13=\"X\",D13=\"JFS\",E13<5),3,IF(AND(J13=\"X\",D13=\"F\",E13<5),1.5,IF(AND(J13=\"X\",D13=\"FET\",E13<5),1.5,IF(AND(J13=\"X\",D13=\"SFET\",E13<5),2,IF(AND(J13=\"X\",D13=\"SF\",E13<5),2,IF(AND(J13=\"X\",D13=\"FV\",E13=5),0.5,IF(AND(J13=\"X\",D13=\"S\",E13<5),0.5,IF(AND(J13=\"X\",D13=\"SET\",E13<5),0.5,IF(AND(J13=\"X\",D13=\"SFID\",E13<5),0.5,\"\"))))))))))))","v":""},null,"","","","","","","","",null,null,null,null,null,null,null,"",null,{"$f":"IF(AND(AD13=\"X\",Y13>0),AC13,\"\")","v":""},"",null,"","","","","","","",""]
[{"$f":"IF('Liste équipes'!H6=\"\",\"\",'Liste équipes'!H6)","v":"ENT BORDEAUX BLANQUEFORT 2"},null,null,null,null,null,null,null,"",null,"","",null,"","","","","","","","",null,null,null,null,null,null,null,"",null,"","",null,"","","","","","","",""]
[{"$f":"IF('Liste équipes'!H7=\"\",\"\",'Liste équipes'!H7)","v":"ENT CAUSSADE PAVIE 2"},null,null,null,null,null,null,null,"",null,"","",null,"","","","","","","","",null,null,null,null,null,null,null,"",null,"","",null,"","","","","","","",""]
[{"$f":"IF('Liste équipes'!H8=\"\",\"\",'Liste équipes'!H8)","v":"LA ROCHELLE"},null,null,null,null,null,null,null,"",null,"","",null,"","","","","","","","",null,null,null,null,null,null,null,"",null,"","",null,"","","","","","","",""]
[{"$f":"IF('Liste équipes'!H9=\"\",\"\",'Liste équipes'!H9)","v":"MONTPELLIER"},null,null,null,null,null,null,null,"",null,"","",null,"","","","","","","","",null,null,null,null,null,null,null,"",null,"","",null,"","","","","","","",""]
[{"$f":"IF('Liste équipes'!H10=\"\",\"\",'Liste équipes'!H10)","v":"TOULOUSE 2"},null,null,null,null,null,null,null,"",null,"","",null,"","","","","","","","",null,null,null,null,null,null,null,"",null,"","",null,"","","","","","","",""]
[{"$f":"IF('Liste équipes'!H11=\"\",\"\",'Liste équipes'!H11)","v":""},null,null,null,null,null,null,null,"",null,"","",null,"","","","","","","","",null,null,null,null,null,null,null,"",null,"","",null,"","","","","","","",""]
[{"$f":"IF('Liste équipes'!H12=\"\",\"\",'Liste équipes'!H12)","v":""},null,null,null,null,null,null,null,"",null,"","",null,"","","","","","","","",null,null,null,null,null,null,null,"",null,"","",null,"","","","","","","",""]
[{"$f":"IF('Liste équipes'!H13=\"\",\"\",'Liste équipes'!H13)","v":""},null,null,null,null,null,null,null,"",null,"","",null,"","","","","","","","",null,null,null,null,null,null,null,"",null,"","",null,"","","","","","","",""]
[{"$f":"IF('Liste équipes'!H14=\"\",\"\",'Liste équipes'!H14)","v":""},null,null,null,null,null,null,null,{"$f":"IF(AND(D22=\"\",E22=5),5,IF(AND(D22=\"VAL\",E22<5),\"faux\",IF(D22=\"j\",E22,IF(D22=\"jf\",E22,IF(D22=\"f\",E22,IF(D22=\"fet\",E22,IF(D22=\"et\",E22,IF(AND(D22=\"\",E22=\"\"),\"\",E22))))))))","v":""},null,"","",null,"","","","","","","","",null,null,null,null,null,null,null,{"$f":"IF(AND(X22=\"\",Y22=5),5,IF(AND(X22=\"VAL\",Y22<5),\"faux\",IF(X22=\"j\",Y22,IF(X22=\"jf\",Y22,IF(X22=\"f\",Y22,IF(X22=\"fet\",Y22,IF(X22=\"et\",Y22,IF(AND(X22=\"\",Y22=\"\"),\"\",Y22))))))))","v":""},null,"","",null,"","","","","","","",""]
[{"$f":"IF('Liste équipes'!H15=\"\",\"\",'Liste équipes'!H15)","v":""},null,null,null,null,null,null,null,null,null,null,null,null,"","","","","","","","",null,null,null,null,null,null,null,null,null,null,null,null,"","","","","","","",""]
[null,null,null,null,null,null,null,null,null,null,null,null,null,"","","","","","","","",null,null,null,null,null,null,null,null,null,null,null,null,"","","","","","","",""]
[null,null,null,"  Nombre joueurs sur le terrain",null,null,{"$f":"IF(J25>5,\"\",\"OK\")","v":""},{"$f":"IF(R25>5,\"PAS OK\",\"\")","v":""},null,{"$f":"IF(L27=\"\",\"\",R25)","v":""},"Points en jeu","Points autorisés maxi 19",null,{"$f":"SUM(N11:N24)","v":0},0,0,0,0,0,0,0,null,null,"  Nombre joueurs sur le terrain",null,null,{"$f":"IF(AD25>5,\"\",\"OK\")","v":""},{"$f":"IF(AL25>5,\"PAS OK\",\"\")","v":""},null,{"$f":"IF(AF27=\"\",\"\",AL25)","v":""},"Points en jeu","Points autorisés maxi 19",null,{"$f":"SUM(AH11:AH24)","v":0},0,0,0,0,0,0,0]
[null,null,null,null,null,null,null,null,null,null,null,null,null,{"$f":"IF(N25=0,\"\",IF(N25=1,17,IF(N25=2,18.5,IF(N25=3,19,IF(N25>3,19,IF(N25>4,19,IF(N25>5,19,\"\")))))))","v":""},{"$f":"IF(O25=0,\"\",IF(O25=1,18,IF(O25=2,19,IF(O25=3,19,IF(O25=4,19,IF(O25=4,19,\"\"))))))","v":""},{"$f":"IF(P25=0,\"\",IF(P25=1,17,IF(P25=2,18.5,IF(P25=3,19,IF(P25=4,19,IF(P25=5,17.5,\"\"))))))","v":""},{"$f":"IF(Q25=0,\"\",IF(Q25=1,16,IF(Q25=2,16.5,IF(Q25=3,17,IF(Q25=4,17.5,IF(Q25=5,18,IF(Q25=6,18.5,IF(Q25=7,19,IF(Q25=8,19,IF(Q25=9,19,IF(Q25=10,19,IF(Q25=11,19,IF(Q25=12,19,\"\")))))))))))))","v":""},{"$f":"IF(AND(O26=16.5,P26=16),17.5,IF(AND(N26=15.5,P26=16),17,IF(AND(N26=15.5,O26=16.5),17.5,IF(AND(N26=16.5,P26=16),17.5,IF(AND(N25=2,O26=16.5),17.5,\"\")))))","v":""},null,null,null,null,null,null,null,null,null,null,null,null,null,null,null,{"$f":"IF(AH25=0,\"\",IF(AH25=1,17,IF(AH25=2,18.5,IF(AH25=3,19,IF(AH25>3,19,IF(AH25>4,19,IF(AH25>5,19,\"\")))))))","v":""},{"$f":"IF(AI25=0,\"\",IF(AI25=1,18,IF(AI25=2,19,IF(AI25=3,19,IF(AI25=4,19,IF(AI25=4,19,\"\"))))))","v":""},{"$f":"IF(AJ25=0,\"\",IF(AJ25=1,17,IF(AJ25=2,18.5,IF(AJ25=3,19,IF(AJ25=4,19,IF(AJ25=5,17.5,\"\"))))))","v":""},{"$f":"IF(AK25=0,\"\",IF(AK25=1,16,IF(AK25=2,16.5,IF(AK25=3,17,IF(AK25=4,17.5,IF(AK25=5,18,IF(AK25=6,18.5,IF(AK25=7,19,IF(AK25=8,19,IF(AK25=9,19,IF(AK25=10,19,IF(AK25=11,19,IF(AK25=12,19,\"\")))))))))))))","v":""},{"$f":"IF(AND(AI26=16.5,AJ26=16),17.5,IF(AND(AH26=15.5,AJ26=16),17,IF(AND(AH26=15.5,AI26=16.5),17.5,IF(AND(AH26=16.5,AJ26=16),17.5,IF(AND(AH25=2,AI26=16.5),17.5,\"\")))))","v":""}]
[null,null," ",{"$f":"IF(K27>L27,\"Trop de points en jeu\",\"\")","v":""},null,null,null,null,null,null,{"$f":"IF(O28>0,O28,\"\")","v":""},{"$f":"IF(O28=0,\"\",Q28)","v":""},null,{"$f":"SUM(N26)","v":0},{"$f":"SUM(O26)","v":0},{"$f":"SUM(P26)","v":0},{"$f":"SUM(Q26)","v":0},{"$f":"SUM(R26)","v":0},null,null,null,null," ",{"$f":"IF(AE27>AF27,\"Trop de points en jeu\",\"\")","v":""},null,null,null,null,null,null,{"$f":"IF(AI28>0,AI28,\"\")","v":""},{"$f":"IF(AI28=0,\"\",AK28)","v":""},null,{"$f":"SUM(AH26)","v":0},{"$f":"SUM(AI26)","v":0},{"$f":"SUM(AJ26)","v":0},{"$f":"SUM(AK26)","v":0},{"$f":"SUM(AL26)","v":0}]
[null,null,null,{"$f":"IF(S25>2,\"Trop de joueurs  valides inscrits sur la feuille\",\"\")","v":""},null,null,null,null,null,null,null,null,null,{"$f":"SUM(L11:L24)","v":0},{"$f":"SUM(K11:K24)","v":0},{"$f":"SUM(N28+15.5)","v":15.5},{"$f":"IF(P28>19,19,P28)","v":15.5},null,null,{"$f":"SUM(T30:T31)","v":0},null,null,null,{"$f":"IF(AM25>2,\"Trop de joueurs  valides inscrits sur la feuille\",\"\")","v":""},null,null,null,null,null,null,null,null,null,{"$f":"SUM(AF11:AF24)","v":0},{"$f":"SUM(AE11:AE24)","v":0},{"$f":"SUM(AH28+15.5)","v":15.5},{"$f":"IF(AJ28>19,19,AJ28)","v":15.5},null,null,{"$f":"SUM(AN30:AN31)","v":0}]
[]
[null,null,null,{"$f":"IF(T25>5,\" Pas OK. Trop de joueurs (5 points), vérifier la liste de l'équipe.\",IF(U25>4,\"Pas OK. Trop de joueurs étrangers en jeu (ET), vérifier la liste.\",\"\"))","v":""},null,null,null,null,null,null,null,null,null,{"$f":"IF(D11=\"ET\",1,\"\")","v":""},{"$f":"IF(D12=\"ET\",1,\"\")","v":""},{"$f":"IF(D13=\"ET\",1,\"\")","v":""},{"$f":"IF(D14=\"ET\",1,\"\")","v":""},{"$f":"IF(D15=\"ET\",1,\"\")","v":""},{"$f":"IF(D16=\"ET\",1,\"\")","v":""},{"$f":"SUM(N30:S30)","v":0},null,null,null,{"$f":"IF(AN25>5,\" Pas OK. Trop de joueurs (5 points), vérifier la liste de l'équipe.\",IF(AO25>4,\"Pas OK. Trop de joueurs étrangers en jeu (ET), vérifier la liste.\",\"\"))","v":""},null,null,null,null,null,null,null,null,null,{"$f":"IF(X11=\"ET\",1,\"\")","v":""},{"$f":"IF(X12=\"ET\",1,\"\")","v":""},{"$f":"IF(X13=\"ET\",1,\"\")","v":""},{"$f":"IF(X14=\"ET\",1,\"\")","v":""},{"$f":"IF(X15=\"ET\",1,\"\")","v":""},{"$f":"IF(X16=\"ET\",1,\"\")","v":""},{"$f":"SUM(AH30:AM30)","v":0}]
[null,null,null,null,null,null,null,null,null,null,null,null,null,{"$f":"IF(D17=\"ET\",1,\"\")","v":""},{"$f":"IF(D18=\"ET\",1,\"\")","v":""},{"$f":"IF(D19=\"ET\",1,\"\")","v":""},{"$f":"IF(D20=\"ET\",1,\"\")","v":""},{"$f":"IF(D21=\"ET\",1,\"\")","v":""},{"$f":"IF(D22=\"ET\",1,\"\")","v":""},{"$f":"SUM(N31:S31)","v":0},null,null,null,null,null,null,null,null,null,null,null,null,null,{"$f":"IF(X17=\"ET\",1,\"\")","v":""},{"$f":"IF(X18=\"ET\",1,\"\")","v":""},{"$f":"IF(X19=\"ET\",1,\"\")","v":""},{"$f":"IF(X20=\"ET\",1,\"\")","v":""},{"$f":"IF(X21=\"ET\",1,\"\")","v":""},{"$f":"IF(X22=\"ET\",1,\"\")","v":""},{"$f":"SUM(AH31:AM31)","v":0}]

{"sheet":"Nationale_3_poule_E","index":9,"n_rows":31,"n_cols":41,"rows_kept":31,"cut":false,"hidden":false,"merged":[[27,23,27,28],[29,3,30,11],[29,23,30,31],[34,23,40,23],[24,31,25,31],[25,3,25,8],[25,23,25,28],[26,3,26,8],[26,10,27,10],[26,11,27,11],[26,23,26,28],[26,30,27,30],[26,31,27,31],[27,3,27,8],[24,7,24,8],[24,10,25,10],[24,11,25,11],[24,27,24,28],[24,30,25,30],[5,3,5,11],[5,23,5,31],[6,3,6,11],[6,23,6,31],[8,25,8,26]]}
[]
[]
[]
[]
[]
[null,null,null,"Equipe A",null,null,null,null,null,null,null,null,null,null,null,null,null,null,null,null,null,null,null,"Equipe B"]
[null,null,null,"HYERES 2",null,null,null,null,null,null,null,null,null,null,null,null,null,null,null,null,null,null,null,"MARSEILLE 2"]
[]
[null,null,null,"Carte","Pts","   Noms         /          Prénoms",null,"N°","Valeur","entrée en jeu","Sans Abattement","Bonus",null,"J","JF","F-FET","S-SF",null,"Valide","ET",null,null,null,"Carte","Pts","   Noms         /          Prénoms",null,"N°","Valeur","entrée en jeu","Sans Abattement","Bonus",null,"J","JF","F-FET","S-SF",null,"Valide","ET"]
[]
[{"$f":"IF('Liste équipes'!I3=\"\",\"\",'Liste équipes'!I3)","v":""},null,null,null,null,null,null,null,{"$f":"IF(AND(D11=\"\",E11=5),5,IF(AND(D11=\"VAL\",E11<5),\"faux\",IF(D11=\"j\",E11,IF(D11=\"jf\",E11,IF(D11=\"f\",E11,IF(D11=\"fet\",E11,IF(D11=\"et\",E11,IF(AND(D11=\"\",E11=\"\"),\"\",E11))))))))","v":""},null,{"$f":"IF(AND(J11=\"X\",E11>0),I11,\"\")","v":""},{"$f":"IF(AND(J11=\"X\",D11=\"J\",E11<5),1.5,IF(AND(J11=\"X\",D11=\"JS\",E11<5),2,IF(AND(J11=\"X\",D11=\"JF\",E11<5),2.5,IF(AND(J11=\"X\",D11=\"JFS\",E11<5),3,IF(AND(J11=\"X\",D11=\"F\",E11<5),1.5,IF(AND(J11=\"X\",D11=\"FET\",E11<5),1.5,IF(AND(J11=\"X\",D11=\"SFET\",E11<5),2,IF(AND(J11=\"X\",D11=\"SF\",E11<5),2,IF(AND(J11=\"X\",D11=\"FV\",E11=5),0.5,IF(AND(J11=\"X\",D11=\"S\",E11<5),0.5,IF(AND(J11=\"X\",D11=\"SET\",E11<5),0.5,IF(AND(J11=\"X\",D11=\"SFID\",E11<5),0.5,\"\"))))))))))))","v":""},null,{"$f":"IF(AND(J11=\"X\",D11=\"J\"),1,\"\")","v":""},{"$f":"IF(AND(J11=\"X\",D11=\"JF\"),1,IF(AND(J11=\"X\",D11=\"SF\"),1,\"\"))","v":""},{"$f":"IF(AND(J11=\"X\",D11=\"F\"),1,IF(AND(J11=\"X\",D11=\"FET\"),1,\"\"))","v":""},{"$f":"IF(AND(J11=\"X\",D11=\"S\"),1,\"\")","v":""},{"$f":"IF(AND(J11=\"X\",E11>0),1,\"\")","v":""},{"$f":"IF(E11=5,1,\"\")","v":""},{"$f":"IF(D11=\"ET\",1,\"\")","v":""},{"$f":"IF(AND(J11=\"X\",D11=\"ET\"),1,\"\")","v":""},null,null,null,null,null,null,null,{"$f":"IF(AND(X11=\"\",Y11=5),5,IF(AND(X11=\"VAL\",Y11<5),\"faux\",IF(X11=\"j\",Y11,IF(X11=\"jf\",Y11,IF(X11=\"f\",Y11,IF(X11=\"fet\",Y11,IF(X11=\"et\",Y11,IF(AND(X11=\"\",Y11=\"\"),\"\",Y11))))))))","v":""},null,{"$f":"IF(AND(AD11=\"X\",Y11>0),AC11,\"\")","v":""},{"$f":"IF(AND(AD11=\"X\",X11=\"J\",Y11<5),1.5,IF(AND(AD11=\"X\",X11=\"JS\",Y11<5),2,IF(AND(AD11=\"X\",X11=\"JF\",Y11<5),2.5,IF(AND(AD11=\"X\",X11=\"JFS\",Y11<5),3,IF(AND(AD11=\"X\",X11=\"F\",Y11<5),1.5,IF(AND(AD11=\"X\",X11=\"FET\",Y11<5),1.5,IF(AND(AD11=\"X\",X11=\"SFET\",Y11<5),2,IF(AND(AD11=\"X\",X11=\"SF\",Y11<5),2,IF(AND(AD11=\"X\",X11=\"FV\",Y11=5),0.5,IF(AND(AD11=\"X\",X11=\"S\",Y11<5),0.5,IF(AND(AD11=\"X\",X11=\"SET\",Y11<5),0.5,IF(AND(AD11=\"X\",X11=\"SFID\",Y11<5),0.5,\"\"))))))))))))","v":""},null,{"$f":"IF(AND(AD11=\"X\",X11=\"J\"),1,\"\")","v":""},{"$f":"IF(AND(AD11=\"X\",X11=\"JF\"),1,IF(AND(AD11=\"X\",X11=\"SF\"),1,\"\"))","v":""},{"$f":"IF(AND(AD11=\"X\",X11=\"F\"),1,IF(AND(AD11=\"X\",X11=\"FET\"),1,\"\"))","v":""},{"$f":"IF(AND(AD11=\"X\",X11=\"S\"),1,\"\")","v":""},{"$f":"IF(AND(AD11=\"X\",Y11>0),1,\"\")","v":""},{"$f":"IF(Y11=5,1,\"\")","v":""},{"$f":"IF(X11=\"ET\",1,\"\")","v":""},{"$f":"IF(AND(AD11=\"X\",X11=\"ET\"),1,\"\")","v":""}]
[{"$f":"IF('Liste équipes'!I4=\"\",\"\",'Liste équipes'!I4)","v":"HYERES 2"},null,null,null,null,null,null,null,{"$f":"IF(AND(D12=\"\",E12=5),5,IF(AND(D12=\"VAL\",E12<5),\"faux\",IF(D12=\"j\",E12,IF(D12=\"jf\",E12,IF(D12=\"f\",E12,IF(D12=\"fet\",E12,IF(D12=\"et\",E12,IF(AND(D12=\"\",E12=\"\"),\"\",E12))))))))","v":""},null,{"$f":"IF(AND(J12=\"X\",E12>0),I12,\"\")","v":""},{"$f":"IF(AND(J12=\"X\",D12=\"J\",E12<5),1.5,IF(AND(J12=\"X\",D12=\"JS\",E12<5),2,IF(AND(J12=\"X\",D12=\"JF\",E12<5),2.5,IF(AND(J12=\"X\",D12=\"JFS\",E12<5),3,IF(AND(J12=\"X\",D12=\"F\",E12<5),1.5,IF(AND(J12=\"X\",D12=\"FET\",E12<5),1.5,IF(AND(J12=\"X\",D12=\"SFET\",E12<5),2,IF(AND(J12=\"X\",D12=\"SF\",E12<5),2,IF(AND(J12=\"X\",D12=\"FV\",E12=5),0.5,IF(AND(J12=\"X\",D12=\"S\",E12<5),0.5,IF(AND(J12=\"X\",D12=\"SET\",E12<5),0.5,IF(AND(J12=\"X\",D12=\"SFID\",E12<5),0.5,\"\"))))))))))))","v":""},null,"",{"$f":"IF(AND(J12=\"X\",D12=\"JF\"),1,\"\")","v":""},"","","","","",{"$f":"IF(AND(J12=\"X\",D12=\"ET\"),1,\"\")","v":""},null,null,null,null,null,null,null,{"$f":"IF(AND(X12=\"\",Y12=5),5,IF(AND(X12=\"VAL\",Y12<5),\"faux\",IF(X12=\"j\",Y12,IF(X12=\"jf\",Y12,IF(X12=\"f\",Y12,IF(X12=\"fet\",Y12,IF(X12=\"et\",Y12,IF(AND(X12=\"\",Y12=\"\"),\"\",Y12))))))))","v":""},null,{"$f":"IF(AND(AD12=\"X\",Y12>0),AC12,\"\")","v":""},{"$f":"IF(AND(AD12=\"X\",X12=\"J\",Y12<5),1.5,IF(AND(AD12=\"X\",X12=\"JS\",Y12<5),2,IF(AND(AD12=\"X\",X12=\"JF\",Y12<5),2.5,IF(AND(AD12=\"X\",X12=\"JFS\",Y12<5),3,IF(AND(AD12=\"X\",X12=\"F\",Y12<5),1.5,IF(AND(AD12=\"X\",X12=\"FET\",Y12<5),1.5,IF(AND(AD12=\"X\",X12=\"SFET\",Y12<5),2,IF(AND(AD12=\"X\",X12=\"SF\",Y12<5),2,IF(AND(AD12=\"X\",X12=\"FV\",Y12=5),0.5,IF(AND(AD12=\"X\",X12=\"S\",Y12<5),0.5,IF(AND(AD12=\"X\",X12=\"SET\",Y12<5),0.5,IF(AND(AD12=\"X\",X12=\"SFID\",Y12<5),0.5,\"\"))))))))))))","v":""},null,"",{"$f":"IF(AND(AD12=\"X\",X12=\"JF\"),1,\"\")","v":""},"","","","","",{"$f":"IF(AND(AD12=\"X\",X12=\"ET\"),1,\"\")","v":""}]
[{"$f":"IF('Liste équipes'!I5=\"\",\"\",'Liste équipes'!I5)","v":"LE CANNET 2"},null,null,null,null,null,null,null,{"$f":"IF(AND(D13=\"\",E13=5),5,IF(AND(D13=\"VAL\",E13<5),\"faux\",IF(D13=\"j\",E13,IF(D13=\"jf\",E13,IF(D13=\"f\",E13,IF(D13=\"fet\",E13,IF(D13=\"et\",E13,IF(AND(D13=\"\",E13=\"\"),\"\",E13))))))))","v":""},null,"",{"$f":"IF(AND(J13=\"X\",D13=\"J\",E13<5),1.5,IF(AND(J13=\"X\",D13=\"JS\",E13<5),2,IF(AND(J13=\"X\",D13=\"JF\",E13<5),2.5,IF(AND(J13=\"X\",D13=\"JFS\",E13<5),3,IF(AND(J13=\"X\",D13=\"F\",E13<5),1.5,IF(AND(J13=\"X\",D13=\"FET\",E13<5),1.5,IF(AND(J13=\"X\",D13=\"SFET\",E13<5),2,IF(AND(J13=\"X\",D13=\"SF\",E13<5),2,IF(AND(J13=\"X\",D13=\"FV\",E13=5),0.5,IF(AND(J13=\"X\",D13=\"S\",E13<5),0.5,IF(AND(J13=\"X\",D13=\"SET\",E13<5),0.5,IF(AND(J13=\"X\",D13=\"SFID\",E13<5),0.5,\"\"))))))))))))","v":""},null,"","","","","","","","",null,null,null,null,null,null,null,"",null,{"$f":"IF(AND(AD13=\"X\",Y13>0),AC13,\"\")","v":""},"",null,"","","","","","","",""]
[{"$f":"IF('Liste équipes'!I6=\"\",\"\",'Liste équipes'!I6)","v":"MARSEILLE 2"},null,null,null,null,null,null,null,"",null,"","",null,"","","","","","","","",null,null,null,null,null,null,null,"",null,"","",null,"","","","","","","",""]
[{"$f":"IF('Liste équipes'!I7=\"\",\"\",'Liste équipes'!I7)","v":""},null,null,null,null,null,null,null,"",null,"","",null,"","","","","","","","",null,null,null,null,null,null,null,"",null,"","",null,"","","","","","","",""]
[{"$f":"IF('Liste équipes'!I8=\"\",\"\",'Liste équipes'!I8)","v":""},null,null,null,null,null,null,null,"",null,"","",null,"","","","","","","","",null,null,null,null,null,null,null,"",null,"","",null,"","","","","","","",""]
[null,null,null,null,null,null,null,null,"",null,"","",null,"","","","","","","","",null,null,null,null,null,null,null,"",null,"","",null,"","","","","","","",""]
[null,null,null,null,null,null,null,null,"",null,"","",null,"","","","","","","","",null,null,null,null,null,null,null,"",null,"","",null,"","","","","","","",""]
[null,null,null,null,null,null,null,null,"",null,"","",null,"","","","","","","","",null,null,null,null,null,null,null,"",null,"","",null,"","","","","","","",""]
[null,null,null,null,null,null,null,null,"",null,"","",null,"","","","","","","","",null,null,null,null,null,null,null,"",null,"","",null,"","","","","","","",""]
[null,null,null,null,null,null,null,null,"",null,"","",null,"","","","","","","","",null,null,null,null,null,null,null,"",null,"","",null,"","","","","","","",""]
[null,null,null,null,null,null,null,null,"",null,"","",null,"","","","","","","","",null,null,null,null,null,null,null,"",null,"","",null,"","","","","","","",""]
[null,null,null,null,null,null,null,null,null,null,null,null,null,"","","","","","","","",null,null,null,null,null,null,null,null,null,null,null,null,"","","","","","","",""]
[null,null,null,null,null,null,null,null,null,null,null,null,null,"","","","","","","","",null,null,null,null,null,null,null,null,null,null,null,null,"","","","","","","",""]
[null,null,null,"  Nombre joueurs sur le terrain",null,null,{"$f":"IF(J25>5,\"\",\"OK\")","v":""},{"$f":"IF(R25>5,\"PAS OK\",\"\")","v":""},null,{"$f":"IF(L27=\"\",\"\",R25)","v":""},"Points en jeu","Points autorisés maxi 19",null,{"$f":"SUM(N11:N24)","v":0},0,0,0,0,0,0,0,null,null,"  Nombre joueurs sur le terrain",null,null,{"$f":"IF(AD25>5,\"\",\"OK\")","v":""},{"$f":"IF(AL25>5,\"PAS OK\",\"\")","v":""},null,{"$f":"IF(AF27=\"\",\"\",AL25)","v":""},"Points en jeu","Points autorisés maxi 19",null,{"$f":"SUM(AH11:AH24)","v":0},0,0,0,0,0,0,0]
[null,null,null,null,null,null,null,null,null,null,null,null,null,{"$f":"IF(N25=0,\"\",IF(N25=1,17,IF(N25=2,18.5,IF(N25=3,19,IF(N25>3,19,IF(N25>4,19,IF(N25>5,19,\"\")))))))","v":""},{"$f":"IF(O25=0,\"\",IF(O25=1,18,IF(O25=2,19,IF(O25=3,19,IF(O25=4,19,IF(O25=4,19,\"\"))))))","v":""},{"$f":"IF(P25=0,\"\",IF(P25=1,17,IF(P25=2,18.5,IF(P25=3,19,IF(P25=4,19,IF(P25=5,17.5,\"\"))))))","v":""},{"$f":"IF(Q25=0,\"\",IF(Q25=1,16,IF(Q25=2,16.5,IF(Q25=3,17,IF(Q25=4,17.5,IF(Q25=5,18,IF(Q25=6,18.5,IF(Q25=7,19,IF(Q25=8,19,IF(Q25=9,19,IF(Q25=10,19,IF(Q25=11,19,IF(Q25=12,19,\"\")))))))))))))","v":""},{"$f":"IF(AND(O26=16.5,P26=16),17.5,IF(AND(N26=15.5,P26=16),17,IF(AND(N26=15.5,O26=16.5),17.5,IF(AND(N26=16.5,P26=16),17.5,IF(AND(N25=2,O26=16.5),17.5,\"\")))))","v":""},null,null,null,null,null,null,null,null,null,null,null,null,null,null,null,{"$f":"IF(AH25=0,\"\",IF(AH25=1,17,IF(AH25=2,18.5,IF(AH25=3,19,IF(AH25>3,19,IF(AH25>4,19,IF(AH25>5,19,\"\")))))))","v":""},{"$f":"IF(AI25=0,\"\",IF(AI25=1,18,IF(AI25=2,19,IF(AI25=3,19,IF(AI25=4,19,IF(AI25=4,19,\"\"))))))","v":""},{"$f":"IF(AJ25=0,\"\",IF(AJ25=1,17,IF(AJ25=2,18.5,IF(AJ25=3,19,IF(AJ25=4,19,IF(AJ25=5,17.5,\"\"))))))","v":""},{"$f":"IF(AK25=0,\"\",IF(AK25=1,16,IF(AK25=2,16.5,IF(AK25=3,17,IF(AK25=4,17.5,IF(AK25=5,18,IF(AK25=6,18.5,IF(AK25=7,19,IF(AK25=8,19,IF(AK25=9,19,IF(AK25=10,19,IF(AK25=11,19,IF(AK25=12,19,\"\")))))))))))))","v":""},{"$f":"IF(AND(AI26=16.5,AJ26=16),17.5,IF(AND(AH26=15.5,AJ26=16),17,IF(AND(AH26=15.5,AI26=16.5),17.5,IF(AND(AH26=16.5,AJ26=16),17.5,IF(AND(AH25=2,AI26=16.5),17.5,\"\")))))","v":""}]
[null,null," ",{"$f":"IF(K27>L27,\"Trop de points en jeu\",\"\")","v":""},null,null,null,null,null,null,{"$f":"IF(O28>0,O28,\"\")","v":""},{"$f":"IF(O28=0,\"\",Q28)","v":""},null,{"$f":"SUM(N26)","v":0},{"$f":"SUM(O26)","v":0},{"$f":"SUM(P26)","v":0},{"$f":"SUM(Q26)","v":0},{"$f":"SUM(R26)","v":0},null,null,null,null," ",{"$f":"IF(AE27>AF27,\"Trop de points en jeu\",\"\")","v":""},null,null,null,null,null,null,{"$f":"IF(AI28>0,AI28,\"\")","v":""},{"$f":"IF(AI28=0,\"\",AK28)","v":""},null,{"$f":"SUM(AH26)","v":0},{"$f":"SUM(AI26)","v":0},{"$f":"SUM(AJ26)","v":0},{"$f":"SUM(AK26)","v":0},{"$f":"SUM(AL26)","v":0}]
[null,null,null,{"$f":"IF(S25>2,\"Trop de joueurs  valides inscrits sur la feuille\",\"\")","v":""},null,null,null,null,null,null,null,null,null,{"$f":"SUM(L11:L24)","v":0},{"$f":"SUM(K11:K24)","v":0},{"$f":"SUM(N28+15.5)","v":15.5},{"$f":"IF(P28>19,19,P28)","v":15.5},null,null,{"$f":"SUM(T30:T31)","v":0},null,null,null,{"$f":"IF(AM25>2,\"Trop de joueurs  valides inscrits sur la feuille\",\"\")","v":""},null,null,null,null,null,null,null,null,null,{"$f":"SUM(AF11:AF24)","v":0},{"$f":"SUM(AE11:AE24)","v":0},{"$f":"SUM(AH28+15.5)","v":15.5},{"$f":"IF(AJ28>19,19,AJ28)","v":15.5},null,null,{"$f":"SUM(AN30:AN31)","v":0}]
[]
[null,null,null,{"$f":"IF(T25>5,\" Pas OK. Trop de joueurs (5 points), vérifier la liste de l'équipe.\",IF(U25>4,\"Pas OK. Trop de joueurs étrangers en jeu (ET), vérifier la liste.\",\"\"))","v":""},null,null,null,null,null,null,null,null,null,{"$f":"IF(D11=\"ET\",1,\"\")","v":""},{"$f":"IF(D12=\"ET\",1,\"\")","v":""},{"$f":"IF(D13=\"ET\",1,\"\")","v":""},{"$f":"IF(D14=\"ET\",1,\"\")","v":""},{"$f":"IF(D15=\"ET\",1,\"\")","v":""},{"$f":"IF(D16=\"ET\",1,\"\")","v":""},{"$f":"SUM(N30:S30)","v":0},null,null,null,{"$f":"IF(AN25>5,\" Pas OK. Trop de joueurs (5 points), vérifier la liste de l'équipe.\",IF(AO25>4,\"Pas OK. Trop de joueurs étrangers en jeu (ET), vérifier la liste.\",\"\"))","v":""},null,null,null,null,null,null,null,null,null,{"$f":"IF(X11=\"ET\",1,\"\")","v":""},{"$f":"IF(X12=\"ET\",1,\"\")","v":""},{"$f":"IF(X13=\"ET\",1,\"\")","v":""},{"$f":"IF(X14=\"ET\",1,\"\")","v":""},{"$f":"IF(X15=\"ET\",1,\"\")","v":""},{"$f":"IF(X16=\"ET\",1,\"\")","v":""},{"$f":"SUM(AH30:AM30)","v":0}]
[null,null,null,null,null,null,null,null,null,null,null,null,null,{"$f":"IF(D17=\"ET\",1,\"\")","v":""},{"$f":"IF(D18=\"ET\",1,\"\")","v":""},{"$f":"IF(D19=\"ET\",1,\"\")","v":""},{"$f":"IF(D20=\"ET\",1,\"\")","v":""},{"$f":"IF(D21=\"ET\",1,\"\")","v":""},{"$f":"IF(D22=\"ET\",1,\"\")","v":""},{"$f":"SUM(N31:S31)","v":0},null,null,null,null,null,null,null,null,null,null,null,null,null,{"$f":"IF(X17=\"ET\",1,\"\")","v":""},{"$f":"IF(X18=\"ET\",1,\"\")","v":""},{"$f":"IF(X19=\"ET\",1,\"\")","v":""},{"$f":"IF(X20=\"ET\",1,\"\")","v":""},{"$f":"IF(X21=\"ET\",1,\"\")","v":""},{"$f":"IF(X22=\"ET\",1,\"\")","v":""},{"$f":"SUM(AH31:AM31)","v":0}]

{"sheet":"Finale_Four_Nationale_2","index":10,"n_rows":31,"n_cols":41,"rows_kept":31,"cut":false,"hidden":false,"merged":[[24,11,25,11],[24,27,24,28],[24,30,25,30],[5,3,5,11],[5,23,5,31],[6,3,6,11],[6,23,6,31],[8,25,8,26],[27,23,27,28],[29,3,30,11],[29,23,30,31],[34,23,40,23],[24,31,25,31],[25,3,25,8],[25,23,25,28],[26,3,26,8],[26,10,27,10],[26,11,27,11],[26,23,26,28],[26,30,27,30],[26,31,27,31],[27,3,27,8],[24,7,24,8],[24,10,25,10]]}
[]
[]
[]
[]
[]
[null,null,null,"Equipe A",null,null,null,null,null,null,null,null,null,null,null,null,null,null,null,null,null,null,null,"Equipe B"]
[null,null,null,"BLANQUEFORT finale",null,null,null,null,null,null,null,null,null,null,null,null,null,null,null,null,null,null,null,"LYON finale"]
[]
[null,null,null,"Carte","Pts","   Noms         /          Prénoms",null,"N°","Valeur","entrée en jeu","Sans Abattement","Bonus",null,"J","JF","F-FET","S-SF",null,"Valide","ET",null,null,null,"Carte","Pts","   Noms         /          Prénoms",null,"N°","Valeur","entrée en jeu","Sans Abattement","Bonus",null,"J","JF","F-FET","S-SF",null,"Valide","ET"]
[]
[{"$f":"IF('Liste équipes'!K3=\"\",\"\",'Liste équipes'!K3)","v":""},null,null,null,null,null,null,null,{"$f":"IF(D11=\"n\",E11,IF(D11=\"j\",E11,IF(D11=\"jf\",E11,IF(D11=\"f\",E11,IF(D11=\"fet\",E11,IF(D11=\"et\",E11,IF(D11=\"fid\",E11,IF(D11=\"s\",E11,IF(D11=\"FS\",E11,IF(D11=\"JS\",E11,IF(D11=\"JFS\",E11,IF(D11=\"\",\"\"))))))))))))","v":""},null,{"$f":"IF(AND(J11=\"X\",E11>0),I11,\"\")","v":""},{"$f":"IF(AND(J11=\"X\",D11=\"J\"),1.5,IF(AND(J11=\"X\",D11=\"JF\"),2.5,IF(AND(J11=\"X\",D11=\"JS\"),2,IF(AND(J11=\"X\",D11=\"JFS\"),3,IF(AND(J11=\"X\",D11=\"F\",E11<5),1.5,IF(AND(J11=\"X\",D11=\"FET\",E11<5),1.5,IF(AND(J11=\"X\",D11=\"FS\",E11<5),2,IF(AND(J11=\"X\",D11=\"S\",E11<5),0.5,\"\"))))))))","v":""},null,{"$f":"IF(AND(J11=\"X\",D11=\"J\"),1,\"\")","v":""},{"$f":"IF(AND(J11=\"X\",D11=\"JF\"),1,IF(AND(J11=\"X\",D11=\"SF\"),1,\"\"))","v":""},{"$f":"IF(AND(J11=\"X\",D11=\"F\"),1,IF(AND(J11=\"X\",D11=\"FET\"),1,\"\"))","v":""},{"$f":"IF(AND(J11=\"X\",D11=\"S\"),1,\"\")","v":""},{"$f":"IF(AND(J11=\"X\",E11>0),1,\"\")","v":""},{"$f":"IF(E11=5,1,\"\")","v":""},{"$f":"IF(AND(D11=\"ET\",J11=\"X\"),1,\"\")","v":""},{"$f":"IF(AND(#REF!=\"X\",D11=\"ET\"),1,\"\")","v":{"$error":"#REF!"}},null,null,null,null,null,null,null,{"$f":"IF(X11=\"SF\",Y11,IF(X11=\"n\",Y11,IF(X11=\"j\",Y11,IF(X11=\"jf\",Y11,IF(X11=\"f\",Y11,IF(X11=\"fet\",Y11,IF(X11=\"et\",Y11,IF(X11=\"fid\",Y11,IF(X11=\"s\",Y11,IF(X11=\"FS\",Y11,IF(X11=\"Js\",Y11,IF(X11=\"Jfs\",Y11,IF(X11=\"\",\"\")))))))))))))","v":""},null,{"$f":"IF(AND(AD11=\"X\",Y11>0),AC11,\"\")","v":""},{"$f":"IF(AND(AD11=\"X\",X11=\"J\"),1.5,IF(AND(AD11=\"X\",X11=\"JF\"),2.5,IF(AND(AD11=\"X\",X11=\"JS\"),2,IF(AND(AD11=\"X\",X11=\"JFS\"),3,IF(AND(AD11=\"X\",X11=\"F\",Y11<5),1.5,IF(AND(AD11=\"X\",X11=\"FET\",Y11<5),1.5,IF(AND(AD11=\"X\",X11=\"FS\",Y11<5),2,IF(AND(AD11=\"X\",X11=\"S\",Y11<5),0.5,IF(AND(AD11=\"X\",X11=\"SF\"),0.5,\"\")))))))))","v":""},null,{"$f":"IF(AND(AD11=\"X\",X11=\"J\"),1,\"\")","v":""},{"$f":"IF(AND(AD11=\"X\",X11=\"JF\"),1,IF(AND(AD11=\"X\",X11=\"SF\"),1,\"\"))","v":""},{"$f":"IF(AND(AD11=\"X\",X11=\"F\"),1,IF(AND(AD11=\"X\",X11=\"FET\"),1,\"\"))","v":""},{"$f":"IF(AND(AD11=\"X\",X11=\"S\"),1,\"\")","v":""},{"$f":"IF(AND(AD11=\"X\",Y11>0),1,\"\")","v":""},{"$f":"IF(Y11=5,1,\"\")","v":""},{"$f":"IF(AND(X11=\"ET\",AD11=\"X\"),1,\"\")","v":""},{"$f":"IF(AND(AD11=\"X\",X11=\"ET\"),1,\"\")","v":""}]
[{"$f":"IF('Liste équipes'!K4=\"\",\"\",'Liste équipes'!K4)","v":"BLANQUEFORT finale"},null,null,null,null,null,null,null,"",null,{"$f":"IF(AND(J12=\"X\",E12>0),I12,\"\")","v":""},{"$f":"IF(AND(J12=\"X\",D12=\"J\"),1.5,IF(AND(J12=\"X\",D12=\"JF\"),2.5,IF(AND(J12=\"X\",D12=\"JS\"),2,IF(AND(J12=\"X\",D12=\"JFS\"),3,IF(AND(J12=\"X\",D12=\"F\",E12<5),1.5,IF(AND(J12=\"X\",D12=\"FET\",E12<5),1.5,IF(AND(J12=\"X\",D12=\"FS\",E12<5),2,IF(AND(J12=\"X\",D12=\"S\",E12<5),0.5,\"\"))))))))","v":""},null,{"$f":"IF(AND(J12=\"X\",D12=\"J\"),1,\"\")","v":""},{"$f":"IF(AND(J12=\"X\",D12=\"JF\"),1,\"\")","v":""},{"$f":"IF(AND(J12=\"X\",D12=\"F\"),1,IF(AND(J12=\"X\",D12=\"FET\"),1,\"\"))","v":""},{"$f":"IF(AND(J12=\"X\",D12=\"S\"),1,\"\")","v":""},{"$f":"IF(AND(J12=\"X\",E12>0),1,\"\")","v":""},{"$f":"IF(E12=5,1,\"\")","v":""},{"$f":"IF(AND(D12=\"ET\",J12=\"X\"),1,\"\")","v":""},{"$f":"IF(AND(J11=\"X\",D12=\"ET\"),1,\"\")","v":""},null,null,null,null,null,null,null,{"$f":"IF(X12=\"SF\",Y12,IF(X12=\"n\",Y12,IF(X12=\"j\",Y12,IF(X12=\"jf\",Y12,IF(X12=\"f\",Y12,IF(X12=\"fet\",Y12,IF(X12=\"et\",Y12,IF(X12=\"fid\",Y12,IF(X12=\"s\",Y12,IF(X12=\"FS\",Y12,IF(X12=\"Js\",Y12,IF(X12=\"Jfs\",Y12,IF(X12=\"\",\"\")))))))))))))","v":""},null,"",{"$f":"IF(AND(AD12=\"X\",X12=\"J\"),1.5,IF(AND(AD12=\"X\",X12=\"JF\"),2.5,IF(AND(AD12=\"X\",X12=\"JS\"),2,IF(AND(AD12=\"X\",X12=\"JFS\"),3,IF(AND(AD12=\"X\",X12=\"F\",Y12<5),1.5,IF(AND(AD12=\"X\",X12=\"FET\",Y12<5),1.5,IF(AND(AD12=\"X\",X12=\"FS\",Y12<5),2,IF(AND(AD12=\"X\",X12=\"S\",Y12<5),0.5,IF(AND(AD12=\"X\",X12=\"SF\"),0.5,\"\")))))))))","v":""},null,{"$f":"IF(AND(AD12=\"X\",X12=\"J\"),1,\"\")","v":""},{"$f":"IF(AND(AD12=\"X\",X12=\"JF\"),1,\"\")","v":""},{"$f":"IF(AND(AD12=\"X\",X12=\"F\"),1,IF(AND(AD12=\"X\",X12=\"FET\"),1,\"\"))","v":""},{"$f":"IF(AND(AD12=\"X\",X12=\"S\"),1,\"\")","v":""},{"$f":"IF(AND(AD12=\"X\",Y12>0),1,\"\")","v":""},{"$f":"IF(Y12=5,1,\"\")","v":""},{"$f":"IF(AND(X12=\"ET\",AD12=\"X\"),1,\"\")","v":""},{"$f":"IF(AND(AD12=\"X\",X12=\"ET\"),1,\"\")","v":""}]
[{"$f":"IF('Liste équipes'!K5=\"\",\"\",'Liste équipes'!K5)","v":"CAMBRAI finale"},null,null,null,null,null,null,null,"",null,"","",null,"","","","","","","",{"$f":"IF(AND(J13=\"X\",D13=\"ET\"),1,\"\")","v":""},null,null,null,null,null,null,null,"",null,"",{"$f":"IF(AND(AD13=\"X\",X13=\"J\"),1.5,IF(AND(AD13=\"X\",X13=\"JF\"),2.5,IF(AND(AD13=\"X\",X13=\"JS\"),2,IF(AND(AD13=\"X\",X13=\"JFS\"),3,IF(AND(AD13=\"X\",X13=\"F\",Y13<5),1.5,IF(AND(AD13=\"X\",X13=\"FET\",Y13<5),1.5,IF(AND(AD13=\"X\",X13=\"FS\",Y13<5),2,IF(AND(AD13=\"X\",X13=\"S\",Y13<5),0.5,IF(AND(AD13=\"X\",X13=\"SF\"),0.5,\"\")))))))))","v":""},null,"","","","","","","",""]
[{"$f":"IF('Liste équipes'!K6=\"\",\"\",'Liste équipes'!K6)","v":"LE PUY 2 finale"},null,null,null,null,null,null,null,"",null,"","",null,"","","","","","","","",null,null,null,null,null,null,null,"",null,"","",null,"","","","","","","",""]
[null,null,null,null,null,null,null,null,"",null,"","",null,"","","","","","","","",null,null,null,null,null,null,null,"",null,"","",null,"","","","","","","",""]
[null,null,null,null,null,null,null,null,"",null,"","",null,"","","","","","","","",null,null,null,null,null,null,null,"",null,"","",null,"","","","","","","",""]
[null,null,null,null,null,null,null,null,"",null,"","",null,"","","","","","","","",null,null,null,null,null,null,null,"",null,"","",null,"","","","","","","",""]
[null,null,null,null,null,null,null,null,"",null,"","",null,"","","","","","","","",null,null,null,null,null,null,null,"",null,"","",null,"","","","","","","",""]
[null,null,null,null,null,null,null,null,"",null,"","",null,"","","","","","","","",null,null,null,null,null,null,null,"",null,"","",null,"","","","","","","",""]
[null,null,null,null,null,null,null,null,"",null,"","",null,"","","","","","","","",null,null,null,null,null,null,null,"",null,"","",null,"","","","","","","",""]
[null,null,null,null,null,null,null,null,"",null,"","",null,"","","","","","","","",null,null,null,null,null,null,null,"",null,"","",null,"","","","","","","",""]
[null,null,null,null,null,null,null,null,"",null,"","",null,"","","","","","","","",null,null,null,null,null,null,null,"",null,"","",null,"","","","","","","",""]
[null,null,null,null,null,null,null,null,{"$f":"IF(D23=\"SF\",E23,IF(D23=\"n\",E23,IF(D23=\"j\",E23,IF(D23=\"jf\",E23,IF(D23=\"f\",E23,IF(D23=\"fet\",E23,IF(D23=\"et\",E23,IF(D23=\"fid\",E23,IF(D23=\"s\",E23,IF(D23=\"FS\",E23,IF(D23=\"Js\",E23,IF(D23=\"Jfs\",E23,IF(D23=\"\",\"\")))))))))))))","v":""},null,"",{"$f":"IF(AND(J23=\"X\",D23=\"J\"),1.5,IF(AND(J23=\"X\",D23=\"JF\"),2.5,IF(AND(J23=\"X\",D23=\"JS\"),2,IF(AND(J23=\"X\",D23=\"JFS\"),3,IF(AND(J23=\"X\",D23=\"F\",E23<5),1.5,IF(AND(J23=\"X\",D23=\"FET\",E23<5),1.5,IF(AND(J23=\"X\",D23=\"FS\",E23<5),2,IF(AND(J23=\"X\",D23=\"S\",E23<5),0.5,IF(AND(J23=\"X\",D23=\"SF\"),0.5,\"\")))))))))","v":""},null,"","","","","","","","",null,null,null,null,null,null,null,"",null,"","",null,"","","","","","","",""]
[null,null,null,null,null,null,null,null,{"$f":"IF(D24=\"SF\",E24,IF(D24=\"n\",E24,IF(D24=\"j\",E24,IF(D24=\"jf\",E24,IF(D24=\"f\",E24,IF(D24=\"fet\",E24,IF(D24=\"et\",E24,IF(D24=\"fid\",E24,IF(D24=\"s\",E24,IF(D24=\"FS\",E24,IF(D24=\"Js\",E24,IF(D24=\"Jfs\",E24,IF(D24=\"\",\"\")))))))))))))","v":""},null,"",{"$f":"IF(AND(J24=\"X\",D24=\"J\"),1.5,IF(AND(J24=\"X\",D24=\"JF\"),2.5,IF(AND(J24=\"X\",D24=\"JS\"),2,IF(AND(J24=\"X\",D24=\"JFS\"),3,IF(AND(J24=\"X\",D24=\"F\",E24<5),1.5,IF(AND(J24=\"X\",D24=\"FET\",E24<5),1.5,IF(AND(J24=\"X\",D24=\"FS\",E24<5),2,IF(AND(J24=\"X\",D24=\"S\",E24<5),0.5,IF(AND(J24=\"X\",D24=\"SF\"),0.5,\"\")))))))))","v":""},null,"","","","","","","","",null,null,null,null,null,null,null,"",null,"","",null,"","","","","","","",""]
[null,null,null,"  Nombre joueurs sur le terrain",null,null,{"$f":"IF(J25>5,\"\",\"OK\")","v":""},{"$f":"IF(R25>5,\"PAS OK\",\"\")","v":""},null,{"$f":"IF(L27=\"\",\"\",R25)","v":""},"Points en jeu","Avec Bonus maxi 19 pts",null,{"$f":"SUM(N11:N24)","v":0},0,0,0,0,0,0,{"$error":"#REF!"},null,null,"  Nombre joueurs sur le terrain",null,null,{"$f":"IF(AD25>5,\"\",\"OK\")","v":""},{"$f":"IF(AL25>5,\"PAS OK\",\"\")","v":""},null,{"$f":"IF(AF27=\"\",\"\",AL25)","v":""},"Points en jeu","Points autorisés maxi 19",null,{"$f":"SUM(AH11:AH24)","v":0},0,0,0,0,0,0,0]
[null,null,null,null,null,null,null,null,null,null,null,null,null,{"$f":"IF(N25=0,\"\",IF(N25=1,17,IF(N25=2,18.5,IF(N25=3,19,IF(N25>3,19,IF(N25>4,19,IF(N25>5,19,\"\")))))))","v":""},{"$f":"IF(O25=0,\"\",IF(O25=1,18,IF(O25=2,19,IF(O25=3,19,IF(O25=4,19,IF(O25=4,19,\"\"))))))","v":""},{"$f":"IF(P25=0,\"\",IF(P25=1,17,IF(P25=2,18.5,IF(P25=3,19,IF(P25=4,19,IF(P25=5,17.5,\"\"))))))","v":""},{"$f":"IF(Q25=0,\"\",IF(Q25=1,16,IF(Q25=2,16.5,IF(Q25=3,17,IF(Q25=4,17.5,IF(Q25=5,18,IF(Q25=6,18.5,IF(Q25=7,19,IF(Q25=8,19,IF(Q25=9,19,IF(Q25=10,19,IF(Q25=11,19,IF(Q25=12,19,\"\")))))))))))))","v":""},{"$f":"IF(AND(O26=16.5,P26=16),17.5,IF(AND(N26=15.5,P26=16),17,IF(AND(N26=15.5,O26=16.5),17.5,IF(AND(N26=16.5,P26=16),17.5,IF(AND(N25=2,O26=16.5),17.5,\"\")))))","v":""},null,null,null,null,null,null,null,null,null,null,null,null,null,null,null,{"$f":"IF(AH25=0,\"\",IF(AH25=1,17,IF(AH25=2,18.5,IF(AH25=3,19,IF(AH25>3,19,IF(AH25>4,19,IF(AH25>5,19,\"\")))))))","v":""},{"$f":"IF(AI25=0,\"\",IF(AI25=1,18,IF(AI25=2,19,IF(AI25=3,19,IF(AI25=4,19,IF(AI25=4,19,\"\"))))))","v":""},{"$f":"IF(AJ25=0,\"\",IF(AJ25=1,17,IF(AJ25=2,18.5,IF(AJ25=3,19,IF(AJ25=4,19,IF(AJ25=5,17.5,\"\"))))))","v":""},{"$f":"IF(AK25=0,\"\",IF(AK25=1,16,IF(AK25=2,16.5,IF(AK25=3,17,IF(AK25=4,17.5,IF(AK25=5,18,IF(AK25=6,18.5,IF(AK25=7,19,IF(AK25=8,19,IF(AK25=9,19,IF(AK25=10,19,IF(AK25=11,19,IF(AK25=12,19,\"\")))))))))))))","v":""},{"$f":"IF(AND(AI26=16.5,AJ26=16),17.5,IF(AND(AH26=15.5,AJ26=16),17,IF(AND(AH26=15.5,AI26=16.5),17.5,IF(AND(AH26=16.5,AJ26=16),17.5,IF(AND(AH25=2,AI26=16.5),17.5,\"\")))))","v":""}]
[null,null," ",{"$f":"IF(K27>L27,\"Trop de points en jeu\",\"\")","v":""},null,null,null,null,null,null,{"$f":"IF(O28>0,O28,\"\")","v":""},{"$f":"IF(O28=0,\"\",Q28)","v":""},null,{"$f":"SUM(N26)","v":0},{"$f":"SUM(O26)","v":0},{"$f":"SUM(P26)","v":0},{"$f":"SUM(Q26)","v":0},{"$f":"SUM(R26)","v":0},null,null,null,null," ",{"$f":"IF(AE27>AF27,\"Trop de points en jeu\",\"\")","v":""},null,null,null,null,null,null,{"$f":"IF(AI28>0,AI28,\"\")","v":""},{"$f":"IF(AI28=0,\"\",AK28)","v":""},null,{"$f":"SUM(AH26)","v":0},{"$f":"SUM(AI26)","v":0},{"$f":"SUM(AJ26)","v":0},{"$f":"SUM(AK26)","v":0},{"$f":"SUM(AL26)","v":0}]
[null,null,null,{"$f":"IF(S25>2,\"Trop de joueurs  valides inscrits sur la feuille\",\"\")","v":""},null,null,null,null,null,null,null,null,null,{"$f":"SUM(L11:L24)","v":0},{"$f":"SUM(K11:K24)","v":0},{"$f":"SUM(N28+15)","v":15},{"$f":"IF(P28>19,19,P28)","v":15},null,null,{"$f":"SUM(T30:T31)","v":0},null,null,null,{"$f":"IF(AM25>2,\"Trop de joueurs  valides inscrits sur la feuille\",\"\")","v":""},null,null,null,null,null,null,null,null,null,{"$f":"SUM(AF11:AF24)","v":0},{"$f":"SUM(AE11:AE24)","v":0},{"$f":"SUM(AH28+15)","v":15},{"$f":"IF(AJ28>19,19,AJ28)","v":15},null,null,{"$f":"SUM(AN30:AN31)","v":0}]
[]
[null,null,null,{"$f":"IF(T28>5,\"Pas OK. Trop de joueurs étrangers sur la feuille (ET), vérifier la liste.\",IF(T25>4,\"Pas OK. Trop de joueurs étrangers en jeu (ET), vérifier la liste.\",\"\"))","v":""},null,null,null,null,null,null,null,null,null,{"$f":"IF(D11=\"ET\",1,\"\")","v":""},{"$f":"IF(D12=\"ET\",1,\"\")","v":""},{"$f":"IF(D13=\"ET\",1,\"\")","v":""},{"$f":"IF(D14=\"ET\",1,\"\")","v":""},{"$f":"IF(D15=\"ET\",1,\"\")","v":""},{"$f":"IF(D16=\"ET\",1,\"\")","v":""},{"$f":"SUM(N30:S30)","v":0},null,null,null,{"$f":"IF(AN25>5,\" Pas OK. Trop de joueurs (5 points), vérifier la liste de l'équipe.\",IF(AO25>4,\"Pas OK. Trop de joueurs étrangers en jeu (ET), vérifier la liste.\",\"\"))","v":""},null,null,null,null,null,null,null,null,null,{"$f":"IF(X11=\"ET\",1,\"\")","v":""},{"$f":"IF(X12=\"ET\",1,\"\")","v":""},{"$f":"IF(X13=\"ET\",1,\"\")","v":""},{"$f":"IF(X14=\"ET\",1,\"\")","v":""},{"$f":"IF(X15=\"ET\",1,\"\")","v":""},{"$f":"IF(X16=\"ET\",1,\"\")","v":""},{"$f":"SUM(AH30:AM30)","v":0}]
[null,null,null,null,null,null,null,null,null,null,null,null,null,{"$f":"IF(D17=\"ET\",1,\"\")","v":""},{"$f":"IF(D18=\"ET\",1,\"\")","v":""},{"$f":"IF(D19=\"ET\",1,\"\")","v":""},{"$f":"IF(D20=\"ET\",1,\"\")","v":""},{"$f":"IF(D21=\"ET\",1,\"\")","v":""},{"$f":"IF(D22=\"ET\",1,\"\")","v":""},{"$f":"SUM(N31:S31)","v":0},null,null,null,null,null,null,null,null,null,null,null,null,null,{"$f":"IF(X17=\"ET\",1,\"\")","v":""},{"$f":"IF(X18=\"ET\",1,\"\")","v":""},{"$f":"IF(X19=\"ET\",1,\"\")","v":""},{"$f":"IF(X20=\"ET\",1,\"\")","v":""},{"$f":"IF(X21=\"ET\",1,\"\")","v":""},{"$f":"IF(X22=\"ET\",1,\"\")","v":""},{"$f":"SUM(AH31:AM31)","v":0}]

{"sheet":"Finale_Four_Nationale_3","index":11,"n_rows":31,"n_cols":41,"rows_kept":31,"cut":false,"hidden":false,"merged":[[24,11,25,11],[24,27,24,28],[24,30,25,30],[5,3,5,11],[5,23,5,31],[6,3,6,11],[6,23,6,31],[8,25,8,26],[27,23,27,28],[29,3,30,11],[29,23,30,31],[34,23,40,23],[24,31,25,31],[25,3,25,8],[25,23,25,28],[26,3,26,8],[26,10,27,10],[26,11,27,11],[26,23,26,28],[26,30,27,30],[26,31,27,31],[27,3,27,8],[24,7,24,8],[24,10,25,10]]}
[]
[]
[]
[]
[]
[null,null,null,"Equipe A",null,null,null,null,null,null,null,null,null,null,null,null,null,null,null,null,null,null,null,"Equipe B"]
[null,null,null,"ORLEANS finale",null,null,null,null,null,null,null,null,null,null,null,null,null,null,null,null,null,null,null,"YFFINIAC finale"]
[]
[null,null,null,"Carte","Pts","   Noms         /          Prénoms",null,"N°","Valeur","entrée en jeu","Sans Abattement","Bonus",null,"J","JF","F-FET","S-SF",null,"Valide","ET",null,null,null,"Carte","Pts","   Noms         /          Prénoms",null,"N°","Valeur","entrée en jeu","Sans Abattement","Bonus",null,"J","JF","F-FET","S-SF",null,"Valide","ET"]
[]
[{"$f":"IF('Liste équipes'!J3=\"\",\"\",'Liste équipes'!J3)","v":""},null,null,null,null,null,null,null,{"$f":"IF(D11=\"SF\",E11,IF(D11=\"n\",E11,IF(D11=\"j\",E11,IF(D11=\"jf\",E11,IF(D11=\"f\",E11,IF(D11=\"fet\",E11,IF(D11=\"et\",E11,IF(D11=\"fid\",E11,IF(D11=\"s\",E11,IF(D11=\"FS\",E11,IF(D11=\"Js\",E11,IF(D11=\"Jfs\",E11,IF(D11=\"\",\"\")))))))))))))","v":""},null,{"$f":"IF(AND(J11=\"X\",E11>0),I11,\"\")","v":""},{"$f":"IF(AND(J11=\"X\",D11=\"J\"),1.5,IF(AND(J11=\"X\",D11=\"JF\"),2.5,IF(AND(J11=\"X\",D11=\"JS\"),2,IF(AND(J11=\"X\",D11=\"JFS\"),3,IF(AND(J11=\"X\",D11=\"F\",E11<5),1.5,IF(AND(J11=\"X\",D11=\"FET\",E11<5),1.5,IF(AND(J11=\"X\",D11=\"FS\",E11<5),2,IF(AND(J11=\"X\",D11=\"S\",E11<5),0.5,IF(AND(J11=\"X\",D11=\"SF\"),0.5,\"\")))))))))","v":""},null,{"$f":"IF(AND(J11=\"X\",D11=\"J\"),1,\"\")","v":""},{"$f":"IF(AND(J11=\"X\",D11=\"JF\"),1,IF(AND(J11=\"X\",D11=\"SF\"),1,\"\"))","v":""},{"$f":"IF(AND(J11=\"X\",D11=\"F\"),1,IF(AND(J11=\"X\",D11=\"FET\"),1,\"\"))","v":""},{"$f":"IF(AND(J11=\"X\",D11=\"S\"),1,\"\")","v":""},{"$f":"IF(AND(J11=\"X\",E11>0),1,\"\")","v":""},{"$f":"IF(E11=5,1,\"\")","v":""},{"$f":"IF(D11=\"ET\",1,\"\")","v":""},{"$f":"IF(AND(J11=\"X\",D11=\"ET\"),1,\"\")","v":""},null,null,null,null,null,null,null,{"$f":"IF(X11=\"SF\",Y11,IF(X11=\"n\",Y11,IF(X11=\"j\",Y11,IF(X11=\"jf\",Y11,IF(X11=\"f\",Y11,IF(X11=\"fet\",Y11,IF(X11=\"et\",Y11,IF(X11=\"fid\",Y11,IF(X11=\"s\",Y11,IF(X11=\"FS\",Y11,IF(X11=\"Js\",Y11,IF(X11=\"Jfs\",Y11,IF(X11=\"\",\"\")))))))))))))","v":""},null,{"$f":"IF(AND(AD11=\"X\",Y11>0),AC11,\"\")","v":""},{"$f":"IF(AND(AD11=\"X\",X11=\"J\"),1.5,IF(AND(AD11=\"X\",X11=\"JF\"),2.5,IF(AND(AD11=\"X\",X11=\"JS\"),2,IF(AND(AD11=\"X\",X11=\"JFS\"),3,IF(AND(AD11=\"X\",X11=\"F\",Y11<5),1.5,IF(AND(AD11=\"X\",X11=\"FET\",Y11<5),1.5,IF(AND(AD11=\"X\",X11=\"FS\",Y11<5),2,IF(AND(AD11=\"X\",X11=\"S\",Y11<5),0.5,IF(AND(AD11=\"X\",X11=\"SF\"),0.5,\"\")))))))))","v":""},null,{"$f":"IF(AND(AD11=\"X\",X11=\"J\"),1,\"\")","v":""},{"$f":"IF(AND(AD11=\"X\",X11=\"JF\"),1,IF(AND(AD11=\"X\",X11=\"SF\"),1,\"\"))","v":""},{"$f":"IF(AND(AD11=\"X\",X11=\"F\"),1,IF(AND(AD11=\"X\",X11=\"FET\"),1,\"\"))","v":""},{"$f":"IF(AND(AD11=\"X\",X11=\"S\"),1,\"\")","v":""},{"$f":"IF(AND(AD11=\"X\",Y11>0),1,\"\")","v":""},{"$f":"IF(Y11=5,1,\"\")","v":""},{"$f":"IF(X11=\"ET\",1,\"\")","v":""},{"$f":"IF(AND(AD11=\"X\",X11=\"ET\"),1,\"\")","v":""}]
[{"$f":"IF('Liste équipes'!J4=\"\",\"\",'Liste équipes'!J4)","v":"ANGLET finale"},null,null,null,null,null,null,null,{"$f":"IF(D12=\"SF\",E12,IF(D12=\"n\",E12,IF(D12=\"j\",E12,IF(D12=\"jf\",E12,IF(D12=\"f\",E12,IF(D12=\"fet\",E12,IF(D12=\"et\",E12,IF(D12=\"fid\",E12,IF(D12=\"s\",E12,IF(D12=\"FS\",E12,IF(D12=\"Js\",E12,IF(D12=\"Jfs\",E12,IF(D12=\"\",\"\")))))))))))))","v":""},null,"",{"$f":"IF(AND(J12=\"X\",D12=\"J\"),1.5,IF(AND(J12=\"X\",D12=\"JF\"),2.5,IF(AND(J12=\"X\",D12=\"JS\"),2,IF(AND(J12=\"X\",D12=\"JFS\"),3,IF(AND(J12=\"X\",D12=\"F\",E12<5),1.5,IF(AND(J12=\"X\",D12=\"FET\",E12<5),1.5,IF(AND(J12=\"X\",D12=\"FS\",E12<5),2,IF(AND(J12=\"X\",D12=\"S\",E12<5),0.5,IF(AND(J12=\"X\",D12=\"SF\"),0.5,\"\")))))))))","v":""},null,"",{"$f":"IF(AND(J12=\"X\",D12=\"JF\"),1,\"\")","v":""},"","","","","",{"$f":"IF(AND(J12=\"X\",D12=\"ET\"),1,\"\")","v":""},null,null,null,null,null,null,null,{"$f":"IF(X12=\"SF\",Y12,IF(X12=\"n\",Y12,IF(X12=\"j\",Y12,IF(X12=\"jf\",Y12,IF(X12=\"f\",Y12,IF(X12=\"fet\",Y12,IF(X12=\"et\",Y12,IF(X12=\"fid\",Y12,IF(X12=\"s\",Y12,IF(X12=\"FS\",Y12,IF(X12=\"Js\",Y12,IF(X12=\"Jfs\",Y12,IF(X12=\"\",\"\")))))))))))))","v":""},null,"",{"$f":"IF(AND(AD12=\"X\",X12=\"J\"),1.5,IF(AND(AD12=\"X\",X12=\"JF\"),2.5,IF(AND(AD12=\"X\",X12=\"JS\"),2,IF(AND(AD12=\"X\",X12=\"JFS\"),3,IF(AND(AD12=\"X\",X12=\"F\",Y12<5),1.5,IF(AND(AD12=\"X\",X12=\"FET\",Y12<5),1.5,IF(AND(AD12=\"X\",X12=\"FS\",Y12<5),2,IF(AND(AD12=\"X\",X12=\"S\",Y12<5),0.5,IF(AND(AD12=\"X\",X12=\"SF\"),0.5,\"\")))))))))","v":""},null,"",{"$f":"IF(AND(AD12=\"X\",X12=\"JF\"),1,\"\")","v":""},"","","","","",{"$f":"IF(AND(AD12=\"X\",X12=\"ET\"),1,\"\")","v":""}]
[{"$f":"IF('Liste équipes'!J5=\"\",\"\",'Liste équipes'!J5)","v":"ORLEANS finale"},null,null,null,null,null,null,null,"",null,"",{"$f":"IF(AND(J13=\"X\",D13=\"J\"),1.5,IF(AND(J13=\"X\",D13=\"JF\"),2.5,IF(AND(J13=\"X\",D13=\"JS\"),2,IF(AND(J13=\"X\",D13=\"JFS\"),3,IF(AND(J13=\"X\",D13=\"F\",E13<5),1.5,IF(AND(J13=\"X\",D13=\"FET\",E13<5),1.5,IF(AND(J13=\"X\",D13=\"FS\",E13<5),2,IF(AND(J13=\"X\",D13=\"S\",E13<5),0.5,IF(AND(J13=\"X\",D13=\"SF\"),0.5,\"\")))))))))","v":""},null,"","","","","","","","",null,null,null,null,null,null,null,"",null,"",{"$f":"IF(AND(AD13=\"X\",X13=\"J\"),1.5,IF(AND(AD13=\"X\",X13=\"JF\"),2.5,IF(AND(AD13=\"X\",X13=\"JS\"),2,IF(AND(AD13=\"X\",X13=\"JFS\"),3,IF(AND(AD13=\"X\",X13=\"F\",Y13<5),1.5,IF(AND(AD13=\"X\",X13=\"FET\",Y13<5),1.5,IF(AND(AD13=\"X\",X13=\"FS\",Y13<5),2,IF(AND(AD13=\"X\",X13=\"S\",Y13<5),0.5,IF(AND(AD13=\"X\",X13=\"SF\"),0.5,\"\")))))))))","v":""},null,"","","","","","","",""]
[{"$f":"IF('Liste équipes'!J6=\"\",\"\",'Liste équipes'!J6)","v":"STRASBOURG finale"},null,null,null,null,null,null,null,"",null,"","",null,"","","","","","","","",null,null,null,null,null,null,null,"",null,"","",null,"","","","","","","",""]
[null,null,null,null,null,null,null,null,"",null,"","",null,"","","","","","","","",null,null,null,null,null,null,null,"",null,"","",null,"","","","","","","",""]
[null,null,null,null,null,null,null,null,"",null,"","",null,"","","","","","","","",null,null,null,null,null,null,null,"",null,"","",null,"","","","","","","",""]
[null,null,null,null,null,null,null,null,"",null,"","",null,"","","","","","","","",null,null,null,null,null,null,null,"",null,"","",null,"","","","","","","",""]
[null,null,null,null,null,null,null,null,"",null,"","",null,"","","","","","","","",null,null,null,null,null,null,null,"",null,"","",null,"","","","","","","",""]
[null,null,null,null,null,null,null,null,"",null,"","",null,"","","","","","","","",null,null,null,null,null,null,null,"",null,"","",null,"","","","","","","",""]
[null,null,null,null,null,null,null,null,"",null,"","",null,"","","","","","","","",null,null,null,null,null,null,null,"",null,"","",null,"","","","","","","",""]
[null,null,null,null,null,null,null,null,"",null,"","",null,"","","","","","","","",null,null,null,null,null,null,null,"",null,"","",null,"","","","","","","",""]
[null,null,null,null,null,null,null,null,"",null,"","",null,"","","","","","","","",null,null,null,null,null,null,null,"",null,"","",null,"","","","","","","",""]
[null,null,null,null,null,null,null,null,"",null,"","",null,"","","","","","","","",null,null,null,null,null,null,null,"",null,"","",null,"","","","","","","",""]
[null,null,null,null,null,null,null,null,"",null,"","",null,"","","","","","","","",null,null,null,null,null,null,null,"",null,"","",null,"","","","","","","",""]
[null,null,null,"  Nombre joueurs sur le terrain",null,null,{"$f":"IF(J25>5,\"\",\"OK\")","v":""},{"$f":"IF(R25>5,\"PAS OK\",\"\")","v":""},null,{"$f":"IF(L27=\"\",\"\",R25)","v":""},"Points en jeu","Points autorisés maxi 19",null,{"$f":"SUM(N11:N24)","v":0},0,0,0,0,0,0,0,null,null,"  Nombre joueurs sur le terrain",null,null,{"$f":"IF(AD25>5,\"\",\"OK\")","v":""},{"$f":"IF(AL25>5,\"PAS OK\",\"\")","v":""},null,{"$f":"IF(AF27=\"\",\"\",AL25)","v":""},"Points en jeu","Points autorisés maxi 19",null,{"$f":"SUM(AH11:AH24)","v":0},0,0,0,0,0,0,0]
[null,null,null,null,null,null,null,null,null,null,null,null,null,{"$f":"IF(N25=0,\"\",IF(N25=1,17,IF(N25=2,18.5,IF(N25=3,19,IF(N25>3,19,IF(N25>4,19,IF(N25>5,19,\"\")))))))","v":""},{"$f":"IF(O25=0,\"\",IF(O25=1,18,IF(O25=2,19,IF(O25=3,19,IF(O25=4,19,IF(O25=4,19,\"\"))))))","v":""},{"$f":"IF(P25=0,\"\",IF(P25=1,17,IF(P25=2,18.5,IF(P25=3,19,IF(P25=4,19,IF(P25=5,17.5,\"\"))))))","v":""},{"$f":"IF(Q25=0,\"\",IF(Q25=1,16,IF(Q25=2,16.5,IF(Q25=3,17,IF(Q25=4,17.5,IF(Q25=5,18,IF(Q25=6,18.5,IF(Q25=7,19,IF(Q25=8,19,IF(Q25=9,19,IF(Q25=10,19,IF(Q25=11,19,IF(Q25=12,19,\"\")))))))))))))","v":""},{"$f":"IF(AND(O26=16.5,P26=16),17.5,IF(AND(N26=15.5,P26=16),17,IF(AND(N26=15.5,O26=16.5),17.5,IF(AND(N26=16.5,P26=16),17.5,IF(AND(N25=2,O26=16.5),17.5,\"\")))))","v":""},null,null,null,null,null,null,null,null,null,null,null,null,null,null,null,{"$f":"IF(AH25=0,\"\",IF(AH25=1,17,IF(AH25=2,18.5,IF(AH25=3,19,IF(AH25>3,19,IF(AH25>4,19,IF(AH25>5,19,\"\")))))))","v":""},{"$f":"IF(AI25=0,\"\",IF(AI25=1,18,IF(AI25=2,19,IF(AI25=3,19,IF(AI25=4,19,IF(AI25=4,19,\"\"))))))","v":""},{"$f":"IF(AJ25=0,\"\",IF(AJ25=1,17,IF(AJ25=2,18.5,IF(AJ25=3,19,IF(AJ25=4,19,IF(AJ25=5,17.5,\"\"))))))","v":""},{"$f":"IF(AK25=0,\"\",IF(AK25=1,16,IF(AK25=2,16.5,IF(AK25=3,17,IF(AK25=4,17.5,IF(AK25=5,18,IF(AK25=6,18.5,IF(AK25=7,19,IF(AK25=8,19,IF(AK25=9,19,IF(AK25=10,19,IF(AK25=11,19,IF(AK25=12,19,\"\")))))))))))))","v":""},{"$f":"IF(AND(AI26=16.5,AJ26=16),17.5,IF(AND(AH26=15.5,AJ26=16),17,IF(AND(AH26=15.5,AI26=16.5),17.5,IF(AND(AH26=16.5,AJ26=16),17.5,IF(AND(AH25=2,AI26=16.5),17.5,\"\")))))","v":""}]
[null,null," ",{"$f":"IF(K27>L27,\"Trop de points en jeu\",\"\")","v":""},null,null,null,null,null,null,{"$f":"IF(O28>0,O28,\"\")","v":""},{"$f":"IF(O28=0,\"\",Q28)","v":""},null,{"$f":"SUM(N26)","v":0},{"$f":"SUM(O26)","v":0},{"$f":"SUM(P26)","v":0},{"$f":"SUM(Q26)","v":0},{"$f":"SUM(R26)","v":0},null,null,null,null," ",{"$f":"IF(AE27>AF27,\"Trop de points en jeu\",\"\")","v":""},null,null,null,null,null,null,{"$f":"IF(AI28>0,AI28,\"\")","v":""},{"$f":"IF(AI28=0,\"\",AK28)","v":""},null,{"$f":"SUM(AH26)","v":0},{"$f":"SUM(AI26)","v":0},{"$f":"SUM(AJ26)","v":0},{"$f":"SUM(AK26)","v":0},{"$f":"SUM(AL26)","v":0}]
[null,null,null,{"$f":"IF(S25>2,\"Trop de joueurs  valides inscrits sur la feuille\",\"\")","v":""},null,null,null,null,null,null,null,null,null,{"$f":"SUM(L11:L24)","v":0},{"$f":"SUM(K11:K24)","v":0},{"$f":"SUM(N28+15.5)","v":15.5},{"$f":"IF(P28>19,19,P28)","v":15.5},null,null,{"$f":"SUM(T30:T31)","v":0},null,null,null,{"$f":"IF(AM25>2,\"Trop de joueurs  valides inscrits sur la feuille\",\"\")","v":""},null,null,null,null,null,null,null,null,null,{"$f":"SUM(AF11:AF24)","v":0},{"$f":"SUM(AE11:AE24)","v":0},{"$f":"SUM(AH28+15.5)","v":15.5},{"$f":"IF(AJ28>19,19,AJ28)","v":15.5},null,null,{"$f":"SUM(AN30:AN31)","v":0}]
[]
[null,null,null,{"$f":"IF(T25>5,\" Pas OK. Trop de joueurs (5 points), vérifier la liste de l'équipe.\",IF(U25>4,\"Pas OK. Trop de joueurs étrangers en jeu (ET), vérifier la liste.\",\"\"))","v":""},null,null,null,null,null,null,null,null,null,{"$f":"IF(D11=\"ET\",1,\"\")","v":""},{"$f":"IF(D12=\"ET\",1,\"\")","v":""},{"$f":"IF(D13=\"ET\",1,\"\")","v":""},{"$f":"IF(D14=\"ET\",1,\"\")","v":""},{"$f":"IF(D15=\"ET\",1,\"\")","v":""},{"$f":"IF(D16=\"ET\",1,\"\")","v":""},{"$f":"SUM(N30:S30)","v":0},null,null,null,{"$f":"IF(AN25>5,\" Pas OK. Trop de joueurs (5 points), vérifier la liste de l'équipe.\",IF(AO25>4,\"Pas OK. Trop de joueurs étrangers en jeu (ET), vérifier la liste.\",\"\"))","v":""},null,null,null,null,null,null,null,null,null,{"$f":"IF(X11=\"ET\",1,\"\")","v":""},{"$f":"IF(X12=\"ET\",1,\"\")","v":""},{"$f":"IF(X13=\"ET\",1,\"\")","v":""},{"$f":"IF(X14=\"ET\",1,\"\")","v":""},{"$f":"IF(X15=\"ET\",1,\"\")","v":""},{"$f":"IF(X16=\"ET\",1,\"\")","v":""},{"$f":"SUM(AH30:AM30)","v":0}]
[null,null,null,null,null,null,null,null,null,null,null,null,null,{"$f":"IF(D17=\"ET\",1,\"\")","v":""},{"$f":"IF(D18=\"ET\",1,\"\")","v":""},{"$f":"IF(D19=\"ET\",1,\"\")","v":""},{"$f":"IF(D20=\"ET\",1,\"\")","v":""},{"$f":"IF(D21=\"ET\",1,\"\")","v":""},{"$f":"IF(D22=\"ET\",1,\"\")","v":""},{"$f":"SUM(N31:S31)","v":0},null,null,null,null,null,null,null,null,null,null,null,null,null,{"$f":"IF(X17=\"ET\",1,\"\")","v":""},{"$f":"IF(X18=\"ET\",1,\"\")","v":""},{"$f":"IF(X19=\"ET\",1,\"\")","v":""},{"$f":"IF(X20=\"ET\",1,\"\")","v":""},{"$f":"IF(X21=\"ET\",1,\"\")","v":""},{"$f":"IF(X22=\"ET\",1,\"\")","v":""},{"$f":"SUM(AH31:AM31)","v":0}]

{"sheet":"Liste équipes","index":12,"n_rows":13,"n_cols":11,"rows_kept":13,"cut":false,"hidden":false,"merged":[[0,10,1,10],[0,9,1,9],[0,2,0,3],[0,0,1,0],[0,1,1,1],[0,4,0,8]]}
["Elite Nationale Bastide Médical","Nationale 1 ","Nationale 2",null,"Nationale 3",null,null,null,null,"Finale Four Nationale 3","Finale Four Nationale 2"]
[null,null,"Poule A","Poule B","Poule A","Poule B","Poule C","Poule D","Poule E"]
["ENT CHALON DIJON BF",null,null,null,null,"AUXERRE"]
["HURRICANE92","ENT BORDEAUX BLANQUEFORT","BESANÇON","AMIENS","BERCK","BELFORT","ANGERS","PAYS BASQUE EUSKADI","HYERES 2","ANGLET finale","BLANQUEFORT finale"]
["HYERES","CAPSAAA","CAPPELLE LA GRANDE","AULNOYE","CAPSAAA 2","CHARLEVILLE","CHAMBRAY","ASMTH","LE CANNET 2","ORLEANS finale","CAMBRAI finale"]
["LANNION","ENT CAUSSADE PAVIE","LE PUY 2","CAMBRAI","CERGY PONTOISE","ENT CHALON DIJON 3","Ent LAVAL RENNES","ENT BORDEAUX BLANQUEFORT 2","MARSEILLE 2","STRASBOURG finale","LE PUY 2 finale"]
["LE CANNET","ENT CHALON DIJON BF 2","STRASBOURG 2","POLE NATIONAL","CHARLEVILLE","HAGUENAU","EQUEURDREVILLE","ENT CAUSSADE PAVIE 2",null,"YFFINIAC finale","LYON finale"]
["LE PUY","ENT LYON GUILHERAND","VANDOEUVRE","SAINT HERBLAIN","LILLE 2","MULHOUSE","LANNION 2","LA ROCHELLE"]
["LILLE","DOUAI",null,"YFFINIAC","ORLEANS","THIONVILLE","NIORT","MONTPELLIER"]
["MARSEILLE","FEURS",null,null,"PARIS BASKET","TROYES","QUIMPER","TOULOUSE 2"]
["MEAUX","MEAUX 2",null,null,"REIMS","VANDOEUVRE 2","SAINT POL DE LEON"]
["TOULOUSE","MEYLAN",null,null,"SUD OISE SPORTS ET HANDICAPS"]
[null,"STRASBOURG",null,null,"VALENCIENNES"]

{"sheet":"ENT CHALON DIJON BF","index":13,"n_rows":32,"n_cols":28,"rows_kept":32,"cut":false,"hidden":false,"merged":[[3,20,3,24],[3,25,3,29],[10,15,10,29],[18,17,19,19],[18,20,19,29],[8,18,9,19],[8,20,9,21],[8,22,9,23],[8,24,9,26],[8,27,9,29],[11,15,11,29],[12,15,14,16],[12,17,14,19],[15,15,17,16],[15,17,17,19],[27,0,27,4],[28,0,28,4],[29,0,29,4],[27,9,27,13],[18,15,18,16],[23,15,23,16],[19,15,19,16],[20,15,20,16],[21,15,21,16],[22,15,22,16],[1,0,2,0],[1,1,2,3],[1,9,1,13],[2,9,2,13],[8,15,8,17],[0,15,1,29],[5,18,7,19],[5,20,7,21],[5,22,7,23],[5,24,7,26],[5,27,7,29],[6,15,6,17],[7,15,7,17],[2,20,2,24],[2,25,2,29],[2,15,3,19]]}
["ENT CHALON DIJON BF",null,null,null,null,null,null,null,null,null,null,null,null,null,null,"Saison 2024-2025                                                                         Points en jeu"]
[null,"Joueur(es) participant à la rencontre",null,null,null,null,null,null,null,"Saisir votre liste complète en MAJUSCULES "]
[null,null,null,null,null,null,null,null,null,"Joueurs(es) qualifié(es) saison 2024 -2025",null,null,null,null,null,"Elite Nationale  Bastide Médical",null,null,null,null,"Sans carte spécifique",null,null,null,null,"Si cartes de couleurs"]
[null,null,null,null,null,null,null,null,null,null,null,null,null,null,null,null,null,null,null,null,"14,5 pts",null,null,null,null,"maxi 17,5 pts"]
["Statuts","Classif.","          Noms      /    Prénoms",null,"Numéros","ET","VALIDE",null,null,"Statuts","Classif.","          Noms      /    Prénoms",null,"Numéros"]
[null,null,null,null,null,{"$f":"IF(A6=\"ET\",1,\"\")","v":""},{"$f":"IF(B6=5,1,\"\")","v":""},null,null,null,2.5,"BAYLE","R",4,null,null,null,null,"Carte Verte",null,"Carte Jaune",null,"Carte Rose",null,"Nbr de joueurs/joueuses valides",null,null,"Non Sélectionnables en EDF (hors Fidet)"]
[null,null,null,null,null,{"$f":"IF(A7=\"ET\",1,\"\")","v":""},{"$f":"IF(B7=5,1,\"\")","v":""},null,null,"F",2,"ITA","V",5,null,"Avec une"]
[null,null,null,null,null,{"$f":"IF(A8=\"ET\",1,\"\")","v":""},{"$f":"IF(B8=5,1,\"\")","v":""},null,null,null,2.5,"CHALLAT","Z",6,null,"date de"]
[null,null,null,null,null,"","",null,null,"FID",4,"DIOUF","Y",7,null,"validité",null,null,"+  1",null,"+  2",null,"+  1,5",null,"1 sur la feuille et terrain",null,null,"Pas de limite"]
[null,null,null,null,null,"","",null,null,null,null,null,null,8]
[null,null,null,null,null,"","",null,null,"N",4,"DAHMANI","C",9,null,"Pour le calcul des points"]
[null,null,null,null,null,"","",null,null,null,3,"DARJOUR","K",10,null,"Inscrire dans la colonne de gauche le \"Statut\" des joueurs(es) de l'équipe"]
[null,null,null,null,null,"","",null,null,"ET",2.5,"ABOUD","Y",11,null,"J",null,"Pour les cartes Vertes",null,null,"Jeune joueur (U19 en Elite Nationale Bastide Médical)"]
[null,null,null,null,null,"","",null,null,"FID",3,"MILYUTIN","G",12,null,null,null,null,null,null,"Joueur débutant, sélectionnable en Equipe de France"]
[null,null,null,null,null,"","",null,null,null,3.5,"BOUGHANIA","AJ",13,null,null,null,null,null,null,"seulement (attention à la date de validité juqu'à 22 ans révolu)"]
[null,null,null,null,null,"","",null,null,null,null,null,null,14,null,"JF",null,"Pour les cartes Jaunes",null,null,"Jeune joueuse (U19 en Elite Nationale Bastide Médical)"]
[null,null,null,null,null,"","","",null,"ET",1.5,"GABRANOVS","K",15,null,null,null,null,null,null,"Joueuse débutante, sélectionnable en Equipe de France"]
[null,null,null,null,null,"","","",null,null,null,null,null,16,null,null,null,null,null,null,"seulement (attention à la date de validité juqu' à 22 ans révolu)"]
[null,null,null,null,null,"","","",null,"F",2,"NOLET","L",17,null,"F",null,"Pour les cartes roses",null,null,"Pour les femmes françaises ou étrangèress)                                             <5pts  (Bonus 1,5 pts)"]
[null,null,null,null,null,"","",null,null,null,4,"BOULEFA","Z",null,null,"FET"]
[null,null,null,null,null,"","","",null,null,4.5,"HUMBERT","M",null,null,"ET",null,"Pour un joueur étranger"]
[null,null,null,null,null,"","",null,null,null,null,null,null,null,null,"FID",null,"Pour un joueur fidèle"]
[null,null,null,null,null,"","",null,null,null,null,null,null,null,null,"VAL",null,"Joueurs valides (= 5 Pts)"]
[null,null,null,null,null,"","",null,null,null,4,"BOULEFA","Z",null,null,"R",null,"Tous joueurs révisables sans abattement (sauf valides)"]
[null,null,null,null,null,"","",null,null,null,4.5,"HUMBERT","M",null,null,null,null,"Pour tous joueurs sans symbole sur la carte de classification"]
[]
[]
[{"$f":"IF(G32<1,\"\",\"Joueurs ou joueuses valides de l'équipe\")","v":""}]
[{"$f":"IF(G32=0,\"\",IF(G32>1,\"Trop de valides sur le terrain (maximum 1)\",\"OK\"))","v":""}]
[]
[]
[null,null,null,null,null,{"$f":"SUM(F6:F29)","v":0},{"$f":"SUM(G6:G31)","v":0}]

{"sheet":"HURRICANE92","index":14,"n_rows":32,"n_cols":28,"rows_kept":32,"cut":false,"hidden":false,"merged":[[18,15,18,16],[19,15,19,16],[23,15,23,16],[21,15,21,16],[22,15,22,16],[20,15,20,16],[18,20,19,29],[18,17,19,19],[8,27,9,29],[5,18,7,19],[5,20,7,21],[5,22,7,23],[5,24,7,26],[8,24,9,26],[8,22,9,23],[8,20,9,21],[8,18,9,19],[12,17,14,19],[3,25,3,29],[6,15,6,17],[10,15,10,29],[15,15,17,16],[15,17,17,19],[12,15,14,16],[27,0,27,4],[28,0,28,4],[29,0,29,4],[11,15,11,29],[1,0,2,0],[1,1,2,3],[1,9,1,13],[2,9,2,13],[7,15,7,17],[8,15,8,17],[5,27,7,29],[0,15,1,29],[2,20,2,24],[2,25,2,29],[2,15,3,19],[3,20,3,24]]}
["HURRICANE92 - GENNEVILLIERS",null,null,null,null,null,null,null,null,null,null,null,null,null,null,"Saison 2024-2025                                                                         Points en jeu"]
[null,"Joueur(es) participant à la rencontre",null,null,null,null,null,null,null,"Saisir votre liste complète en MAJUSCULES "]
[null,null,null,null,null,null,null,null,null,"Joueurs(es) qualifié(es) saison 2024 -2025",null,null,null,null,null,"Elite Nationale  Bastide Médical",null,null,null,null,"Sans carte spécifique",null,null,null,null,"Si cartes de couleurs"]
[null,null,null,null,null,null,null,null,null,null,null,null,null,null,null,null,null,null,null,null,"14,5 pts",null,null,null,null,"maxi 17,5 pts"]
["Statuts","Classif.","          Noms      /    Prénoms",null,"Numéros","ET","VALIDE",null,null,"Statuts","Classif.","          Noms      /    Prénoms",null,"Numéros"]
[null,null,null,null,null,{"$f":"IF(A6=\"ET\",1,\"\")","v":""},{"$f":"IF(B6=5,1,\"\")","v":""},null,null,null,null,null,null,0,null,null,null,null,"Carte Verte",null,"Carte Jaune",null,"Carte Rose",null,"Nbr de joueurs/joueuses valides",null,null,"Non Sélectionnables en EDF (hors Fidet)"]
[null,null,null,null,null,{"$f":"IF(A7=\"ET\",1,\"\")","v":""},{"$f":"IF(B7=5,1,\"\")","v":""},null,null,null,null,null,null,4,null,"Avec une"]
[null,null,null,null,null,{"$f":"IF(A8=\"ET\",1,\"\")","v":""},{"$f":"IF(B8=5,1,\"\")","v":""},null,null,null,null,null,null,5,null,"date de"]
[null,null,null,null,null,"","",null,null,null,null,null,null,6,null,"validité",null,null,"+  1",null,"+  2",null,"+  1,5",null,"1 sur la feuille et terrain",null,null,"Pas de limite"]
[null,null,null,null,null,"","",null,null,"F",2.5,"CARLIEZ","M",7]
[null,null,null,null,null,"","",null,null,null,null,null,null,8,null,"Pour le calcul des points"]
[null,null,null,null,null,"","",null,null,null,null,null,null,9,null,"Inscrire dans la colonne de gauche le \"Statut\" des joueur(es) de l'équipe"]
[null,null,null,null,null,"","",null,null,null,2,"ATIOGBE","S",10,null,"J",null,"Pour les cartes Vertes",null,null,"Jeune joueur (U19 en Elite Nationale Bastide Médical)"]
[null,null,null,null,null,"","",null,null,null,2,"KOTI-BINGO","P",11,null,null,null,null,null,null,"Joueur débutant, sélectionnable en Equipe de France"]
[null,null,null,null,null,"","",null,null,null,null,null,null,12,null,null,null,null,null,null,"seulement (attention à la date de validité juqu'à 22 ans révolu)"]
[null,null,null,null,null,"","",null,null,null,4.5,"FALEMPE","A",13,null,"JF",null,"Pour les cartes Jaunes",null,null,"Jeune joueuse (U19 en Elite Nationale Bastide Médical)"]
[null,null,null,null,null,"","","",null,null,null,null,null,14,null,null,null,null,null,null,"Joueuse débutante, sélectionnable en Equipe de France"]
[null,null,null,null,null,"","","",null,null,1,"BRAHMI","O",15,null,null,null,null,null,null,"seulement (attention à la date de validité juqu' à 22 ans révolu)"]
[null,null,null,null,null,"","","",null,null,null,null,null,21,null,"F",null,"Pour les cartes roses",null,null,"Pour les femmes françaises ou étrangèress)                                             <5pts  (Bonus 1,5 pts)"]
[null,null,null,null,null,"","",null,null,null,3,"KONATE","B",23,null,"FET"]
[null,null,null,null,null,"","","",null,"ET",4,"REVILLA","A",24,null,"ET",null,"Pour un joueur étranger"]
[null,null,null,null,null,"","",null,null,"ET",4.5,"MONCRIEFF","B",25,null,"FID",null,"Pour un joueur fidèle"]
[null,null,null,null,null,"","",null,null,null,1,"GUIRASSY","I",92,null,"VAL",null,"Joueurs valides (= 5 Pts)"]
[null,null,null,null,null,"","",null,null,"ET",2.5,"AL DEEB","F",99,null,"R",null,"Tous joueurs révisables sans abattement (sauf valides)"]
[null,null,null,null,null,"","",null,null,null,null,null,null,null,null,null,null,"Pour tous joueurs sans symbole sur la carte de classification"]
[]
[]
[{"$f":"IF(G32<1,\"\",\"Joueurs ou joueuses valides de l'équipe\")","v":""}]
[{"$f":"IF(G32=0,\"\",IF(G32>1,\"Trop de valides sur le terrain (maximum 1)\",\"OK\"))","v":""}]
[]
[]
[null,null,null,null,null,{"$f":"SUM(F6:F29)","v":0},{"$f":"SUM(G6:G31)","v":0}]

{"sheet":"HYERES","index":15,"n_rows":32,"n_cols":28,"rows_kept":32,"cut":false,"hidden":false,"merged":[[22,15,22,16],[23,15,23,16],[5,27,7,29],[6,15,6,17],[7,15,7,17],[8,15,8,17],[8,18,9,19],[8,20,9,21],[8,22,9,23],[8,24,9,26],[8,27,9,29],[15,15,17,16],[15,17,17,19],[18,15,18,16],[18,17,19,19],[18,20,19,29],[0,15,1,29],[2,15,3,19],[2,20,2,24],[2,25,2,29],[3,20,3,24],[3,25,3,29],[19,15,19,16],[20,15,20,16],[21,15,21,16],[5,18,7,19],[5,20,7,21],[5,22,7,23],[5,24,7,26],[10,15,10,29],[11,15,11,29],[12,15,14,16],[12,17,14,19],[1,9,1,13],[1,1,2,3],[1,0,2,0],[2,9,2,13],[29,0,29,4],[28,0,28,4],[27,0,27,4]]}
["HYERES BF",null,null,null,null,null,null,null,null,null,null,null,null,null,null,"Saison 2024-2025                                                                         Points en jeu"]
[null,"Joueur(es) participant à la rencontre",null,null,null,null,null,null,null,"Saisir votre liste complète en MAJUSCULES "]
[null,null,null,null,null,null,null,null,null,"Joueurs(es) qualifié(es) saison 2024 -2025",null,null,null,null,null,"Elite Nationale  Bastide Médical",null,null,null,null,"Sans carte spécifique",null,null,null,null,"Si cartes de couleurs"]
[null,null,null,null,null,null,null,null,null,null,null,null,null,null,null,null,null,null,null,null,"14,5 pts",null,null,null,null,"maxi 17,5 pts"]
["Statuts","Classif.","          Noms      /    Prénoms",null,"Numéros","ET","VALIDE",null,null,"Statuts","Classif.","          Noms      /    Prénoms",null,"Numéros"]
[null,null,null,null,null,{"$f":"IF(A6=\"ET\",1,\"\")","v":""},{"$f":"IF(B6=5,1,\"\")","v":""},null,null,null,1,"ADIASSE","G",4,null,null,null,null,"Carte Verte",null,"Carte Jaune",null,"Carte Rose",null,"Nbr de joueurs/joueuses valides",null,null,"Non Sélectionnables en EDF (hors Fidet)"]
[null,null,null,null,null,{"$f":"IF(A7=\"ET\",1,\"\")","v":""},{"$f":"IF(B7=5,1,\"\")","v":""},null,null,null,1,"LAURERI","J",5,null,"Avec une"]
[null,null,null,null,null,{"$f":"IF(A8=\"ET\",1,\"\")","v":""},{"$f":"IF(B8=5,1,\"\")","v":""},null,null,null,null,null,null,6,null,"date de"]
[null,null,null,null,null,"","",null,null,null,1.5,"ERRAOUI","S",7,null,"validité",null,null,"+  1",null,"+  2",null,"+  1,5",null,"1 sur la feuille et terrain",null,null,"Pas de limite"]
[null,null,null,null,null,"","",null,null,null,3,"HERMOSILLA","A",8]
[null,null,null,null,null,"","",null,null,null,4.5,"JOUANSERRE","N",9,null,"Pour le calcul des points"]
[null,null,null,null,null,"","",null,null,null,2.5,"NUTTIN","P",10,null,"Inscrire dans la colonne de gauche le \"Statut\" des joueurs(es) de l'équipe"]
[null,null,null,null,null,"","",null,null,null,2.5,"HARDOUIN","L",11,null,"J",null,"Pour les cartes Vertes",null,null,"Jeune joueur (U19 en Elite Nationale Bastide Médical)"]
[null,null,null,null,null,"","",null,null,null,3,"LERAY","D",12,null,null,null,null,null,null,"Joueur débutant, sélectionnable en Equipe de France"]
[null,null,null,null,null,"","",null,null,null,4,"TRAORE","M",13,null,null,null,null,null,null,"seulement (attention à la date de validité juqu'à 22 ans révolu)"]
[null,null,null,null,null,"","",null,null,"ET",3,"DIENE","S",14,null,"JF",null,"Pour les cartes Jaunes",null,null,"Jeune joueuse (U19 en Elite Nationale Bastide Médical)"]
[null,null,null,null,null,"","","",null,null,2,"DURAN","J",15,null,null,null,null,null,null,"Joueuse débutante, sélectionnable en Equipe de France"]
[null,null,null,null,null,"","","",null,null,null,null,null,null,null,null,null,null,null,null,"seulement (attention à la date de validité juqu' à 22 ans révolu)"]
[null,null,null,null,null,"","","",null,null,null,null,null,null,null,"F",null,"Pour les cartes roses",null,null,"Pour les femmes françaises ou étrangèress)                                             <5pts  (Bonus 1,5 pts)"]
[null,null,null,null,null,"","",null,null,null,1,"SOULIE","P",null,null,"FET"]
[null,null,null,null,null,"","","",null,null,null,null,null,null,null,"ET",null,"Pour un joueur étranger"]
[null,null,null,null,null,"","",null,null,null,null,null,null,null,null,"FID",null,"Pour un joueur fidèle"]
[null,null,null,null,null,"","",null,null,null,null,null,null,null,null,"VAL",null,"Joueurs valides (= 5 Pts)"]
[null,null,null,null,null,"","",null,null,null,null,null,null,null,null,"R",null,"Tous joueurs révisables sans abattement (sauf valides)"]
[null,null,null,null,null,"","",null,null,null,null,null,null,null,null,null,null,"Pour tous joueurs sans symbole sur la carte de classification"]
[]
[]
[{"$f":"IF(G32<1,\"\",\"Joueurs ou joueuses valides de l'équipe\")","v":""}]
[{"$f":"IF(G32=0,\"\",IF(G32>1,\"Trop de valides sur le terrain (maximum 1)\",\"OK\"))","v":""}]
[]
[]
[null,null,null,null,null,{"$f":"SUM(F6:F29)","v":0},{"$f":"SUM(G6:G31)","v":0}]

{"sheet":"LANNION","index":16,"n_rows":32,"n_cols":28,"rows_kept":32,"cut":false,"hidden":false,"merged":[[10,15,10,29],[11,15,11,29],[12,15,14,16],[12,17,14,19],[15,15,17,16],[15,17,17,19],[8,20,9,21],[8,22,9,23],[8,24,9,26],[8,27,9,29],[5,18,7,19],[5,20,7,21],[5,22,7,23],[5,24,7,26],[1,0,2,0],[1,1,2,3],[1,9,1,13],[2,9,2,13],[18,15,18,16],[0,15,1,29],[2,15,3,19],[2,20,2,24],[2,25,2,29],[3,20,3,24],[3,25,3,29],[5,27,7,29],[6,15,6,17],[7,15,7,17],[8,15,8,17],[8,18,9,19],[29,0,29,4],[18,17,19,19],[18,20,19,29],[19,15,19,16],[27,0,27,4],[28,0,28,4],[20,15,20,16],[21,15,21,16],[22,15,22,16],[23,15,23,16]]}
["CTH LANNION",null,null,null,null,null,null,null,null,null,null,null,null,null,null,"Saison 2024-2025                                                                         Points en jeu"]
[null,"Joueur(es) participant à la rencontre",null,null,null,null,null,null,null,"Saisir votre liste complète en MAJUSCULES "]
[null,null,null,null,null,null,null,null,null,"Joueurs(es) qualifié(es) saison 2024 -2025",null,null,null,null,null,"Elite Nationale  Bastide Médical",null,null,null,null,"Sans carte spécifique",null,null,null,null,"Si cartes de couleurs"]
[null,null,null,null,null,null,null,null,null,null,null,null,null,null,null,null,null,null,null,null,"14,5 pts",null,null,null,null,"maxi 17,5 pts"]
["Statuts","Classif.","          Noms      /    Prénoms",null,"Numéros","ET","VALIDE",null,null,"Statuts","Classif.","          Noms      /    Prénoms",null,"Numéros"]
[null,null,null,null,null,{"$f":"IF(A6=\"ET\",1,\"\")","v":""},{"$f":"IF(B6=5,1,\"\")","v":""},null,null,null,null,null,null,4,null,null,null,null,"Carte Verte",null,"Carte Jaune",null,"Carte Rose",null,"Nbr de joueurs/joueuses valides",null,null,"Non Sélectionnables en EDF (hors Fidet)"]
[null,null,null,null,null,{"$f":"IF(A7=\"ET\",1,\"\")","v":""},{"$f":"IF(B7=5,1,\"\")","v":""},null,null,"ET",1,"SUTJAI","C",5,null,"Avec une"]
[null,null,null,null,null,{"$f":"IF(A8=\"ET\",1,\"\")","v":""},{"$f":"IF(B8=5,1,\"\")","v":""},null,null,"N",2,"CAROFF","C",6,null,"date de"]
[null,null,null,null,null,"","",null,null,"F",1,"ETAVARD-GLEMP","A",7,null,"validité",null,null,"+  1",null,"+  2",null,"+  1,5",null,"1 sur la feuille et terrain",null,null,"Pas de limite"]
[null,null,null,null,null,"","",null,null,null,null,null,null,8]
[null,null,null,null,null,"","",null,null,null,null,null,null,9,null,"Pour le calcul des points"]
[null,null,null,null,null,"","",null,null,"ET",1,"ABBAD","A",10,null,"Inscrire dans la colonne de gauche le \"Statut\" des joueurs(es) de l'équipe"]
[null,null,null,null,null,"","",null,null,null,null,null,null,11,null,"J",null,"Pour les cartes Vertes",null,null,"Jeune joueur (U19 en Elite Nationale Bastide Médical)"]
[null,null,null,null,null,"","",null,null,null,null,null,null,12,null,null,null,null,null,null,"Joueur débutant, sélectionnable en Equipe de France"]
[null,null,null,null,null,"","",null,null,"N",4,"ETAVARD","F",13,null,null,null,null,null,null,"seulement (attention à la date de validité juqu'à 22 ans révolu)"]
[null,null,null,null,null,"","",null,null,null,null,null,null,14,null,"JF",null,"Pour les cartes Jaunes",null,null,"Jeune joueuse (U19 en Elite Nationale Bastide Médical)"]
[null,null,null,null,null,"","","",null,"FID",4,"NDIAYE","I",15,null,null,null,null,null,null,"Joueuse débutante, sélectionnable en Equipe de France"]
[null,null,null,null,null,"","","",null,null,null,null,null,16,null,null,null,null,null,null,"seulement (attention à la date de validité juqu' à 22 ans révolu)"]
[null,null,null,null,null,"","","",null,null,null,null,null,17,null,"F",null,"Pour les cartes roses",null,null,"Pour les femmes françaises ou étrangèress)                                             <5pts  (Bonus 1,5 pts)"]
[null,null,null,null,null,"","",null,null,"ET",1.5,"KAOBOO","A",18,null,"FET"]
[null,null,null,null,null,"","","",null,null,null,null,null,19,null,"ET",null,"Pour un joueur étranger"]
[null,null,null,null,null,"","",null,null,"F",4.5,"BLAIS","M",20,null,"FID",null,"Pour un joueur fidèle"]
[null,null,null,null,null,"","",null,null,"ET",4,"BADACHE","H",21,null,"VAL",null,"Joueurs valides (= 5 Pts)"]
[null,null,null,null,null,"","",null,null,"ET",3.5,"CHAOTRAKARN","N",24,null,"R",null,"Tous joueurs révisables sans abattement (sauf valides)"]
[null,null,null,null,null,"","",null,null,null,null,null,null,null,null,null,null,"Pour tous joueurs sans symbole sur la carte de classification"]
[]
[]
[{"$f":"IF(G32<1,\"\",\"Joueurs ou joueuses valides de l'équipe\")","v":""}]
[{"$f":"IF(G32=0,\"\",IF(G32>1,\"Trop de valides sur le terrain (maximum 1)\",\"OK\"))","v":""}]
[]
[]
[null,null,null,null,null,{"$f":"SUM(F6:F29)","v":0},{"$f":"SUM(G6:G31)","v":0}]

{"sheet":"LE CANNET","index":17,"n_rows":32,"n_cols":28,"rows_kept":32,"cut":false,"hidden":false,"merged":[[10,15,10,29],[11,15,11,29],[12,15,14,16],[12,17,14,19],[15,15,17,16],[15,17,17,19],[8,20,9,21],[8,22,9,23],[8,24,9,26],[8,27,9,29],[5,18,7,19],[5,20,7,21],[5,22,7,23],[5,24,7,26],[1,0,2,0],[1,1,2,3],[1,9,1,13],[2,9,2,13],[18,15,18,16],[0,15,1,29],[2,15,3,19],[2,20,2,24],[2,25,2,29],[3,20,3,24],[3,25,3,29],[5,27,7,29],[6,15,6,17],[7,15,7,17],[8,15,8,17],[8,18,9,19],[29,0,29,4],[18,17,19,19],[18,20,19,29],[19,15,19,16],[27,0,27,4],[28,0,28,4],[20,15,20,16],[21,15,21,16],[22,15,22,16],[23,15,23,16]]}
["HORNETS LE CANNET",null,null,null,null,null,null,null,null,null,null,null,null,null,null,"Saison 2024-2025                                                                         Points en jeu"]
[null,"Joueur(es) participant à la rencontre",null,null,null,null,null,null,null,"Saisir votre liste complète en MAJUSCULES "]
[null,null,null,null,null,null,null,null,null,"Joueurs(es) qualifié(es) saison 2024 -2025",null,null,null,null,null,"Elite Nationale  Bastide Médical",null,null,null,null,"Sans carte spécifique",null,null,null,null,"Si cartes de couleurs"]
[null,null,null,null,null,null,null,null,null,null,null,null,null,null,null,null,null,null,null,null,"14,5 pts",null,null,null,null,"maxi 17,5 pts"]
["Statuts","Classif.","          Noms      /    Prénoms",null,"Numéros","ET","VALIDE",null,null,"Statuts","Classif.","          Noms      /    Prénoms",null,"Numéros"]
[null,null,null,null,null,{"$f":"IF(A6=\"ET\",1,\"\")","v":""},{"$f":"IF(B6=5,1,\"\")","v":""},null,null,null,2,"LEBLANC","W",4,null,null,null,null,"Carte Verte",null,"Carte Jaune",null,"Carte Rose",null,"Nbr de joueurs/joueuses valides",null,null,"Non Sélectionnables en EDF (hors Fidet)"]
[null,null,null,null,null,{"$f":"IF(A7=\"ET\",1,\"\")","v":""},{"$f":"IF(B7=5,1,\"\")","v":""},null,null,null,null,null,null,5,null,"Avec une"]
[null,null,null,null,null,{"$f":"IF(A8=\"ET\",1,\"\")","v":""},{"$f":"IF(B8=5,1,\"\")","v":""},null,null,"ET",1.5,"MACEK","A",6,null,"date de"]
[null,null,null,null,null,"","",null,null,null,1,"KELLER","S",7,null,"validité",null,null,"+  1",null,"+  2",null,"+  1,5",null,"1 sur la feuille et terrain",null,null,"Pas de limite"]
[null,null,null,null,null,"","",null,null,null,3.5,"MAKAMBO","L",8]
[null,null,null,null,null,"","",null,null,null,3,"ROA","L",9,null,"Pour le calcul des points"]
[null,null,null,null,null,"","",null,null,"N",2.5,"MEKKAZNI","K",10,null,"Inscrire dans la colonne de gauche le \"Statut\" des joueurs(es) de l'équipe"]
[null,null,null,null,null,"","",null,null,null,null,null,null,11,null,"J",null,"Pour les cartes Vertes",null,null,"Jeune joueur (U19 en Elite Nationale Bastide Médical)"]
[null,null,null,null,null,"","",null,null,null,null,null,null,12,null,null,null,null,null,null,"Joueur débutant, sélectionnable en Equipe de France"]
[null,null,null,null,null,"","",null,null,null,null,null,null,13,null,null,null,null,null,null,"seulement (attention à la date de validité juqu'à 22 ans révolu)"]
[null,null,null,null,null,"","",null,null,null,1,"DELATTRE","T",14,null,"JF",null,"Pour les cartes Jaunes",null,null,"Jeune joueuse (U19 en Elite Nationale Bastide Médical)"]
[null,null,null,null,null,"","","",null,null,null,null,null,15,null,null,null,null,null,null,"Joueuse débutante, sélectionnable en Equipe de France"]
[null,null,null,null,null,"","","",null,null,null,null,null,16,null,null,null,null,null,null,"seulement (attention à la date de validité juqu' à 22 ans révolu)"]
[null,null,null,null,null,"","","",null,null,3.5,"BELAID","H",17,null,"F",null,"Pour les cartes roses",null,null,"Pour les femmes françaises ou étrangèress)                                             <5pts  (Bonus 1,5 pts)"]
[null,null,null,null,null,"","",null,null,"ET",2.5,"FERNANDEZ","Y",20,null,"FET"]
[null,null,null,null,null,"","","",null,null,null,null,null,21,null,"ET",null,"Pour un joueur étranger"]
[null,null,null,null,null,"","",null,null,"ET",2.5,"TOSCANO","Y",22,null,"FID",null,"Pour un joueur fidèle"]
[null,null,null,null,null,"","",null,null,null,3,"CARLIER","C",25,null,"VAL",null,"Joueurs valides (= 5 Pts)"]
[null,null,null,null,null,"","",null,null,null,null,null,null,30,null,"R",null,"Tous joueurs révisables sans abattement (sauf valides)"]
[null,null,null,null,null,"","",null,null,"ET",3.5,"MAATAOUI","R",99,null,null,null,"Pour tous joueurs sans symbole sur la carte de classification"]
[]
[]
[{"$f":"IF(G32<1,\"\",\"Joueurs ou joueuses valides de l'équipe\")","v":""}]
[{"$f":"IF(G32=0,\"\",IF(G32>1,\"Trop de valides sur le terrain (maximum 1)\",\"OK\"))","v":""}]
[]
[]
[null,null,null,null,null,{"$f":"SUM(F6:F29)","v":0},{"$f":"SUM(G6:G31)","v":0}]

{"sheet":"LE PUY","index":18,"n_rows":32,"n_cols":28,"rows_kept":32,"cut":false,"hidden":false,"merged":[[10,15,10,29],[11,15,11,29],[12,15,14,16],[12,17,14,19],[15,15,17,16],[15,17,17,19],[8,20,9,21],[8,22,9,23],[8,24,9,26],[8,27,9,29],[5,18,7,19],[5,20,7,21],[5,22,7,23],[5,24,7,26],[1,0,2,0],[1,1,2,3],[1,9,1,13],[2,9,2,13],[18,15,18,16],[0,15,1,29],[2,15,3,19],[2,20,2,24],[2,25,2,29],[3,20,3,24],[3,25,3,29],[5,27,7,29],[6,15,6,17],[7,15,7,17],[8,15,8,17],[8,18,9,19],[29,0,29,4],[18,17,19,19],[18,20,19,29],[19,15,19,16],[27,0,27,4],[28,0,28,4],[20,15,20,16],[21,15,21,16],[22,15,22,16],[23,15,23,16]]}
["LES AIGLES DU VELAY",null,null,null,null,null,null,null,null,null,null,null,null,null,null,"Saison 2024-2025                                                                         Points en jeu"]
[null,"Joueur(es) participant à la rencontre",null,null,null,null,null,null,null,"Saisir votre liste complète en MAJUSCULES "]
[null,null,null,null,null,null,null,null,null,"Joueurs(es) qualifié(es) saison 2024 -2025",null,null,null,null,null,"Elite Nationale  Bastide Médical",null,null,null,null,"Sans carte spécifique",null,null,null,null,"Si cartes de couleurs"]
[null,null,null,null,null,null,null,null,null,null,null,null,null,null,null,null,null,null,null,null,"14,5 pts",null,null,null,null,"maxi 17,5 pts"]
["Statuts","Classif.","          Noms      /    Prénoms",null,"Numéros","ET","VALIDE",null,null,"Statuts","Classif.","          Noms      /    Prénoms",null,"Numéros"]
[null,null,null,null,null,{"$f":"IF(A6=\"ET\",1,\"\")","v":""},{"$f":"IF(B6=5,1,\"\")","v":""},null,null,"ET",1,"LERTANACHAI","T",1,null,null,null,null,"Carte Verte",null,"Carte Jaune",null,"Carte Rose",null,"Nbr de joueurs/joueuses valides",null,null,"Non Sélectionnables en EDF (hors Fidet)"]
[null,null,null,null,null,{"$f":"IF(A7=\"ET\",1,\"\")","v":""},{"$f":"IF(B7=5,1,\"\")","v":""},null,null,"ET",2,"BEGINSKIS","R",2,null,"Avec une"]
[null,null,null,null,null,{"$f":"IF(A8=\"ET\",1,\"\")","v":""},{"$f":"IF(B8=5,1,\"\")","v":""},null,null,null,null,null,null,3,null,"date de"]
[null,null,null,null,null,"","",null,null,null,null,null,null,4,null,"validité",null,null,"+  1",null,"+  2",null,"+  1,5",null,"1 sur la feuille et terrain",null,null,"Pas de limite"]
[null,null,null,null,null,"","",null,null,null,null,null,null,5]
[null,null,null,null,null,"","",null,null,"J",2,"PERSET","Y",6,null,"Pour le calcul des points"]
[null,null,null,null,null,"","",null,null,"ET",1.5,"DALLAIRE","V",7,null,"Inscrire dans la colonne de gauche le \"Statut\" des joueurs(es) de l'équipe"]
[null,null,null,null,null,"","",null,null,null,null,null,null,8,null,"J",null,"Pour les cartes Vertes",null,null,"Jeune joueur (U19 en Elite Nationale Bastide Médical)"]
[null,null,null,null,null,"","",null,null,"ET",4.5,"HIGGINS","C",9,null,null,null,null,null,null,"Joueur débutant, sélectionnable en Equipe de France"]
[null,null,null,null,null,"","",null,null,null,null,null,null,10,null,null,null,null,null,null,"seulement (attention à la date de validité juqu'à 22 ans révolu)"]
[null,null,null,null,null,"","",null,null,null,3,"MARIANI","A",11,null,"JF",null,"Pour les cartes Jaunes",null,null,"Jeune joueuse (U19 en Elite Nationale Bastide Médical)"]
[null,null,null,null,null,"","","",null,"ET",4,"GHARIBLOO","M",12,null,null,null,null,null,null,"Joueuse débutante, sélectionnable en Equipe de France"]
[null,null,null,null,null,"","","",null,"ET",3.5,"ZIDI","O",13,null,null,null,null,null,null,"seulement (attention à la date de validité juqu' à 22 ans révolu)"]
[null,null,null,null,null,"","","",null,null,null,null,null,14,null,"F",null,"Pour les cartes roses",null,null,"Pour les femmes françaises ou étrangèress)                                             <5pts  (Bonus 1,5 pts)"]
[null,null,null,null,null,"","",null,null,null,null,null,null,15,null,"FET"]
[null,null,null,null,null,"","","",null,null,null,null,null,16,null,"ET",null,"Pour un joueur étranger"]
[null,null,null,null,null,"","",null,null,null,null,null,null,17,null,"FID",null,"Pour un joueur fidèle"]
[null,null,null,null,null,"","",null,null,null,null,null,null,18,null,"VAL",null,"Joueurs valides (= 5 Pts)"]
[null,null,null,null,null,"","",null,null,null,null,null,null,19,null,"R",null,"Tous joueurs révisables sans abattement (sauf valides)"]
[null,null,null,null,null,"","",null,null,"ET",3,"AHMADI",null,30,null,null,null,"Pour tous joueurs sans symbole sur la carte de classification"]
[]
[]
[{"$f":"IF(G32<1,\"\",\"Joueurs ou joueuses valides de l'équipe\")","v":""}]
[{"$f":"IF(G32=0,\"\",IF(G32>1,\"Trop de valides sur le terrain (maximum 1)\",\"OK\"))","v":""}]
[]
[]
[null,null,null,null,null,{"$f":"SUM(F6:F29)","v":0},{"$f":"SUM(G6:G31)","v":0}]

{"sheet":"LILLE","index":19,"n_rows":32,"n_cols":28,"rows_kept":32,"cut":false,"hidden":false,"merged":[[10,15,10,29],[11,15,11,29],[12,15,14,16],[12,17,14,19],[15,15,17,16],[15,17,17,19],[8,20,9,21],[8,22,9,23],[8,24,9,26],[8,27,9,29],[5,18,7,19],[5,20,7,21],[5,22,7,23],[5,24,7,26],[1,0,2,0],[1,1,2,3],[1,9,1,13],[2,9,2,13],[18,15,18,16],[0,15,1,29],[2,15,3,19],[2,20,2,24],[2,25,2,29],[3,20,3,24],[3,25,3,29],[5,27,7,29],[6,15,6,17],[7,15,7,17],[8,15,8,17],[8,18,9,19],[29,0,29,4],[18,17,19,19],[18,20,19,29],[19,15,19,16],[27,0,27,4],[28,0,28,4],[20,15,20,16],[21,15,21,16],[22,15,22,16],[23,15,23,16]]}
["LUC LILLE",null,null,null,null,null,null,null,null,null,null,null,null,null,null,"Saison 2024-2025                                                                         Points en jeu"]
[null,"Joueur(es) participant à la rencontre",null,null,null,null,null,null,null,"Saisir votre liste complète en MAJUSCULES "]
[null,null,null,null,null,null,null,null,null,"Joueurs(es) qualifié(es) saison 2024 -2025",null,null,null,null,null,"Elite Nationale  Bastide Médical",null,null,null,null,"Sans carte spécifique",null,null,null,null,"Si cartes de couleurs"]
[null,null,null,null,null,null,null,null,null,null,null,null,null,null,null,null,null,null,null,null,"14,5 pts",null,null,null,null,"maxi 17,5 pts"]
["Statuts","Classif.","          Noms      /    Prénoms",null,"Numéros","ET","VALIDE",null,null,"Statuts","Classif.","          Noms      /    Prénoms",null,"Numéros"]
[null,null,null,null,null,{"$f":"IF(A6=\"ET\",1,\"\")","v":""},{"$f":"IF(B6=5,1,\"\")","v":""},null,null,"FET",1,"OUKHANTEJJI","D",4,null,null,null,null,"Carte Verte",null,"Carte Jaune",null,"Carte Rose",null,"Nbr de joueurs/joueuses valides",null,null,"Non Sélectionnables en EDF (hors Fidet)"]
[null,null,null,null,null,{"$f":"IF(A7=\"ET\",1,\"\")","v":""},{"$f":"IF(B7=5,1,\"\")","v":""},null,null,null,2.5,"OULINI","M",5,null,"Avec une"]
[null,null,null,null,null,{"$f":"IF(A8=\"ET\",1,\"\")","v":""},{"$f":"IF(B8=5,1,\"\")","v":""},null,null,"ET",2,"MINTEN","P",6,null,"date de"]
[null,null,null,null,null,"","",null,null,"ET",4,"CHIRINOS-COLINA","E",7,null,"validité",null,null,"+  1",null,"+  2",null,"+  1,5",null,"1 sur la feuille et terrain",null,null,"Pas de limite"]
[null,null,null,null,null,"","",null,null,null,null,null,null,8]
[null,null,null,null,null,"","",null,null,null,null,null,null,9,null,"Pour le calcul des points"]
[null,null,null,null,null,"","",null,null,"ET",3.5,"BENYAHI","A",10,null,"Inscrire dans la colonne de gauche le \"Statut\" des joueurs(es) de l'équipe"]
[null,null,null,null,null,"","",null,null,"ET",1,"MOUJOUD","M",11,null,"J",null,"Pour les cartes Vertes",null,null,"Jeune joueur (U19 en Elite Nationale Bastide Médical)"]
[null,null,null,null,null,"","",null,null,null,4.5,"BOULET","D",12,null,null,null,null,null,null,"Joueur débutant, sélectionnable en Equipe de France"]
[null,null,null,null,null,"","",null,null,null,null,null,null,13,null,null,null,null,null,null,"seulement (attention à la date de validité juqu'à 22 ans révolu)"]
[null,null,null,null,null,"","",null,null,"ET",2.5,"EL MOUSSATI","F",14,null,"JF",null,"Pour les cartes Jaunes",null,null,"Jeune joueuse (U19 en Elite Nationale Bastide Médical)"]
[null,null,null,null,null,"","","",null,"FID",4,"BADER","S",15,null,null,null,null,null,null,"Joueuse débutante, sélectionnable en Equipe de France"]
[null,null,null,null,null,"","","",null,null,4,"GOUZAVI","C",16,null,null,null,null,null,null,"seulement (attention à la date de validité juqu' à 22 ans révolu)"]
[null,null,null,null,null,"","","",null,null,null,null,null,17,null,"F",null,"Pour les cartes roses",null,null,"Pour les femmes françaises ou étrangèress)                                             <5pts  (Bonus 1,5 pts)"]
[null,null,null,null,null,"","",null,null,null,null,null,null,18,null,"FET"]
[null,null,null,null,null,"","","",null,"ET",4.5,"BOTERBERG","l",19,null,"ET",null,"Pour un joueur étranger"]
[null,null,null,null,null,"","",null,null,null,null,null,null,20,null,"FID",null,"Pour un joueur fidèle"]
[null,null,null,null,null,"","",null,null,"ET",4,"SENADJKI","MI",23,null,"VAL",null,"Joueurs valides (= 5 Pts)"]
[null,null,null,null,null,"","",null,null,null,null,null,null,22,null,"R",null,"Tous joueurs révisables sans abattement (sauf valides)"]
[null,null,null,null,null,"","",null,null,null,1,"MONNIER","V",99,null,null,null,"Pour tous joueurs sans symbole sur la carte de classification"]
[]
[]
[{"$f":"IF(G32<1,\"\",\"Joueurs ou joueuses valides de l'équipe\")","v":""}]
[{"$f":"IF(G32=0,\"\",IF(G32>1,\"Trop de valides sur le terrain (maximum 1)\",\"OK\"))","v":""}]
[]
[]
[null,null,null,null,null,{"$f":"SUM(F6:F29)","v":0},{"$f":"SUM(G6:G31)","v":0}]

{"sheet":"MARSEILLE","index":20,"n_rows":32,"n_cols":28,"rows_kept":32,"cut":false,"hidden":false,"merged":[[10,15,10,29],[11,15,11,29],[12,15,14,16],[12,17,14,19],[15,15,17,16],[15,17,17,19],[8,20,9,21],[8,22,9,23],[8,24,9,26],[8,27,9,29],[5,18,7,19],[5,20,7,21],[5,22,7,23],[5,24,7,26],[1,0,2,0],[1,1,2,3],[1,9,1,13],[2,9,2,13],[18,15,18,16],[0,15,1,29],[2,15,3,19],[2,20,2,24],[2,25,2,29],[3,20,3,24],[3,25,3,29],[5,27,7,29],[6,15,6,17],[7,15,7,17],[8,15,8,17],[8,18,9,19],[29,0,29,4],[18,17,19,19],[18,20,19,29],[19,15,19,16],[27,0,27,4],[28,0,28,4],[20,15,20,16],[21,15,21,16],[22,15,22,16],[23,15,23,16]]}
["HSB MARSEILLLE",null,null,null,null,null,null,null,null,null,null,null,null,null,null,"Saison 2024-2025                                                                         Points en jeu"]
[null,"Joueur(es) participant à la rencontre",null,null,null,null,null,null,null,"Saisir votre liste complète en MAJUSCULES "]
[null,null,null,null,null,null,null,null,null,"Joueurs(es) qualifié(es) saison 2024 -2025",null,null,null,null,null,"Elite Nationale  Bastide Médical",null,null,null,null,"Sans carte spécifique",null,null,null,null,"Si cartes de couleurs"]
[null,null,null,null,null,null,null,null,null,null,null,null,null,null,null,null,null,null,null,null,"14,5 pts",null,null,null,null,"maxi 17,5 pts"]
["Statuts","Classif.","          Noms      /    Prénoms",null,"Numéros","ET","VALIDE",null,null,"Statuts","Classif.","          Noms      /    Prénoms",null,"Numéros"]
[null,null,null,null,null,{"$f":"IF(A6=\"ET\",1,\"\")","v":""},{"$f":"IF(B6=5,1,\"\")","v":""},null,null,"ET",1,"BENMERRAH","A",0,null,null,null,null,"Carte Verte",null,"Carte Jaune",null,"Carte Rose",null,"Nbr de joueurs/joueuses valides",null,null,"Non Sélectionnables en EDF (hors Fidet)"]
[null,null,null,null,null,{"$f":"IF(A7=\"ET\",1,\"\")","v":""},{"$f":"IF(B7=5,1,\"\")","v":""},null,null,null,4.5,"TALBOT","J","OO",null,"Avec une"]
[null,null,null,null,null,{"$f":"IF(A8=\"ET\",1,\"\")","v":""},{"$f":"IF(B8=5,1,\"\")","v":""},null,null,"ET",4.5,"QUINTERO","J",1,null,"date de"]
[null,null,null,null,null,"","",null,null,null,null,null,null,4,null,"validité",null,null,"+  1",null,"+  2",null,"+  1,5",null,"1 sur la feuille et terrain",null,null,"Pas de limite"]
[null,null,null,null,null,"","",null,null,null,null,null,null,5]
[null,null,null,null,null,"","",null,null,null,null,null,null,6,null,"Pour le calcul des points"]
[null,null,null,null,null,"","",null,null,null,4,"BOUSTILA","O",7,null,"Inscrire dans la colonne de gauche le \"Statut\" des joueurs(es) de l'équipe"]
[null,null,null,null,null,"","",null,null,null,null,null,null,8,null,"J",null,"Pour les cartes Vertes",null,null,"Jeune joueur (U19 en Elite Nationale Bastide Médical)"]
[null,null,null,null,null,"","",null,null,null,null,null,null,9,null,null,null,null,null,null,"Joueur débutant, sélectionnable en Equipe de France"]
[null,null,null,null,null,"","",null,null,"F",2,"RUBLER","AS",10,null,null,null,null,null,null,"seulement (attention à la date de validité juqu'à 22 ans révolu)"]
[null,null,null,null,null,"","",null,null,null,null,null,null,11,null,"JF",null,"Pour les cartes Jaunes",null,null,"Jeune joueuse (U19 en Elite Nationale Bastide Médical)"]
[null,null,null,null,null,"","","",null,null,3,"AMAH","K",12,null,null,null,null,null,null,"Joueuse débutante, sélectionnable en Equipe de France"]
[null,null,null,null,null,"","","",null,null,null,null,null,13,null,null,null,null,null,null,"seulement (attention à la date de validité juqu' à 22 ans révolu)"]
[null,null,null,null,null,"","","",null,"ET",1.5,"MANTILLA","J",14,null,"F",null,"Pour les cartes roses",null,null,"Pour les femmes françaises ou étrangèress)                                             <5pts  (Bonus 1,5 pts)"]
[null,null,null,null,null,"","",null,null,null,2,"OUAR","N",15,null,"FET"]
[null,null,null,null,null,"","","",null,"ET",4,"LABEDZKI","A",16,null,"ET",null,"Pour un joueur étranger"]
[null,null,null,null,null,"","",null,null,"ET",2,"PATINO-MEJIA","F",20,null,"FID",null,"Pour un joueur fidèle"]
[null,null,null,null,null,"","",null,null,"ET",2.5,"VARGAS","J",23,null,"VAL",null,"Joueurs valides (= 5 Pts)"]
[null,null,null,null,null,"","",null,null,null,null,null,null,24,null,"R",null,"Tous joueurs révisables sans abattement (sauf valides)"]
[null,null,null,null,null,"","",null,null,null,4,"ANGULO","L",30,null,null,null,"Pour tous joueurs sans symbole sur la carte de classification"]
[]
[]
[{"$f":"IF(G32<1,\"\",\"Joueurs ou joueuses valides de l'équipe\")","v":""}]
[{"$f":"IF(G32=0,\"\",IF(G32>1,\"Trop de valides sur le terrain (maximum 1)\",\"OK\"))","v":""}]
[]
[]
[null,null,null,null,null,{"$f":"SUM(F6:F29)","v":0},{"$f":"SUM(G6:G31)","v":0}]

{"sheet":"MEAUX","index":21,"n_rows":32,"n_cols":28,"rows_kept":32,"cut":false,"hidden":false,"merged":[[10,15,10,29],[11,15,11,29],[12,15,14,16],[12,17,14,19],[15,15,17,16],[15,17,17,19],[8,20,9,21],[8,22,9,23],[8,24,9,26],[8,27,9,29],[5,18,7,19],[5,20,7,21],[5,22,7,23],[5,24,7,26],[1,0,2,0],[1,1,2,3],[1,9,1,13],[2,9,2,13],[18,15,18,16],[0,15,1,29],[2,15,3,19],[2,20,2,24],[2,25,2,29],[3,20,3,24],[3,25,3,29],[5,27,7,29],[6,15,6,17],[7,15,7,17],[8,15,8,17],[8,18,9,19],[29,0,29,4],[18,17,19,19],[18,20,19,29],[19,15,19,16],[27,0,27,4],[28,0,28,4],[20,15,20,16],[21,15,21,16],[22,15,22,16],[23,15,23,16]]}
["CSMBF MEAUX",null,null,null,null,null,null,null,null,null,null,null,null,null,null,"Saison 2024-2025                                                                         Points en jeu"]
[null,"Joueur(es) participant à la rencontre",null,null,null,null,null,null,null,"Saisir votre liste complète en MAJUSCULES "]
[null,null,null,null,null,null,null,null,null,"Joueurs(es) qualifié(es) saison 2024 -2025",null,null,null,null,null,"Elite Nationale  Bastide Médical",null,null,null,null,"Sans carte spécifique",null,null,null,null,"Si cartes de couleurs"]
[null,null,null,null,null,null,null,null,null,null,null,null,null,null,null,null,null,null,null,null,"14,5 pts",null,null,null,null,"maxi 17,5 pts"]
["Statuts","Classif.","          Noms      /    Prénoms",null,"Numéros","ET","VALIDE",null,null,"Statuts","Classif.","          Noms      /    Prénoms",null,"Numéros"]
[null,null,null,null,null,{"$f":"IF(A6=\"ET\",1,\"\")","v":""},{"$f":"IF(B6=5,1,\"\")","v":""},null,null,null,null,null,null,4,null,null,null,null,"Carte Verte",null,"Carte Jaune",null,"Carte Rose",null,"Nbr de joueurs/joueuses valides",null,null,"Non Sélectionnables en EDF (hors Fidet)"]
[null,null,null,null,null,{"$f":"IF(A7=\"ET\",1,\"\")","v":""},{"$f":"IF(B7=5,1,\"\")","v":""},null,null,"J",2,"MEDUS","K",5,null,"Avec une"]
[null,null,null,null,null,{"$f":"IF(A8=\"ET\",1,\"\")","v":""},{"$f":"IF(B8=5,1,\"\")","v":""},null,null,"F",2,"RUBLER","AS",6,null,"date de"]
[null,null,null,null,null,"","",null,null,null,1.5,"CAYOL","A",7,null,"validité",null,null,"+  1",null,"+  2",null,"+  1,5",null,"1 sur la feuille et terrain",null,null,"Pas de limite"]
[null,null,null,null,null,"","",null,null,"ET",4.5,"BLAIR","Z",8]
[null,null,null,null,null,"","",null,null,null,4,"EVANNO","S",9,null,"Pour le calcul des points"]
[null,null,null,null,null,"","",null,null,"FET",1,"SENNI","M",10,null,"Inscrire dans la colonne de gauche le \"Statut\" des joueurs(es) de l'équipe"]
[null,null,null,null,null,"","",null,null,null,2.5,"GOUTALI","S",11,null,"J",null,"Pour les cartes Vertes",null,null,"Jeune joueur (U19 en Elite Nationale Bastide Médical)"]
[null,null,null,null,null,"","",null,null,null,4.5,"KHELAIFI","K",12,null,null,null,null,null,null,"Joueur débutant, sélectionnable en Equipe de France"]
[null,null,null,null,null,"","",null,null,null,null,null,null,13,null,null,null,null,null,null,"seulement (attention à la date de validité juqu'à 22 ans révolu)"]
[null,null,null,null,null,"","",null,null,null,null,null,null,14,null,"JF",null,"Pour les cartes Jaunes",null,null,"Jeune joueuse (U19 en Elite Nationale Bastide Médical)"]
[null,null,null,null,null,"","","",null,"ET",4.5,"DE'AETH",5,15,null,null,null,null,null,null,"Joueuse débutante, sélectionnable en Equipe de France"]
[null,null,null,null,null,"","","",null,null,null,null,null,16,null,null,null,null,null,null,"seulement (attention à la date de validité juqu' à 22 ans révolu)"]
[null,null,null,null,null,"","","",null,"ET",2.5,"GRIFFITH-SALTER","O",17,null,"F",null,"Pour les cartes roses",null,null,"Pour les femmes françaises ou étrangèress)                                             <5pts  (Bonus 1,5 pts)"]
[null,null,null,null,null,"","",null,null,null,null,null,null,18,null,"FET"]
[null,null,null,null,null,"","","",null,null,null,null,null,19,null,"ET",null,"Pour un joueur étranger"]
[null,null,null,null,null,"","",null,null,null,3,"MEHIAOUI","S",20,null,"FID",null,"Pour un joueur fidèle"]
[null,null,null,null,null,"","",null,null,null,null,null,null,23,null,"VAL",null,"Joueurs valides (= 5 Pts)"]
[null,null,null,null,null,"","",null,null,null,3,"MAKOMA-MAOSO","D",24,null,"R",null,"Tous joueurs révisables sans abattement (sauf valides)"]
[null,null,null,null,null,"","",null,null,"ET",1,"PIETRZYK","K",29,null,null,null,"Pour tous joueurs sans symbole sur la carte de classification"]
[]
[]
[{"$f":"IF(G32<1,\"\",\"Joueurs ou joueuses valides de l'équipe\")","v":""}]
[{"$f":"IF(G32=0,\"\",IF(G32>1,\"Trop de valides sur le terrain (maximum 1)\",\"OK\"))","v":""}]
[]
[]
[null,null,null,null,null,{"$f":"SUM(F6:F29)","v":0},{"$f":"SUM(G6:G31)","v":0}]

{"sheet":"TOULOUSE","index":22,"n_rows":32,"n_cols":28,"rows_kept":32,"cut":false,"hidden":false,"merged":[[10,15,10,29],[11,15,11,29],[12,15,14,16],[12,17,14,19],[15,15,17,16],[15,17,17,19],[8,20,9,21],[8,22,9,23],[8,24,9,26],[8,27,9,29],[5,18,7,19],[5,20,7,21],[5,22,7,23],[5,24,7,26],[1,0,2,0],[1,1,2,3],[1,9,1,13],[2,9,2,13],[18,15,18,16],[0,15,1,29],[2,15,3,19],[2,20,2,24],[2,25,2,29],[3,20,3,24],[3,25,3,29],[5,27,7,29],[6,15,6,17],[7,15,7,17],[8,15,8,17],[8,18,9,19],[29,0,29,4],[18,17,19,19],[18,20,19,29],[19,15,19,16],[27,0,27,4],[28,0,28,4],[20,15,20,16],[21,15,21,16],[22,15,22,16],[23,15,23,16]]}
["TIC TOULOUSE",null,null,null,null,null,null,null,null,null,null,null,null,null,null,"Saison 2024-2025                                                                         Points en jeu"]
[null,"Joueur(es) participant à la rencontre",null,null,null,null,null,null,null,"Saisir votre liste complète en MAJUSCULES "]
[null,null,null,null,null,null,null,null,null,"Joueurs(es) qualifié(es) saison 2024 -2025",null,null,null,null,null,"Elite Nationale  Bastide Médical",null,null,null,null,"Sans carte spécifique",null,null,null,null,"Si cartes de couleurs"]
[null,null,null,null,null,null,null,null,null,null,null,null,null,null,null,null,null,null,null,null,"14,5 pts",null,null,null,null,"maxi 17,5 pts"]
["Statuts","Classif.","          Noms      /    Prénoms",null,"Numéros","ET","VALIDE",null,null,"Statuts","Classif.","          Noms      /    Prénoms",null,"Numéros"]
[null,null,null,null,null,{"$f":"IF(A6=\"ET\",1,\"\")","v":""},{"$f":"IF(B6=5,1,\"\")","v":""},null,null,"ET",1,"GHARBOUDJE","A",1,null,null,null,null,"Carte Verte",null,"Carte Jaune",null,"Carte Rose",null,"Nbr de joueurs/joueuses valides",null,null,"Non Sélectionnables en EDF (hors Fidet)"]
[null,null,null,null,null,{"$f":"IF(A7=\"ET\",1,\"\")","v":""},{"$f":"IF(B7=5,1,\"\")","v":""},null,null,null,null,null,null,2,null,"Avec une"]
[null,null,null,null,null,{"$f":"IF(A8=\"ET\",1,\"\")","v":""},{"$f":"IF(B8=5,1,\"\")","v":""},null,null,null,null,null,null,5,null,"date de"]
[null,null,null,null,null,"","",null,null,null,null,null,null,6,null,"validité",null,null,"+  1",null,"+  2",null,"+  1,5",null,"1 sur la feuille et terrain",null,null,"Pas de limite"]
[null,null,null,null,null,"","",null,null,null,4.5,"FAURES","T",7]
[null,null,null,null,null,"","",null,null,null,2,"COURNEIL","J",8,null,"Pour le calcul des points"]
[null,null,null,null,null,"","",null,null,null,4,"GUEDOUN","N",9,null,"Inscrire dans la colonne de gauche le \"Statut\" des joueurs(es) de l'équipe"]
[null,null,null,null,null,"","",null,null,null,3,"GALY","N",10,null,"J",null,"Pour les cartes Vertes",null,null,"Jeune joueur (U19 en Elite Nationale Bastide Médical)"]
[null,null,null,null,null,"","",null,null,null,null,null,null,11,null,null,null,null,null,null,"Joueur débutant, sélectionnable en Equipe de France"]
[null,null,null,null,null,"","",null,null,null,null,null,null,12,null,null,null,null,null,null,"seulement (attention à la date de validité juqu'à 22 ans révolu)"]
[null,null,null,null,null,"","",null,null,null,4.5,"ROUTABOUL","G",13,null,"JF",null,"Pour les cartes Jaunes",null,null,"Jeune joueuse (U19 en Elite Nationale Bastide Médical)"]
[null,null,null,null,null,"","","",null,null,null,null,null,14,null,null,null,null,null,null,"Joueuse débutante, sélectionnable en Equipe de France"]
[null,null,null,null,null,"","","",null,"FID",3.5,"AYACHE","B",15,null,null,null,null,null,null,"seulement (attention à la date de validité juqu' à 22 ans révolu)"]
[null,null,null,null,null,"","","",null,"F",1,"DOUMESCHE","F",19,null,"F",null,"Pour les cartes roses",null,null,"Pour les femmes françaises ou étrangèress)                                             <5pts  (Bonus 1,5 pts)"]
[null,null,null,null,null,"","",null,null,"ET",4,"SOLORZANO","N",23,null,"FET"]
[null,null,null,null,null,"","","",null,null,1,"LAFFONT","JP",72,null,"ET",null,"Pour un joueur étranger"]
[null,null,null,null,null,"","",null,null,null,null,null,null,null,null,"FID",null,"Pour un joueur fidèle"]
[null,null,null,null,null,"","",null,null,null,null,null,null,null,null,"VAL",null,"Joueurs valides (= 5 Pts)"]
[null,null,null,null,null,"","",null,null,null,null,null,null,null,null,"R",null,"Tous joueurs révisables sans abattement (sauf valides)"]
[null,null,null,null,null,"","",null,null,null,null,null,null,null,null,null,null,"Pour tous joueurs sans symbole sur la carte de classification"]
[]
[]
[{"$f":"IF(G32<1,\"\",\"Joueurs ou joueuses valides de l'équipe\")","v":""}]
[{"$f":"IF(G32=0,\"\",IF(G32>1,\"Trop de valides sur le terrain (maximum 1)\",\"OK\"))","v":""}]
[]
[]
[null,null,null,null,null,{"$f":"SUM(F6:F29)","v":0},{"$f":"SUM(G6:G31)","v":0}]

{"sheet":"ENT BORDEAUX BLANQUEFORT","index":23,"n_rows":32,"n_cols":29,"rows_kept":32,"cut":false,"hidden":false,"merged":[[22,15,22,16],[23,15,23,16],[21,15,21,16],[18,15,18,16],[20,15,20,16],[8,28,9,30],[5,25,7,27],[18,17,19,20],[18,21,19,30],[19,15,19,16],[8,15,8,17],[8,18,9,20],[8,21,9,22],[8,23,9,24],[8,25,9,27],[10,15,10,30],[11,15,11,30],[12,15,14,16],[12,17,14,20],[15,15,17,16],[15,17,17,20],[30,0,30,4],[27,0,27,4],[26,0,26,4],[29,0,29,4],[1,0,2,0],[1,1,2,3],[1,9,1,13],[2,9,2,13],[5,18,7,20],[5,21,7,22],[5,23,7,24],[0,15,1,30],[2,15,3,20],[2,21,2,25],[2,26,2,30],[3,21,3,25],[3,26,3,30],[5,28,7,30],[6,15,6,17],[7,15,7,17],[0,0,0,13]]}
["ENT BORDEAUX BLANQUEFORT",null,null,null,null,null,null,null,null,null,null,null,null,null,null,"Saison 2024-2025                                                                         Points en jeu"]
[null,"Joueur(es) participant à la rencontre",null,null,null,null,null,null,null,"Saisir votre liste complète en MAJUSCULES "]
[null,null,null,null,null,null,null,null,null,"Joueurs(es) qualifié(es) saison 2024 -2025",null,null,null,null,null,"Nationale 1",null,null,null,null,null,"Sans carte spécifique",null,null,null,null,"Si cartes de couleurs"]
[null,null,null,null,null,null,null,null,null,null,null,null,null,null,null,null,null,null,null,null,null,"14,5 pts",null,null,null,null,"maxi 17,5 pts"]
["Statuts","Classif.","          Noms      /    Prénoms",null,"Numéros","ET","VALIDE",null,null,"Statuts","Classif.","          Noms      /    Prénoms",null,"Numéros"]
[null,null,null,null,null,{"$f":"IF(A6=\"ET\",1,\"\")","v":""},{"$f":"IF(B6=5,1,\"\")","v":""},null,null,null,null,null,null,4,null,null,null,null,"Carte Verte",null,null,"Carte Jaune",null,"Carte Rose",null,"Nbr de joueurs/joueuses valides",null,null,"Non Sélectionnables en EDF (hors Fidet)"]
[null,null,null,null,null,{"$f":"IF(A7=\"ET\",1,\"\")","v":""},{"$f":"IF(B7=5,1,\"\")","v":""},null,null,null,5,"DANIEL-LACOMBE","A",5,null,"Avec une"]
[null,null,null,null,null,{"$f":"IF(A8=\"ET\",1,\"\")","v":""},{"$f":"IF(B8=5,1,\"\")","v":""},null,null,null,3.5,"BERREGRAGUE","S",6,null,"date de"]
[null,null,null,null,null,"","",null,null,null,4.5,"MALLET","S",7,null,"validité",null,null,"+  1,5",null,null,"+  2,5",null,"+  1,5",null,"1 sur la feuille et terrain",null,null,"5 inscrits sur la feuille                 4 maxi sur le terrain"]
[null,null,null,null,null,"","",null,null,null,2.5,"LEPAPE","A",8]
[null,null,null,null,null,"","",null,null,"ET",2.5,"FAYE","i",9,null,"Pour le calcul des points"]
[null,null,null,null,null,"","",null,null,null,3.5,"BENTRAT","M",10,null,"Inscrire dans la colonne de gauche le \"Statut\" des joueurs ou joueuses de l'équipe"]
[null,null,null,null,null,"","",null,null,null,null,null,null,11,null,"J",null,"Pour les cartes Vertes",null,null,null,"Jeune joueur (U19 en Elite Nationale Bastide Médical)"]
[null,null,null,null,null,"","",null,null,null,1.5,"GAUDIN-DELRIEU","F",12,null,null,null,null,null,null,null,"Joueur débutant, sélectionnable en Equipe de France"]
[null,null,null,null,null,"","",null,null,null,2,"BANNES","P",13,null,null,null,null,null,null,null,"seulement (attention à la date de validité juqu'à 22 ans révolu)"]
[null,null,null,null,null,"","",null,null,null,1,"TEIXEIRA","J",14,null,"JF",null,"Pour les cartes Jaunes",null,null,null,"Jeune joueuse (U19 en Elite Nationale Bastide Médical)"]
[null,null,null,null,null,"","","",null,null,null,null,null,15,null,null,null,null,null,null,null,"Joueuse débutante, sélectionnable en Equipe de France"]
[null,null,null,null,null,"","","",null,null,4,"GARDIN","E",16,null,null,null,null,null,null,null,"seulement (attention à la date de validité juqu' à 22 ans révolu)"]
[null,null,null,null,null,"","","",null,null,1,"BODY","E",17,null,"F",null,"Pour les cartes roses",null,null,null,"Pour les femmes françaises ou étrangèress)                                             <5pts  (Bonus 1,5 pts)"]
[null,null,null,null,null,"","",null,null,"J",1,"LERU","J",18,null,"FET"]
[null,null,null,null,null,"","","",null,null,null,null,null,19,null,"ET",null,"Pour un joueur étranger"]
[null,null,null,null,null,"","",null,null,null,null,null,null,20,null,"FID",null,"Pour un joueur fidèle"]
[null,null,null,null,null,"","",null,null,null,null,null,null,null,null,"VAL",null,"Joueurs valides"]
[null,null,null,null,null,"","",null,null,null,null,null,null,null,null,"R",null,"Tous joueurs révisables sans abattement (sauf valides)"]
[null,null,null,null,null,"","",null,null,null,null,null,null,null,null,null,null,"Pour tous joueurs sans symbole sur la carte de classification"]
[]
[{"$f":"IF(F32<1,\"\",\"Joueurs ou joueuses étrangers\")","v":""}]
[{"$f":"IF(F32=0,\"\",IF(F32>5,\"Trop de joueurs étangers-max 5)\",\"OK\"))","v":""}]
[]
[{"$f":"IF(G32<1,\"\",\"Joueurs ou joueuses valides de l'équipe\")","v":""}]
[{"$f":"IF(G32=0,\"\",IF(G32>1,\"Trop de valides inscrit sur la feuille-max 1)\",\"OK\"))","v":""}]
[null,null,null,null,null,{"$f":"SUM(F6:F29)","v":0},{"$f":"SUM(G6:G31)","v":0}]

{"sheet":"ENT CAUSSADE PAVIE","index":24,"n_rows":32,"n_cols":29,"rows_kept":32,"cut":false,"hidden":false,"merged":[[18,21,19,30],[15,15,17,16],[19,15,19,16],[21,15,21,16],[8,28,9,30],[10,15,10,30],[11,15,11,30],[12,17,14,20],[15,17,17,20],[8,18,9,20],[8,21,9,22],[8,23,9,24],[8,25,9,27],[2,26,2,30],[3,21,3,25],[3,26,3,30],[5,21,7,22],[5,23,7,24],[5,25,7,27],[5,28,7,30],[22,15,22,16],[1,0,2,0],[1,1,2,3],[1,9,1,13],[2,9,2,13],[12,15,14,16],[18,15,18,16],[20,15,20,16],[6,15,6,17],[7,15,7,17],[8,15,8,17],[18,17,19,20],[5,18,7,20],[0,15,1,30],[2,15,3,20],[2,21,2,25],[23,15,23,16],[30,0,30,4],[26,0,26,4],[27,0,27,4],[29,0,29,4]]}
["ENT CAUSSADE PAVIE",null,null,null,null,null,null,null,null,null,null,null,null,null,null,"Saison 2024-2025                                                                         Points en jeu"]
[null,"Joueur(es) participant à la rencontre",null,null,null,null,null,null,null,"Saisir votre liste complète en MAJUSCULES "]
[null,null,null,null,null,null,null,null,null,"Joueurs(es) qualifié(es) saison 2024 -2025",null,null,null,null,null,"Nationale 1",null,null,null,null,null,"Sans carte spécifique",null,null,null,null,"Si cartes de couleurs"]
[null,null,null,null,null,null,null,null,null,null,null,null,null,null,null,null,null,null,null,null,null,"14,5 pts",null,null,null,null,"maxi 17,5 pts"]
["Statuts","Classif.","          Noms      /    Prénoms",null,"Numéros","ET","VALIDE",null,null,"Statuts","Classif.","          Noms      /    Prénoms",null,"Numéros"]
[null,null,null,null,null,{"$f":"IF(A6=\"ET\",1,\"\")","v":""},{"$f":"IF(B6=5,1,\"\")","v":""},null,null,null,2.5,"EL GHAZZIAOUI","M",4,null,null,null,null,"Carte Verte",null,null,"Carte Jaune",null,"Carte Rose",null,"Nbr de joueurs/joueuses valides",null,null,"Non Sélectionnables en EDF (hors Fidet)"]
[null,null,null,null,null,{"$f":"IF(A7=\"ET\",1,\"\")","v":""},{"$f":"IF(B7=5,1,\"\")","v":""},null,null,"J",1,"BENYAHYA","M",5,null,"Avec une"]
[null,null,null,null,null,{"$f":"IF(A8=\"ET\",1,\"\")","v":""},{"$f":"IF(B8=5,1,\"\")","v":""},null,null,null,2,"HENRAS","J",6,null,"date de"]
[null,null,null,null,null,"","",null,null,"FID",2,"ABASSI","M",7,null,"validité",null,null,"+  1,5",null,null,"+  2,5",null,"+  1,5",null,"1 sur la feuille et terrain",null,null,"5 inscrits sur la feuille                 4 maxi sur le terrain"]
[null,null,null,null,null,"","",null,null,null,null,null,null,8]
[null,null,null,null,null,"","",null,null,null,null,null,null,9,null,"Pour le calcul des points"]
[null,null,null,null,null,"","",null,null,null,2,"NOELCHERY","C",10,null,"Inscrire dans la colonne de gauche le \"Statut\" des joueurs ou joueuses de l'équipe"]
[null,null,null,null,null,"","",null,null,null,3.5,"VIROL","F",11,null,"J",null,"Pour les cartes Vertes",null,null,null,"Jeune joueur (U19 en Elite Nationale Bastide Médical)"]
[null,null,null,null,null,"","",null,null,null,1.5,"BONNET","J",12,null,null,null,null,null,null,null,"Joueur débutant, sélectionnable en Equipe de France"]
[null,null,null,null,null,"","",null,null,null,4,"EL HADDEF","M",13,null,null,null,null,null,null,null,"seulement (attention à la date de validité juqu'à 22 ans révolu)"]
[null,null,null,null,null,"","",null,null,null,2,"OKITAPOY","O",14,null,"JF",null,"Pour les cartes Jaunes",null,null,null,"Jeune joueuse (U19 en Elite Nationale Bastide Médical)"]
[null,null,null,null,null,"","","",null,null,4,"CHANAS","A",15,null,null,null,null,null,null,null,"Joueuse débutante, sélectionnable en Equipe de France"]
[null,null,null,null,null,"","","",null,null,null,null,null,16,null,null,null,null,null,null,null,"seulement (attention à la date de validité juqu' à 22 ans révolu)"]
[null,null,null,null,null,"","","",null,null,null,null,null,17,null,"F",null,"Pour les cartes roses",null,null,null,"Pour les femmes françaises ou étrangèress)                                             <5pts  (Bonus 1,5 pts)"]
[null,null,null,null,null,"","",null,null,null,null,null,null,18,null,"FET"]
[null,null,null,null,null,"","","",null,null,null,null,null,19,null,"ET",null,"Pour un joueur étranger"]
[null,null,null,null,null,"","",null,null,null,null,null,null,20,null,"FID",null,"Pour un joueur fidèle"]
[null,null,null,null,null,"","",null,null,null,null,null,null,null,null,"VAL",null,"Joueurs valides"]
[null,null,null,null,null,"","",null,null,null,null,null,null,null,null,"R",null,"Tous joueurs révisables sans abattement (sauf valides)"]
[null,null,null,null,null,"","",null,null,null,null,null,null,null,null,null,null,"Pour tous joueurs sans symbole sur la carte de classification"]
[]
[{"$f":"IF(F32<1,\"\",\"Joueurs ou joueuses étrangers\")","v":""}]
[{"$f":"IF(F32=0,\"\",IF(F32>5,\"Trop de joueurs étangers-max 5)\",\"OK\"))","v":""}]
[]
[{"$f":"IF(G32<1,\"\",\"Joueurs ou joueuses valides de l'équipe\")","v":""}]
[{"$f":"IF(G32=0,\"\",IF(G32>1,\"Trop de valides inscrit sur la feuille-max 1)\",\"OK\"))","v":""}]
[null,null,null,null,null,{"$f":"SUM(F6:F29)","v":0},{"$f":"SUM(G6:G31)","v":0}]

{"sheet":"ENT CHALON DIJON BF 2","index":25,"n_rows":32,"n_cols":29,"rows_kept":32,"cut":false,"hidden":false,"merged":[[8,15,8,17],[5,28,7,30],[7,15,7,17],[1,0,2,0],[1,1,2,3],[1,9,1,13],[2,9,2,13],[0,15,1,30],[2,15,3,20],[2,21,2,25],[2,26,2,30],[3,21,3,25],[3,26,3,30],[5,18,7,20],[5,21,7,22],[5,23,7,24],[5,25,7,27],[18,21,19,30],[12,17,14,20],[15,17,17,20],[18,17,19,20],[8,18,9,20],[8,21,9,22],[8,23,9,24],[8,25,9,27],[8,28,9,30],[10,15,10,30],[11,15,11,30],[6,15,6,17],[18,15,18,16],[12,15,14,16],[15,15,17,16],[19,15,19,16],[30,0,30,4],[27,0,27,4],[29,0,29,4],[26,0,26,4],[20,15,20,16],[21,15,21,16],[22,15,22,16],[23,15,23,16]]}
["ENT CHALON DIJON BF 2",null,null,null,null,null,null,null,null,null,null,null,null,null,null,"Saison 2024-2025                                                                         Points en jeu"]
[null,"Joueur(es) participant à la rencontre",null,null,null,null,null,null,null,"Saisir votre liste complète en MAJUSCULES "]
[null,null,null,null,null,null,null,null,null,"Joueurs(es) qualifié(es) saison 2024 -2025",null,null,null,null,null,"Nationale 1",null,null,null,null,null,"Sans carte spécifique",null,null,null,null,"Si cartes de couleurs"]
[null,null,null,null,null,null,null,null,null,null,null,null,null,null,null,null,null,null,null,null,null,"14,5 pts",null,null,null,null,"maxi 17,5 pts"]
["Statuts","Classif.","          Noms      /    Prénoms",null,"Numéros","ET","VALIDE",null,null,"Statuts","Classif.","          Noms      /    Prénoms",null,"Numéros"]
[null,null,null,null,null,{"$f":"IF(A6=\"ET\",1,\"\")","v":""},{"$f":"IF(B6=5,1,\"\")","v":""},null,null,"JF",2.5,"ERNEST-AUGUSTIN","M",4,null,null,null,null,"Carte Verte",null,null,"Carte Jaune",null,"Carte Rose",null,"Nbr de joueurs/joueuses valides",null,null,"Non Sélectionnables en EDF (hors Fidet)"]
[null,null,null,null,null,{"$f":"IF(A7=\"ET\",1,\"\")","v":""},{"$f":"IF(B7=5,1,\"\")","v":""},null,null,null,5,"RAMONET","C",5,null,"Avec une"]
[null,null,null,null,null,{"$f":"IF(A8=\"ET\",1,\"\")","v":""},{"$f":"IF(B8=5,1,\"\")","v":""},null,null,"J",1.5,"BOUDIER","V",6,null,"date de"]
[null,null,null,null,null,"","",null,null,"J",4.5,"VOIRIN","N",7,null,"validité",null,null,"+  1,5",null,null,"+  2,5",null,"+  1,5",null,"1 sur la feuille et terrain",null,null,"5 inscrits sur la feuille                 4 maxi sur le terrain"]
[null,null,null,null,null,"","",null,null,null,null,null,null,8]
[null,null,null,null,null,"","",null,null,null,5,"LORDEL","B",9,null,"Pour le calcul des points"]
[null,null,null,null,null,"","",null,null,null,3,"DARJOUR","K",10,null,"Inscrire dans la colonne de gauche le \"Statut\" des joueurs ou joueuses de l'équipe"]
[null,null,null,null,null,"","",null,null,null,1,"BAUER","A",11,null,"J",null,"Pour les cartes Vertes",null,null,null,"Jeune joueur (U19 en Elite Nationale Bastide Médical)"]
[null,null,null,null,null,"","",null,null,null,null,null,null,12,null,null,null,null,null,null,null,"Joueur débutant, sélectionnable en Equipe de France"]
[null,null,null,null,null,"","",null,null,null,null,null,null,13,null,null,null,null,null,null,null,"seulement (attention à la date de validité juqu'à 22 ans révolu)"]
[null,null,null,null,null,"","",null,null,null,null,null,null,14,null,"JF",null,"Pour les cartes Jaunes",null,null,null,"Jeune joueuse (U19 en Elite Nationale Bastide Médical)"]
[null,null,null,null,null,"","","",null,null,4.5,"LORDEL","D",75,null,null,null,null,null,null,null,"Joueuse débutante, sélectionnable en Equipe de France"]
[null,null,null,null,null,"","","",null,null,null,null,null,16,null,null,null,null,null,null,null,"seulement (attention à la date de validité juqu' à 22 ans révolu)"]
[null,null,null,null,null,"","","",null,null,null,null,null,17,null,"F",null,"Pour les cartes roses",null,null,null,"Pour les femmes françaises ou étrangèress)                                             <5pts  (Bonus 1,5 pts)"]
[null,null,null,null,null,"","",null,null,null,null,null,null,18,null,"FET"]
[null,null,null,null,null,"","","",null,null,null,null,null,19,null,"ET",null,"Pour un joueur étranger"]
[null,null,null,null,null,"","",null,null,"F",2,"NOLET","L",28,null,"FID",null,"Pour un joueur fidèle"]
[null,null,null,null,null,"","",null,null,null,null,null,null,null,null,"VAL",null,"Joueurs valides"]
[null,null,null,null,null,"","",null,null,"F",2,"ITA","V",null,null,"R",null,"Tous joueurs révisables sans abattement (sauf valides)"]
[null,null,null,null,null,"","",null,null,null,null,null,null,null,null,null,null,"Pour tous joueurs sans symbole sur la carte de classification"]
[]
[{"$f":"IF(F32<1,\"\",\"Joueurs ou joueuses étrangers\")","v":""}]
[{"$f":"IF(F32=0,\"\",IF(F32>5,\"Trop de joueurs étangers-max 5)\",\"OK\"))","v":""}]
[]
[{"$f":"IF(G32<1,\"\",\"Joueurs ou joueuses valides de l'équipe\")","v":""}]
[{"$f":"IF(G32=0,\"\",IF(G32>1,\"Trop de valides inscrit sur la feuille-max 1)\",\"OK\"))","v":""}]
[null,null,null,null,null,{"$f":"SUM(F6:F29)","v":0},{"$f":"SUM(G6:G31)","v":0}]

{"sheet":"ENT LYON GUILHERAND","index":26,"n_rows":32,"n_cols":29,"rows_kept":32,"cut":false,"hidden":false,"merged":[[8,28,9,30],[10,15,10,30],[11,15,11,30],[12,17,14,20],[12,15,14,16],[8,15,8,17],[5,23,7,24],[8,18,9,20],[8,21,9,22],[8,23,9,24],[8,25,9,27],[6,15,6,17],[7,15,7,17],[5,25,7,27],[5,28,7,30],[1,0,2,0],[1,1,2,3],[1,9,1,13],[2,9,2,13],[0,15,1,30],[2,15,3,20],[2,21,2,25],[2,26,2,30],[3,21,3,25],[3,26,3,30],[5,18,7,20],[5,21,7,22],[15,15,17,16],[19,15,19,16],[15,17,17,20],[18,17,19,20],[18,21,19,30],[26,0,26,4],[30,0,30,4],[29,0,29,4],[27,0,27,4],[18,15,18,16],[20,15,20,16],[21,15,21,16],[22,15,22,16],[23,15,23,16]]}
["Entente LYON/GUILHERAND",null,null,null,null,null,null,null,null,null,null,null,null,null,null,"Saison 2024-2025                                                                         Points en jeu"]
[null,"Joueur(es) participant à la rencontre",null,null,null,null,null,null,null,"Saisir votre liste complète en MAJUSCULES "]
[null,null,null,null,null,null,null,null,null,"Joueurs(es) qualifié(es) saison 2024 -2025",null,null,null,null,null,"Nationale 1",null,null,null,null,null,"Sans carte spécifique",null,null,null,null,"Si cartes de couleurs"]
[null,null,null,null,null,null,null,null,null,null,null,null,null,null,null,null,null,null,null,null,null,"14,5 pts",null,null,null,null,"maxi 17,5 pts"]
["Statuts","Classif.","          Noms      /    Prénoms",null,"Numéros","ET","VALIDE",null,null,"Statuts","Classif.","          Noms      /    Prénoms",null,"Numéros"]
[null,null,null,null,null,{"$f":"IF(A6=\"ET\",1,\"\")","v":""},{"$f":"IF(B6=5,1,\"\")","v":""},null,null,null,null,null,null,6,null,null,null,null,"Carte Verte",null,null,"Carte Jaune",null,"Carte Rose",null,"Nbr de joueurs/joueuses valides",null,null,"Non Sélectionnables en EDF (hors Fidet)"]
[null,null,null,null,null,{"$f":"IF(A7=\"ET\",1,\"\")","v":""},{"$f":"IF(B7=5,1,\"\")","v":""},null,null,null,4.5,"NOHERIE","R",7,null,"Avec une"]
[null,null,null,null,null,{"$f":"IF(A8=\"ET\",1,\"\")","v":""},{"$f":"IF(B8=5,1,\"\")","v":""},null,null,"ET",2.5,"BANGOURA","O",8,null,"date de"]
[null,null,null,null,null,"","",null,null,null,2,"DJALALI","A",9,null,"validité",null,null,"+  1,5",null,null,"+  2,5",null,"+  1,5",null,"1 sur la feuille et terrain",null,null,"5 inscrits sur la feuille                 4 maxi sur le terrain"]
[null,null,null,null,null,"","",null,null,"F",1.5,"DRAME","C",11]
[null,null,null,null,null,"","",null,null,null,1.5,"BISCAINO","Y",12,null,"Pour le calcul des points"]
[null,null,null,null,null,"","",null,null,null,5,"LADREYT","A",13,null,"Inscrire dans la colonne de gauche le \"Statut\" des joueurs ou joueuses de l'équipe"]
[null,null,null,null,null,"","",null,null,null,2.5,"JOUVENCEAU","L",15,null,"J",null,"Pour les cartes Vertes",null,null,null,"Jeune joueur (U19 en Elite Nationale Bastide Médical)"]
[null,null,null,null,null,"","",null,null,"ET",1,"BEN TAIYEB","A",21,null,null,null,null,null,null,null,"Joueur débutant, sélectionnable en Equipe de France"]
[null,null,null,null,null,"","",null,null,"F",4.5,"BROCOT","N",24,null,null,null,null,null,null,null,"seulement (attention à la date de validité juqu'à 22 ans révolu)"]
[null,null,null,null,null,"","",null,null,"S",2,"BENSALEM","K",25,null,"JF",null,"Pour les cartes Jaunes",null,null,null,"Jeune joueuse (U19 en Elite Nationale Bastide Médical)"]
[null,null,null,null,null,"","","",null,null,2.5,"DRAME","A",69,null,null,null,null,null,null,null,"Joueuse débutante, sélectionnable en Equipe de France"]
[null,null,null,null,null,"","","",null,null,null,null,null,15,null,null,null,null,null,null,null,"seulement (attention à la date de validité juqu' à 22 ans révolu)"]
[null,null,null,null,null,"","","",null,"ET",4,"GAYE","M",36,null,"F",null,"Pour les cartes roses",null,null,null,"Pour les femmes françaises ou étrangèress)                                             <5pts  (Bonus 1,5 pts)"]
[null,null,null,null,null,"","",null,null,null,null,null,null,null,null,"FET"]
[null,null,null,null,null,"","","",null,null,null,null,null,null,null,"ET",null,"Pour un joueur étranger"]
[null,null,null,null,null,"","",null,null,null,null,null,null,null,null,"FID",null,"Pour un joueur fidèle"]
[null,null,null,null,null,"","",null,null,null,null,null,null,null,null,"VAL",null,"Joueurs valides"]
[null,null,null,null,null,"","",null,null,null,null,null,null,null,null,"R",null,"Tous joueurs révisables sans abattement (sauf valides)"]
[null,null,null,null,null,"","",null,null,null,null,null,null,null,null,null,null,"Pour tous joueurs sans symbole sur la carte de classification"]
[]
[{"$f":"IF(F32<1,\"\",\"Joueurs ou joueuses étrangers\")","v":""}]
[{"$f":"IF(F32=0,\"\",IF(F32>5,\"Trop de joueurs étangers-max 5)\",\"OK\"))","v":""}]
[]
[{"$f":"IF(G32<1,\"\",\"Joueurs ou joueuses valides de l'équipe\")","v":""}]
[{"$f":"IF(G32=0,\"\",IF(G32>1,\"Trop de valides inscrit sur la feuille-max 1)\",\"OK\"))","v":""}]
[null,null,null,null,null,{"$f":"SUM(F6:F29)","v":0},{"$f":"SUM(G6:G31)","v":0}]

{"sheet":"CAPSAAA","index":27,"n_rows":32,"n_cols":29,"rows_kept":32,"cut":false,"hidden":false,"merged":[[20,15,20,16],[18,17,19,20],[18,21,19,30],[2,21,2,25],[2,26,2,30],[3,21,3,25],[3,26,3,30],[5,18,7,20],[5,21,7,22],[5,23,7,24],[5,25,7,27],[5,28,7,30],[15,15,17,16],[12,17,14,20],[15,17,17,20],[11,15,11,30],[19,15,19,16],[8,28,9,30],[10,15,10,30],[30,0,30,4],[26,0,26,4],[27,0,27,4],[29,0,29,4],[18,15,18,16],[21,15,21,16],[22,15,22,16],[23,15,23,16],[8,15,8,17],[8,18,9,20],[8,21,9,22],[8,23,9,24],[8,25,9,27],[12,15,14,16],[7,15,7,17],[0,15,1,30],[2,15,3,20],[1,0,2,0],[1,1,2,3],[1,9,1,13],[2,9,2,13],[6,15,6,17]]}
["CAPSAAA PARIS",null,null,null,null,null,null,null,null,null,null,null,null,null,null,"Saison 2024-2025                                                                         Points en jeu"]
[null,"Joueur(es) participant à la rencontre",null,null,null,null,null,null,null,"Saisir votre liste complète en MAJUSCULES "]
[null,null,null,null,null,null,null,null,null,"Joueurs(es) qualifié(es) saison 2024 -2025",null,null,null,null,null,"Nationale 1",null,null,null,null,null,"Sans carte spécifique",null,null,null,null,"Si cartes de couleurs"]
[null,null,null,null,null,null,null,null,null,null,null,null,null,null,null,null,null,null,null,null,null,"14,5 pts",null,null,null,null,"maxi 17,5 pts"]
["Statuts","Classif.","          Noms      /    Prénoms",null,"Numéros","ET","VALIDE",null,null,"Statuts","Classif.","          Noms      /    Prénoms",null,"Numéros"]
[null,null,null,null,null,{"$f":"IF(A6=\"ET\",1,\"\")","v":""},{"$f":"IF(B6=5,1,\"\")","v":""},null,null,null,1,"JACOTTIN","M",0,null,null,null,null,"Carte Verte",null,null,"Carte Jaune",null,"Carte Rose",null,"Nbr de joueurs/joueuses valides",null,null,"Non Sélectionnables en EDF (hors Fidet)"]
[null,null,null,null,null,{"$f":"IF(A7=\"ET\",1,\"\")","v":""},{"$f":"IF(B7=5,1,\"\")","v":""},null,null,null,2.5,"LEMAIRE","B",5,null,"Avec une"]
[null,null,null,null,null,{"$f":"IF(A8=\"ET\",1,\"\")","v":""},{"$f":"IF(B8=5,1,\"\")","v":""},null,null,"ET",1.5,"BAZIZ","I",5,null,"date de"]
[null,null,null,null,null,"","",null,null,null,2,"KEMGANG","J",6,null,"validité",null,null,"+  1,5",null,null,"+  2,5",null,"+  1,5",null,"1 sur la feuille et terrain",null,null,"5 inscrits sur la feuille                 4 maxi sur le terrain"]
[null,null,null,null,null,"","",null,null,null,null,null,null,8]
[null,null,null,null,null,"","",null,null,null,1,"SALLEM","R",9,null,"Pour le calcul des points"]
[null,null,null,null,null,"","",null,null,"FID",2,"GOITA","O",10,null,"Inscrire dans la colonne de gauche le \"Statut\" des joueurs ou joueuses de l'équipe"]
[null,null,null,null,null,"","",null,null,null,3.5,"LAGHOUITI","A",11,null,"J",null,"Pour les cartes Vertes",null,null,null,"Jeune joueur (U19 en Elite Nationale Bastide Médical)"]
[null,null,null,null,null,"","",null,null,null,null,null,null,12,null,null,null,null,null,null,null,"Joueur débutant, sélectionnable en Equipe de France"]
[null,null,null,null,null,"","",null,null,null,null,null,null,13,null,null,null,null,null,null,null,"seulement (attention à la date de validité juqu'à 22 ans révolu)"]
[null,null,null,null,null,"","",null,null,"FID",2.5,"CHIKH","M",14,null,"JF",null,"Pour les cartes Jaunes",null,null,null,"Jeune joueuse (U19 en Elite Nationale Bastide Médical)"]
[null,null,null,null,null,"","","",null,"FID",4,"MESSAOUDENE","M",15,null,null,null,null,null,null,null,"Joueuse débutante, sélectionnable en Equipe de France"]
[null,null,null,null,null,"","","",null,null,null,null,null,16,null,null,null,null,null,null,null,"seulement (attention à la date de validité juqu' à 22 ans révolu)"]
[null,null,null,null,null,"","","",null,null,5,"JULVE","M",17,null,"F",null,"Pour les cartes roses",null,null,null,"Pour les femmes françaises ou étrangèress)                                             <5pts  (Bonus 1,5 pts)"]
[null,null,null,null,null,"","",null,null,null,4.5,"EL HADAOUI","A",75,null,"FET"]
[null,null,null,null,null,"","","",null,"F",1,"D'ACREMONT","f",98,null,"ET",null,"Pour un joueur étranger"]
[null,null,null,null,null,"","",null,null,null,null,null,null,99,null,"FID",null,"Pour un joueur fidèle"]
[null,null,null,null,null,"","",null,null,null,null,null,null,75,null,"VAL",null,"Joueurs valides"]
[null,null,null,null,null,"","",null,null,null,null,null,null,99,null,"R",null,"Tous joueurs révisables sans abattement (sauf valides)"]
[null,null,null,null,null,"","",null,null,null,null,null,null,null,null,null,null,"Pour tous joueurs sans symbole sur la carte de classification"]
[]
[{"$f":"IF(F32<1,\"\",\"Joueurs ou joueuses étrangers\")","v":""}]
[{"$f":"IF(F32=0,\"\",IF(F32>5,\"Trop de joueurs étangers-max 5)\",\"OK\"))","v":""}]
[]
[{"$f":"IF(G32<1,\"\",\"Joueurs ou joueuses valides de l'équipe\")","v":""}]
[{"$f":"IF(G32=0,\"\",IF(G32>1,\"Trop de valides inscrit sur la feuille-max 1)\",\"OK\"))","v":""}]
[null,null,null,null,null,{"$f":"SUM(F6:F29)","v":0},{"$f":"SUM(G6:G31)","v":0}]

{"sheet":"DOUAI","index":28,"n_rows":32,"n_cols":29,"rows_kept":32,"cut":false,"hidden":false,"merged":[[8,28,9,30],[10,15,10,30],[11,15,11,30],[12,17,14,20],[12,15,14,16],[8,15,8,17],[5,23,7,24],[8,18,9,20],[8,21,9,22],[8,23,9,24],[8,25,9,27],[6,15,6,17],[7,15,7,17],[5,25,7,27],[5,28,7,30],[1,0,2,0],[1,1,2,3],[1,9,1,13],[2,9,2,13],[0,15,1,30],[2,15,3,20],[2,21,2,25],[2,26,2,30],[3,21,3,25],[3,26,3,30],[5,18,7,20],[5,21,7,22],[15,15,17,16],[19,15,19,16],[15,17,17,20],[18,17,19,20],[18,21,19,30],[26,0,26,4],[30,0,30,4],[29,0,29,4],[27,0,27,4],[18,15,18,16],[20,15,20,16],[21,15,21,16],[22,15,22,16],[23,15,23,16]]}
["DOUAI",null,null,null,null,null,null,null,null,null,null,null,null,null,null,"Saison 2024-2025                                                                         Points en jeu"]
[null,"Joueur(es) participant à la rencontre",null,null,null,null,null,null,null,"Saisir votre liste complète en MAJUSCULES "]
[null,null,null,null,null,null,null,null,null,"Joueurs(es) qualifié(es) saison 2024 -2025",null,null,null,null,null,"Nationale 1",null,null,null,null,null,"Sans carte spécifique",null,null,null,null,"Si cartes de couleurs"]
[null,null,null,null,null,null,null,null,null,null,null,null,null,null,null,null,null,null,null,null,null,"14,5 pts",null,null,null,null,"maxi 17,5 pts"]
["Statuts","Classif.","          Noms      /    Prénoms",null,"Numéros","ET","VALIDE",null,null,"Statuts","Classif.","          Noms      /    Prénoms",null,"Numéros"]
[null,null,null,null,null,{"$f":"IF(A6=\"ET\",1,\"\")","v":""},{"$f":"IF(B6=5,1,\"\")","v":""},null,null,null,4.5,"AVEZ","G",1,null,null,null,null,"Carte Verte",null,null,"Carte Jaune",null,"Carte Rose",null,"Nbr de joueurs/joueuses valides",null,null,"Non Sélectionnables en EDF (hors Fidet)"]
[null,null,null,null,null,{"$f":"IF(A7=\"ET\",1,\"\")","v":""},{"$f":"IF(B7=5,1,\"\")","v":""},null,null,null,null,null,null,2,null,"Avec une"]
[null,null,null,null,null,{"$f":"IF(A8=\"ET\",1,\"\")","v":""},{"$f":"IF(B8=5,1,\"\")","v":""},null,null,null,null,null,null,3,null,"date de"]
[null,null,null,null,null,"","",null,null,null,2,"ECROGNARD","V",4,null,"validité",null,null,"+  1,5",null,null,"+  2,5",null,"+  1,5",null,"1 sur la feuille et terrain",null,null,"5 inscrits sur la feuille                 4 maxi sur le terrain"]
[null,null,null,null,null,"","",null,null,null,3,"BOUNAB","M",5]
[null,null,null,null,null,"","",null,null,null,null,null,null,6,null,"Pour le calcul des points"]
[null,null,null,null,null,"","",null,null,null,1,"MARCHANT","R",7,null,"Inscrire dans la colonne de gauche le \"Statut\" des joueurs ou joueuses de l'équipe"]
[null,null,null,null,null,"","",null,null,null,2.5,"SECRET","A",8,null,"J",null,"Pour les cartes Vertes",null,null,null,"Jeune joueur (U19 en Elite Nationale Bastide Médical)"]
[null,null,null,null,null,"","",null,null,null,null,null,null,9,null,null,null,null,null,null,null,"Joueur débutant, sélectionnable en Equipe de France"]
[null,null,null,null,null,"","",null,null,null,3.5,"ZANTOUTI","M",10,null,null,null,null,null,null,null,"seulement (attention à la date de validité juqu'à 22 ans révolu)"]
[null,null,null,null,null,"","",null,null,"ET",4,"ARNAUT","N",11,null,"JF",null,"Pour les cartes Jaunes",null,null,null,"Jeune joueuse (U19 en Elite Nationale Bastide Médical)"]
[null,null,null,null,null,"","","",null,null,1,"BAILLON","K",12,null,null,null,null,null,null,null,"Joueuse débutante, sélectionnable en Equipe de France"]
[null,null,null,null,null,"","","",null,null,4.5,"DEUSY","JJ",24,null,null,null,null,null,null,null,"seulement (attention à la date de validité juqu' à 22 ans révolu)"]
[null,null,null,null,null,"","","",null,null,3,"PITHON","J",27,null,"F",null,"Pour les cartes roses",null,null,null,"Pour les femmes françaises ou étrangèress)                                             <5pts  (Bonus 1,5 pts)"]
[null,null,null,null,null,"","",null,null,null,3.5,"BAUCHE","F",77,null,"FET"]
[null,null,null,null,null,"","","",null,null,null,null,null,null,null,"ET",null,"Pour un joueur étranger"]
[null,null,null,null,null,"","",null,null,null,null,null,null,null,null,"FID",null,"Pour un joueur fidèle"]
[null,null,null,null,null,"","",null,null,null,null,null,null,null,null,"VAL",null,"Joueurs valides"]
[null,null,null,null,null,"","",null,null,null,null,null,null,null,null,"R",null,"Tous joueurs révisables sans abattement (sauf valides)"]
[null,null,null,null,null,"","",null,null,null,null,null,null,null,null,null,null,"Pour tous joueurs sans symbole sur la carte de classification"]
[]
[{"$f":"IF(F32<1,\"\",\"Joueurs ou joueuses étrangers\")","v":""}]
[{"$f":"IF(F32=0,\"\",IF(F32>5,\"Trop de joueurs étangers-max 5)\",\"OK\"))","v":""}]
[]
[{"$f":"IF(G32<1,\"\",\"Joueurs ou joueuses valides de l'équipe\")","v":""}]
[{"$f":"IF(G32=0,\"\",IF(G32>1,\"Trop de valides inscrit sur la feuille-max 1)\",\"OK\"))","v":""}]
[null,null,null,null,null,{"$f":"SUM(F6:F29)","v":0},{"$f":"SUM(G6:G31)","v":0}]

{"sheet":"FEURS","index":29,"n_rows":32,"n_cols":29,"rows_kept":32,"cut":false,"hidden":false,"merged":[[8,28,9,30],[10,15,10,30],[11,15,11,30],[12,17,14,20],[12,15,14,16],[8,15,8,17],[5,23,7,24],[8,18,9,20],[8,21,9,22],[8,23,9,24],[8,25,9,27],[6,15,6,17],[7,15,7,17],[5,25,7,27],[5,28,7,30],[1,0,2,0],[1,1,2,3],[1,9,1,13],[2,9,2,13],[0,15,1,30],[2,15,3,20],[2,21,2,25],[2,26,2,30],[3,21,3,25],[3,26,3,30],[5,18,7,20],[5,21,7,22],[15,15,17,16],[19,15,19,16],[15,17,17,20],[18,17,19,20],[18,21,19,30],[26,0,26,4],[30,0,30,4],[29,0,29,4],[27,0,27,4],[18,15,18,16],[20,15,20,16],[21,15,21,16],[22,15,22,16],[23,15,23,16]]}
["FEURS",null,null,null,null,null,null,null,null,null,null,null,null,null,null,"Saison 2024-2025                                                                         Points en jeu"]
[null,"Joueur(es) participant à la rencontre",null,null,null,null,null,null,null,"Saisir votre liste complète en MAJUSCULES "]
[null,null,null,null,null,null,null,null,null,"Joueurs(es) qualifié(es) saison 2024 -2025",null,null,null,null,null,"Nationale 1",null,null,null,null,null,"Sans carte spécifique",null,null,null,null,"Si cartes de couleurs"]
[null,null,null,null,null,null,null,null,null,null,null,null,null,null,null,null,null,null,null,null,null,"14,5 pts",null,null,null,null,"maxi 17,5 pts"]
["Statuts","Classif.","          Noms      /    Prénoms",null,"Numéros","ET","VALIDE",null,null,"Statuts","Classif.","          Noms      /    Prénoms",null,"Numéros"]
[null,null,null,null,null,{"$f":"IF(A6=\"ET\",1,\"\")","v":""},{"$f":"IF(B6=5,1,\"\")","v":""},null,null,null,4,"GIPON","M",4,null,null,null,null,"Carte Verte",null,null,"Carte Jaune",null,"Carte Rose",null,"Nbr de joueurs/joueuses valides",null,null,"Non Sélectionnables en EDF (hors Fidet)"]
[null,null,null,null,null,{"$f":"IF(A7=\"ET\",1,\"\")","v":""},{"$f":"IF(B7=5,1,\"\")","v":""},null,null,null,null,null,null,5,null,"Avec une"]
[null,null,null,null,null,{"$f":"IF(A8=\"ET\",1,\"\")","v":""},{"$f":"IF(B8=5,1,\"\")","v":""},null,null,null,1,"BANCEL","R",6,null,"date de"]
[null,null,null,null,null,"","",null,null,null,null,null,null,7,null,"validité",null,null,"+  1,5",null,null,"+  2,5",null,"+  1,5",null,"1 sur la feuille et terrain",null,null,"5 inscrits sur la feuille                 4 maxi sur le terrain"]
[null,null,null,null,null,"","",null,null,"ET",2,"ATUASHVILI","G",8]
[null,null,null,null,null,"","",null,null,null,null,null,null,9,null,"Pour le calcul des points"]
[null,null,null,null,null,"","",null,null,"ET",2.5,"HAGKULL","B",10,null,"Inscrire dans la colonne de gauche le \"Statut\" des joueurs ou joueuses de l'équipe"]
[null,null,null,null,null,"","",null,null,"FID",4,"JARUSEIVICIUS","M",11,null,"J",null,"Pour les cartes Vertes",null,null,null,"Jeune joueur (U19 en Elite Nationale Bastide Médical)"]
[null,null,null,null,null,"","",null,null,null,2,"JOURJON","A",12,null,null,null,null,null,null,null,"Joueur débutant, sélectionnable en Equipe de France"]
[null,null,null,null,null,"","",null,null,"ET",2,"CAINE","G",13,null,null,null,null,null,null,null,"seulement (attention à la date de validité juqu'à 22 ans révolu)"]
[null,null,null,null,null,"","",null,null,null,null,null,null,14,null,"JF",null,"Pour les cartes Jaunes",null,null,null,"Jeune joueuse (U19 en Elite Nationale Bastide Médical)"]
[null,null,null,null,null,"","","",null,"ET",3,"KULBOKA","S",15,null,null,null,null,null,null,null,"Joueuse débutante, sélectionnable en Equipe de France"]
[null,null,null,null,null,"","","",null,null,null,null,null,16,null,null,null,null,null,null,null,"seulement (attention à la date de validité juqu' à 22 ans révolu)"]
[null,null,null,null,null,"","","",null,null,null,null,null,17,null,"F",null,"Pour les cartes roses",null,null,null,"Pour les femmes françaises ou étrangèress)                                             <5pts  (Bonus 1,5 pts)"]
[null,null,null,null,null,"","",null,null,null,null,null,null,18,null,"FET"]
[null,null,null,null,null,"","","",null,null,null,null,null,19,null,"ET",null,"Pour un joueur étranger"]
[null,null,null,null,null,"","",null,null,null,null,null,null,23,null,"FID",null,"Pour un joueur fidèle"]
[null,null,null,null,null,"","",null,null,null,null,null,null,26,null,"VAL",null,"Joueurs valides"]
[null,null,null,null,null,"","",null,null,null,null,null,null,null,null,"R",null,"Tous joueurs révisables sans abattement (sauf valides)"]
[null,null,null,null,null,"","",null,null,null,null,null,null,4,null,null,null,"Pour tous joueurs sans symbole sur la carte de classification"]
[]
[{"$f":"IF(F32<1,\"\",\"Joueurs ou joueuses étrangers\")","v":""}]
[{"$f":"IF(F32=0,\"\",IF(F32>5,\"Trop de joueurs étangers-max 5)\",\"OK\"))","v":""}]
[]
[{"$f":"IF(G32<1,\"\",\"Joueurs ou joueuses valides de l'équipe\")","v":""}]
[{"$f":"IF(G32=0,\"\",IF(G32>1,\"Trop de valides inscrit sur la feuille-max 1)\",\"OK\"))","v":""}]
[null,null,null,null,null,{"$f":"SUM(F6:F29)","v":0},{"$f":"SUM(G6:G31)","v":0}]

{"sheet":"MEAUX 2","index":30,"n_rows":32,"n_cols":29,"rows_kept":32,"cut":false,"hidden":false,"merged":[[8,28,9,30],[10,15,10,30],[11,15,11,30],[12,17,14,20],[12,15,14,16],[8,15,8,17],[5,23,7,24],[8,18,9,20],[8,21,9,22],[8,23,9,24],[8,25,9,27],[6,15,6,17],[7,15,7,17],[5,25,7,27],[5,28,7,30],[1,0,2,0],[1,1,2,3],[1,9,1,13],[2,9,2,13],[0,15,1,30],[2,15,3,20],[2,21,2,25],[2,26,2,30],[3,21,3,25],[3,26,3,30],[5,18,7,20],[5,21,7,22],[15,15,17,16],[19,15,19,16],[15,17,17,20],[18,17,19,20],[18,21,19,30],[26,0,26,4],[30,0,30,4],[29,0,29,4],[27,0,27,4],[18,15,18,16],[20,15,20,16],[21,15,21,16],[22,15,22,16],[23,15,23,16]]}
["CSMBF MEAUX 2",null,null,null,null,null,null,null,null,null,null,null,null,null,null,"Saison 2024-2025                                                                         Points en jeu"]
[null,"Joueur(es) participant à la rencontre",null,null,null,null,null,null,null,"Saisir votre liste complète en MAJUSCULES "]
[null,null,null,null,null,null,null,null,null,"Joueurs(es) qualifié(es) saison 2024 -2025",null,null,null,null,null,"Nationale 1",null,null,null,null,null,"Sans carte spécifique",null,null,null,null,"Si cartes de couleurs"]
[null,null,null,null,null,null,null,null,null,null,null,null,null,null,null,null,null,null,null,null,null,"14,5 pts",null,null,null,null,"maxi 17,5 pts"]
["Statuts","Classif.","          Noms      /    Prénoms",null,"Numéros","ET","VALIDE",null,null,"Statuts","Classif.","          Noms      /    Prénoms",null,"Numéros"]
[null,null,null,null,null,{"$f":"IF(A6=\"ET\",1,\"\")","v":""},{"$f":"IF(B6=5,1,\"\")","v":""},null,null,null,null,null,null,0,null,null,null,null,"Carte Verte",null,null,"Carte Jaune",null,"Carte Rose",null,"Nbr de joueurs/joueuses valides",null,null,"Non Sélectionnables en EDF (hors Fidet)"]
[null,null,null,null,null,{"$f":"IF(A7=\"ET\",1,\"\")","v":""},{"$f":"IF(B7=5,1,\"\")","v":""},null,null,null,null,null,null,2,null,"Avec une"]
[null,null,null,null,null,{"$f":"IF(A8=\"ET\",1,\"\")","v":""},{"$f":"IF(B8=5,1,\"\")","v":""},null,null,null,1,"DA SILVA","C",5,null,"date de"]
[null,null,null,null,null,"","",null,null,"J",2,"MEDUS","K",5,null,"validité",null,null,"+  1,5",null,null,"+  2,5",null,"+  1,5",null,"1 sur la feuille et terrain",null,null,"5 inscrits sur la feuille                 4 maxi sur le terrain"]
[null,null,null,null,null,"","",null,null,null,3.5,"CARLOMAN","M",8]
[null,null,null,null,null,"","",null,null,null,null,null,null,10,null,"Pour le calcul des points"]
[null,null,null,null,null,"","",null,null,null,null,null,null,11,null,"Inscrire dans la colonne de gauche le \"Statut\" des joueurs ou joueuses de l'équipe"]
[null,null,null,null,null,"","",null,null,null,5,"ZOCLY","S",14,null,"J",null,"Pour les cartes Vertes",null,null,null,"Jeune joueur (U19 en Elite Nationale Bastide Médical)"]
[null,null,null,null,null,"","",null,null,"JF",3.5,"VEUILLE","M",17,null,null,null,null,null,null,null,"Joueur débutant, sélectionnable en Equipe de France"]
[null,null,null,null,null,"","",null,null,"ET",2.5,"SEMEDO","I",20,null,null,null,null,null,null,null,"seulement (attention à la date de validité juqu'à 22 ans révolu)"]
[null,null,null,null,null,"","",null,null,"ET",3,"LOMTADZE","G",30,null,"JF",null,"Pour les cartes Jaunes",null,null,null,"Jeune joueuse (U19 en Elite Nationale Bastide Médical)"]
[null,null,null,null,null,"","","",null,null,4,"FAHRASMANE","M",31,null,null,null,null,null,null,null,"Joueuse débutante, sélectionnable en Equipe de France"]
[null,null,null,null,null,"","","",null,null,null,null,null,14,null,null,null,null,null,null,null,"seulement (attention à la date de validité juqu' à 22 ans révolu)"]
[null,null,null,null,null,"","","",null,null,null,null,null,15,null,"F",null,"Pour les cartes roses",null,null,null,"Pour les femmes françaises ou étrangèress)                                             <5pts  (Bonus 1,5 pts)"]
[null,null,null,null,null,"","",null,null,null,3,"CHOUASNARD","V",95,null,"FET"]
[null,null,null,null,null,"","","",null,null,null,null,null,null,null,"ET",null,"Pour un joueur étranger"]
[null,null,null,null,null,"","",null,null,null,null,null,null,null,null,"FID",null,"Pour un joueur fidèle"]
[null,null,null,null,null,"","",null,null,null,null,null,null,null,null,"VAL",null,"Joueurs valides"]
[null,null,null,null,null,"","",null,null,null,null,null,null,null,null,"R",null,"Tous joueurs révisables sans abattement (sauf valides)"]
[null,null,null,null,null,"","",null,null,null,null,null,null,null,null,null,null,"Pour tous joueurs sans symbole sur la carte de classification"]
[]
[{"$f":"IF(F32<1,\"\",\"Joueurs ou joueuses étrangers\")","v":""}]
[{"$f":"IF(F32=0,\"\",IF(F32>5,\"Trop de joueurs étangers-max 5)\",\"OK\"))","v":""}]
[]
[{"$f":"IF(G32<1,\"\",\"Joueurs ou joueuses valides de l'équipe\")","v":""}]
[{"$f":"IF(G32=0,\"\",IF(G32>1,\"Trop de valides inscrit sur la feuille-max 1)\",\"OK\"))","v":""}]
[null,null,null,null,null,{"$f":"SUM(F6:F29)","v":0},{"$f":"SUM(G6:G31)","v":0}]

{"sheet":"MEYLAN","index":31,"n_rows":32,"n_cols":29,"rows_kept":32,"cut":false,"hidden":false,"merged":[[8,28,9,30],[10,15,10,30],[11,15,11,30],[12,17,14,20],[12,15,14,16],[8,15,8,17],[5,23,7,24],[8,18,9,20],[8,21,9,22],[8,23,9,24],[8,25,9,27],[6,15,6,17],[7,15,7,17],[5,25,7,27],[5,28,7,30],[1,0,2,0],[1,1,2,3],[1,9,1,13],[2,9,2,13],[0,15,1,30],[2,15,3,20],[2,21,2,25],[2,26,2,30],[3,21,3,25],[3,26,3,30],[5,18,7,20],[5,21,7,22],[15,15,17,16],[19,15,19,16],[15,17,17,20],[18,17,19,20],[18,21,19,30],[26,0,26,4],[30,0,30,4],[29,0,29,4],[27,0,27,4],[18,15,18,16],[20,15,20,16],[21,15,21,16],[22,15,22,16],[23,15,23,16]]}
["MGH MEYLAN",null,null,null,null,null,null,null,null,null,null,null,null,null,null,"Saison 2024-2025                                                                         Points en jeu"]
[null,"Joueur(es) participant à la rencontre",null,null,null,null,null,null,null,"Saisir votre liste complète en MAJUSCULES "]
[null,null,null,null,null,null,null,null,null,"Joueurs(es) qualifié(es) saison 2024 -2025",null,null,null,null,null,"Nationale 1",null,null,null,null,null,"Sans carte spécifique",null,null,null,null,"Si cartes de couleurs"]
[null,null,null,null,null,null,null,null,null,null,null,null,null,null,null,null,null,null,null,null,null,"14,5 pts",null,null,null,null,"maxi 17,5 pts"]
["Statuts","Classif.","          Noms      /    Prénoms",null,"Numéros","ET","VALIDE",null,null,"Statuts","Classif.","          Noms      /    Prénoms",null,"Numéros"]
[null,null,null,null,null,{"$f":"IF(A6=\"ET\",1,\"\")","v":""},{"$f":"IF(B6=5,1,\"\")","v":""},null,null,null,null,null,null,4,null,null,null,null,"Carte Verte",null,null,"Carte Jaune",null,"Carte Rose",null,"Nbr de joueurs/joueuses valides",null,null,"Non Sélectionnables en EDF (hors Fidet)"]
[null,null,null,null,null,{"$f":"IF(A7=\"ET\",1,\"\")","v":""},{"$f":"IF(B7=5,1,\"\")","v":""},null,null,"J",2.5,"BLANC","D",5,null,"Avec une"]
[null,null,null,null,null,{"$f":"IF(A8=\"ET\",1,\"\")","v":""},{"$f":"IF(B8=5,1,\"\")","v":""},null,null,null,null,null,null,6,null,"date de"]
[null,null,null,null,null,"","",null,null,null,null,null,null,7,null,"validité",null,null,"+  1,5",null,null,"+  2,5",null,"+  1,5",null,"1 sur la feuille et terrain",null,null,"5 inscrits sur la feuille                 4 maxi sur le terrain"]
[null,null,null,null,null,"","",null,null,null,null,null,null,8]
[null,null,null,null,null,"","",null,null,null,null,null,null,9,null,"Pour le calcul des points"]
[null,null,null,null,null,"","",null,null,"FID",4,"BOURENANE","CM",10,null,"Inscrire dans la colonne de gauche le \"Statut\" des joueurs ou joueuses de l'équipe"]
[null,null,null,null,null,"","",null,null,null,1,"LATRECHE","A",11,null,"J",null,"Pour les cartes Vertes",null,null,null,"Jeune joueur (U19 en Elite Nationale Bastide Médical)"]
[null,null,null,null,null,"","",null,null,null,5,"JANOUSCHEWSKI","R",12,null,null,null,null,null,null,null,"Joueur débutant, sélectionnable en Equipe de France"]
[null,null,null,null,null,"","",null,null,"FID",3.5,"ATANGANA","CF",15,null,null,null,null,null,null,null,"seulement (attention à la date de validité juqu'à 22 ans révolu)"]
[null,null,null,null,null,"","",null,null,"FID",4,"NDI","H",17,null,"JF",null,"Pour les cartes Jaunes",null,null,null,"Jeune joueuse (U19 en Elite Nationale Bastide Médical)"]
[null,null,null,null,null,"","","",null,null,5,"DULONG","A",26,null,null,null,null,null,null,null,"Joueuse débutante, sélectionnable en Equipe de France"]
[null,null,null,null,null,"","","",null,"J",1,"MAURIN","A",26,null,null,null,null,null,null,null,"seulement (attention à la date de validité juqu' à 22 ans révolu)"]
[null,null,null,null,null,"","","",null,null,1.5,"MORETON","A",30,null,"F",null,"Pour les cartes roses",null,null,null,"Pour les femmes françaises ou étrangèress)                                             <5pts  (Bonus 1,5 pts)"]
[null,null,null,null,null,"","",null,null,null,4,"KHERBACHE","F",32,null,"FET"]
[null,null,null,null,null,"","","",null,null,null,null,null,37,null,"ET",null,"Pour un joueur étranger"]
[null,null,null,null,null,"","",null,null,null,4,"LEVRAT","D",40,null,"FID",null,"Pour un joueur fidèle"]
[null,null,null,null,null,"","",null,null,null,null,null,null,99,null,"VAL",null,"Joueurs valides"]
[null,null,null,null,null,"","",null,null,null,null,null,null,4,null,"R",null,"Tous joueurs révisables sans abattement (sauf valides)"]
[null,null,null,null,null,"","",null,null,null,null,null,null,null,null,null,null,"Pour tous joueurs sans symbole sur la carte de classification"]
[]
[{"$f":"IF(F32<1,\"\",\"Joueurs ou joueuses étrangers\")","v":""}]
[{"$f":"IF(F32=0,\"\",IF(F32>5,\"Trop de joueurs étangers-max 5)\",\"OK\"))","v":""}]
[]
[{"$f":"IF(G32<1,\"\",\"Joueurs ou joueuses valides de l'équipe\")","v":""}]
[{"$f":"IF(G32=0,\"\",IF(G32>1,\"Trop de valides inscrit sur la feuille-max 1)\",\"OK\"))","v":""}]
[null,null,null,null,null,{"$f":"SUM(F6:F29)","v":0},{"$f":"SUM(G6:G31)","v":0}]

{"sheet":"STRASBOURG","index":32,"n_rows":32,"n_cols":29,"rows_kept":32,"cut":false,"hidden":false,"merged":[[8,28,9,30],[10,15,10,30],[11,15,11,30],[12,17,14,20],[12,15,14,16],[8,15,8,17],[5,23,7,24],[8,18,9,20],[8,21,9,22],[8,23,9,24],[8,25,9,27],[6,15,6,17],[7,15,7,17],[5,25,7,27],[5,28,7,30],[1,0,2,0],[1,1,2,3],[1,9,1,13],[2,9,2,13],[0,15,1,30],[2,15,3,20],[2,21,2,25],[2,26,2,30],[3,21,3,25],[3,26,3,30],[5,18,7,20],[5,21,7,22],[15,15,17,16],[19,15,19,16],[15,17,17,20],[18,17,19,20],[18,21,19,30],[26,0,26,4],[30,0,30,4],[29,0,29,4],[27,0,27,4],[18,15,18,16],[20,15,20,16],[21,15,21,16],[22,15,22,16],[23,15,23,16]]}
["ASPHA STRASBOURG",null,null,null,null,null,null,null,null,null,null,null,null,null,null,"Saison 2024-2025                                                                         Points en jeu"]
[null,"Joueur(es) participant à la rencontre",null,null,null,null,null,null,null,"Saisir votre liste complète en MAJUSCULES "]
[null,null,null,null,null,null,null,null,null,"Joueurs(es) qualifié(es) saison 2024 -2025",null,null,null,null,null,"Nationale 1",null,null,null,null,null,"Sans carte spécifique",null,null,null,null,"Si cartes de couleurs"]
[null,null,null,null,null,null,null,null,null,null,null,null,null,null,null,null,null,null,null,null,null,"14,5 pts",null,null,null,null,"maxi 17,5 pts"]
["Statuts","Classif.","          Noms      /    Prénoms",null,"Numéros","ET","VALIDE",null,null,"Statuts","Classif.","          Noms      /    Prénoms",null,"Numéros"]
[null,null,null,null,null,{"$f":"IF(A6=\"ET\",1,\"\")","v":""},{"$f":"IF(B6=5,1,\"\")","v":""},null,null,null,null,null,null,3,null,null,null,null,"Carte Verte",null,null,"Carte Jaune",null,"Carte Rose",null,"Nbr de joueurs/joueuses valides",null,null,"Non Sélectionnables en EDF (hors Fidet)"]
[null,null,null,null,null,{"$f":"IF(A7=\"ET\",1,\"\")","v":""},{"$f":"IF(B7=5,1,\"\")","v":""},null,null,"FID",2,"SHITTU ","M",4,null,"Avec une"]
[null,null,null,null,null,{"$f":"IF(A8=\"ET\",1,\"\")","v":""},{"$f":"IF(B8=5,1,\"\")","v":""},null,null,"FID",3.5,"NDAO","S",5,null,"date de"]
[null,null,null,null,null,"","",null,null,"FID",1,"MTATASE","A",6,null,"validité",null,null,"+  1,5",null,null,"+  2,5",null,"+  1,5",null,"1 sur la feuille et terrain",null,null,"5 inscrits sur la feuille                 4 maxi sur le terrain"]
[null,null,null,null,null,"","",null,null,null,null,null,null,7]
[null,null,null,null,null,"","",null,null,null,null,null,null,8,null,"Pour le calcul des points"]
[null,null,null,null,null,"","",null,null,null,null,null,null,9,null,"Inscrire dans la colonne de gauche le \"Statut\" des joueurs ou joueuses de l'équipe"]
[null,null,null,null,null,"","",null,null,null,null,null,null,10,null,"J",null,"Pour les cartes Vertes",null,null,null,"Jeune joueur (U19 en Elite Nationale Bastide Médical)"]
[null,null,null,null,null,"","",null,null,null,null,null,null,11,null,null,null,null,null,null,null,"Joueur débutant, sélectionnable en Equipe de France"]
[null,null,null,null,null,"","",null,null,null,null,null,null,12,null,null,null,null,null,null,null,"seulement (attention à la date de validité juqu'à 22 ans révolu)"]
[null,null,null,null,null,"","",null,null,"FID",4.5,"ABDALI","H",13,null,"JF",null,"Pour les cartes Jaunes",null,null,null,"Jeune joueuse (U19 en Elite Nationale Bastide Médical)"]
[null,null,null,null,null,"","","",null,"ET",3.5,"OYELAMI","O",14,null,null,null,null,null,null,null,"Joueuse débutante, sélectionnable en Equipe de France"]
[null,null,null,null,null,"","","",null,null,null,null,null,16,null,null,null,null,null,null,null,"seulement (attention à la date de validité juqu' à 22 ans révolu)"]
[null,null,null,null,null,"","","",null,null,3.5,"BODEMER","T",19,null,"F",null,"Pour les cartes roses",null,null,null,"Pour les femmes françaises ou étrangèress)                                             <5pts  (Bonus 1,5 pts)"]
[null,null,null,null,null,"","",null,null,null,4.5,"HOFFBECK","M",24,null,"FET"]
[null,null,null,null,null,"","","",null,"FID",2,"ATIFI","M",44,null,"ET",null,"Pour un joueur étranger"]
[null,null,null,null,null,"","",null,null,null,null,null,null,67,null,"FID",null,"Pour un joueur fidèle"]
[null,null,null,null,null,"","",null,null,"FID",3,"SOLTYKHANOV","A",95,null,"VAL",null,"Joueurs valides"]
[null,null,null,null,null,"","",null,null,null,1,"KNOERRR","S",99,null,"R",null,"Tous joueurs révisables sans abattement (sauf valides)"]
[null,null,null,null,null,"","",null,null,"FID",2,"SHITTU  FOLUKE","S",null,null,null,null,"Pour tous joueurs sans symbole sur la carte de classification"]
[]
[{"$f":"IF(F32<1,\"\",\"Joueurs ou joueuses étrangers\")","v":""}]
[{"$f":"IF(F32=0,\"\",IF(F32>5,\"Trop de joueurs étangers-max 5)\",\"OK\"))","v":""}]
[]
[{"$f":"IF(G32<1,\"\",\"Joueurs ou joueuses valides de l'équipe\")","v":""}]
[{"$f":"IF(G32=0,\"\",IF(G32>1,\"Trop de valides inscrit sur la feuille-max 1)\",\"OK\"))","v":""}]
[null,null,null,null,null,{"$f":"SUM(F6:F29)","v":0},{"$f":"SUM(G6:G31)","v":0}]

{"sheet":"BESANÇON","index":33,"n_rows":32,"n_cols":29,"rows_kept":32,"cut":false,"hidden":false,"merged":[[12,15,12,31],[14,15,14,16],[20,15,20,16],[23,15,23,31],[25,19,26,31],[19,15,19,16],[17,15,17,31],[26,15,26,16],[13,15,13,16],[15,15,15,16],[16,15,16,16],[25,15,25,16],[24,15,24,16],[21,15,21,16],[18,15,18,16],[0,15,0,31],[1,15,4,18],[1,19,1,24],[1,25,1,31],[2,19,3,24],[2,25,3,31],[11,15,11,31],[9,19,10,20],[9,21,10,22],[9,23,10,24],[9,25,9,27],[9,28,9,31],[30,0,30,4],[26,0,26,4],[27,0,27,4],[29,0,29,4],[29,15,29,16],[30,15,30,16],[28,15,28,16],[27,15,27,16],[1,0,2,0],[1,1,2,3],[10,25,10,27],[10,28,10,31],[1,9,1,13],[2,9,2,13],[5,15,6,31],[7,25,8,27],[7,28,8,31],[7,23,8,24],[7,19,8,20],[7,21,8,22],[7,15,8,16],[7,17,8,18],[9,15,10,16],[9,17,10,18]]}
["ASCCB    BESANÇON",null,null,null,null,null,null,null,null,null,null,null,null,null,null,"Saison 2024-2025                                                                      Points en jeu"]
[null,"Joueur(es) participant à la rencontre",null,null,null,null,null,null,null,"Saisir votre liste complète en MAJUSCULES ",null,null,null,null,null,"Nationale 2",null,null,null,"Sans carte spécifique",null,null,null,null,null,"Si cartes de couleurs"]
[null,null,null,null,null,null,null,null,null,"Joueurs(es) qualifié(es) saison 2024 -2025",null,null,null,null,null,null,null,null,null,"15 pts",null,null,null,null,null,"maxi 19 pts"]
[]
["Statuts","Classif.","          Noms      /    Prénoms",null,"Numéros","ET","VALIDE",null,null,"Statuts","Classif.","          Noms      /    Prénoms",null,"Numéros",null,null,null,null,null,"Si >16pts au début du match (+10 pts adversaire)"]
[null,null,null,null,null,{"$f":"IF(A6=\"ET\",1,\"\")","v":""},{"$f":"IF(B6=5,1,\"\")","v":""},null,null,null,4.5,"GRILLOT","A",4,null,"Avec une date de validité"]
[null,null,null,null,null,{"$f":"IF(A7=\"ET\",1,\"\")","v":""},{"$f":"IF(B7=5,1,\"\")","v":""},null,null,null,4.5,"CIELI","A",5]
[null,null,null,null,null,{"$f":"IF(A8=\"ET\",1,\"\")","v":""},{"$f":"IF(B8=5,1,\"\")","v":""},null,null,"ET",2,"MBAYE","P",6,null,"Carte Verte",null,"Carte Jaune",null,"Carte Rose",null,"Carte      Bleue",null,"Carte      Orange",null,"Joueurs(es) valides (5pts)",null,null,"Non Sélectionnables en EDF (hors FIDET)"]
[null,null,null,null,null,"","",null,null,"FID",2.5,"NSEM  MEDJOTO","P",7]
[null,null,null,null,null,"","",null,null,null,null,null,null,8,null,"+  1,5",null,"+  2,5",null,"+  1,5",null,"+  0,5",null,"+  0,5",null,"2 sur la feuille ",null,null,"5 sur la feuille"]
[null,null,null,null,null,"","",null,null,null,null,null,null,9,null,null,null,null,null,null,null,null,null,null,null,"2 sur le terrain ",null,null,"4 sur le terrain "]
[null,null,null,null,null,"","",null,null,null,4,"BILLOT-LALLEY","M",10,null,"Pour le calcul des points"]
[null,null,null,null,null,"","",null,null,"J",4,"SANGARE NOUHEN","S",11,null,"Inscrire dans la colonne de gauche le \"Statut\" des joueurs ou joueuses "]
[null,null,null,null,null,"","",null,null,null,2.5,"GALMICHE","L",12,null,"J",null,null,null,"Jeune joueur débutant (Bonus1,5pt)"]
[null,null,null,null,null,"","",null,null,null,2.5,"JEANNIN","h",13,null,"JF",null,null,null,"Jeune joueuse débutante (Bonus 2,5pt)"]
[null,null,null,null,null,"","",null,null,null,null,null,null,14,null,"F ou FET",null,null,null,"Femme Française ou étangère <5pts (Bonus 1,5pt)"]
[null,null,null,null,null,"","","",null,null,1,"CURTY","C",15,null,"FV",null,null,null,"Femme française ou étrangère  = 5pts (Bonus de 0,5pt)"]
[null,null,null,null,null,"","","",null,null,5,"SANGARE","B",16,null,"Autres possibilités sans Bonus"]
[null,null,null,null,null,"","","",null,"FID",3.5,"YANEU","E",17,null,"FID",null,"Pour un joueur à un groupement sportif"]
[null,null,null,null,null,"","",null,null,null,null,null,null,null,null,"ET",null,"Pour un joueur étranger "]
[null,null,null,null,null,"","","",null,null,null,null,null,null,null,"VAL",null,"Masculin français (=5 pts) sans bonus"]
[null,null,null,null,null,"","",null,null,null,null,null,null,null,null,"R",null,"Tous joueurs révisables en classification (sauf valide)"]
[null,null,null,null,null,"","",null,null,null,null,null,null,null,null,null,null,"Pour tous joueurs sans symbole sur la carte de classification"]
[null,null,null,null,null,"","",null,null,null,null,null,null,null,null,"Spécificités Nat 2 et 3 (plus de 55 ans)"]
[null,null,null,null,null,"","",null,null,null,null,null,null,null,null,"S",null,null,null,"Français < 5pts (Bonus de 0,5pt)"]
[null,null,null,null,null,null,null,null,null,null,null,null,null,null,null,"SFID",null,null,null,"Joueurs (FIDET) ou étanger < 5pts (Bonus de 0,5pt)"]
[{"$f":"IF(F32<1,\"\",\"Joueurs ou joueuses étrangers\")","v":""},null,null,null,null,null,null,null,null,null,null,null,null,null,null,"SET"]
[{"$f":"IF(F32=0,\"\",IF(F32>5,\"Trop de joueurs étangers-max 5)\",\"OK\"))","v":""},null,null,null,null,null,null,null,null,null,null,null,null,null,null,"SF",null,null,null,"Femme française  < 5pts (Bonus de 2pts): 1,5pts+0,5pt"]
[null,null,null,null,null,null,null,null,null,null,null,null,null,null,null,"SFET",null,null,null,"Femme étrangère  < 5pts (Bonus de 2pts): 1,5pts+0,5pt"]
[{"$f":"IF(G32<1,\"\",\"Joueurs ou joueuses valides de l'équipe\")","v":""},null,null,null,null,null,null,null,null,null,null,null,null,null,null,"JS",null,null,null,"Jeune français <5pts (Bonus 2pts)"]
[{"$f":"IF(G32=0,\"\",IF(G32>2,\"Trop de valides inscrit sur la feuille-max 1)\",\"OK\"))","v":""},null,null,null,null,null,null,null,null,null,null,null,null,null,null,"JFS",null,null,null,"Jeune française <5pts (Bonus 3pts)"]
[null,null,null,null,null,{"$f":"SUM(F6:F29)","v":0},{"$f":"SUM(G6:G31)","v":0}]

{"sheet":"CAPPELLE LA GRANDE","index":34,"n_rows":32,"n_cols":29,"rows_kept":32,"cut":false,"hidden":false,"merged":[[20,15,20,16],[23,15,23,31],[25,19,26,31],[29,15,29,16],[30,15,30,16],[24,15,24,16],[25,15,25,16],[26,15,26,16],[27,15,27,16],[28,15,28,16],[11,15,11,31],[12,15,12,31],[14,15,14,16],[17,15,17,31],[19,15,19,16],[15,15,15,16],[16,15,16,16],[18,15,18,16],[13,15,13,16],[10,25,10,27],[10,28,10,31],[7,15,8,16],[7,17,8,18],[7,19,8,20],[7,21,8,22],[7,23,8,24],[7,25,8,27],[7,28,8,31],[9,15,10,16],[9,17,10,18],[9,19,10,20],[9,21,10,22],[9,23,10,24],[9,25,9,27],[9,28,9,31],[0,15,0,31],[1,15,4,18],[1,19,1,24],[1,25,1,31],[2,19,3,24],[2,25,3,31],[1,0,2,0],[1,1,2,3],[1,9,1,13],[2,9,2,13],[5,15,6,31],[29,0,29,4],[30,0,30,4],[26,0,26,4],[27,0,27,4],[21,15,21,16]]}
["ACHBF    CAPPELLE LA GRANDE",null,null,null,null,null,null,null,null,null,null,null,null,null,null,"Saison 2024-2025                                                                      Points en jeu"]
[null,"Joueur(es) participant à la rencontre",null,null,null,null,null,null,null,"Saisir votre liste complète en MAJUSCULES ",null,null,null,null,null,"Nationale 2",null,null,null,"Sans carte spécifique",null,null,null,null,null,"Si cartes de couleurs"]
[null,null,null,null,null,null,null,null,null,"Joueurs(es) qualifié(es) saison 2024 -2025",null,null,null,null,null,null,null,null,null,"15 pts",null,null,null,null,null,"maxi 19 pts"]
[]
["Statuts","Classif.","          Noms      /    Prénoms",null,"Numéros","ET","VALIDE",null,null,"Statuts","Classif.","          Noms      /    Prénoms",null,"Numéros",null,null,null,null,null,"Si >16pts au début du match (+10 pts adversaire)"]
[null,null,null,null,null,{"$f":"IF(A6=\"ET\",1,\"\")","v":""},{"$f":"IF(B6=5,1,\"\")","v":""},null,null,"J",3.5,"HNEMELRYCK","T",4,null,"Avec une date de validité"]
[null,null,null,null,null,{"$f":"IF(A7=\"ET\",1,\"\")","v":""},{"$f":"IF(B7=5,1,\"\")","v":""},null,null,null,4,"KHALALI","R",5]
[null,null,null,null,null,{"$f":"IF(A8=\"ET\",1,\"\")","v":""},{"$f":"IF(B8=5,1,\"\")","v":""},null,null,null,1,"JAMOTTE","C",6,null,"Carte Verte",null,"Carte Jaune",null,"Carte Rose",null,"Carte      Bleue",null,"Carte      Orange",null,"Joueurs(es) valides (5pts)",null,null,"Non Sélectionnables en EDF (hors FIDET)"]
[null,null,null,null,null,"","",null,null,null,5,"DELPIERRE","R",7]
[null,null,null,null,null,"","",null,null,null,5,"DELPIERRE","G",8,null,"+  1,5",null,"+  2,5",null,"+  1,5",null,"+  0,5",null,"+  0,5",null,"2 sur la feuille ",null,null,"5 sur la feuille"]
[null,null,null,null,null,"","",null,null,"SF",4.5,"SAINT OMER","F",9,null,null,null,null,null,null,null,null,null,null,null,"2 sur le terrain ",null,null,"4 sur le terrain "]
[null,null,null,null,null,"","",null,null,null,1.5,"FAVEEUW","J",10,null,"Pour le calcul des points"]
[null,null,null,null,null,"","",null,null,null,2.5,"GEESEN","G",11,null,"Inscrire dans la colonne de gauche le \"Statut\" des joueurs ou joueuses "]
[null,null,null,null,null,"","",null,null,null,null,null,null,12,null,"J",null,null,null,"Jeune joueur débutant (Bonus1,5pt)"]
[null,null,null,null,null,"","",null,null,null,1.5,"BARRA","R",13,null,"JF",null,null,null,"Jeune joueuse débutante (Bonus 2,5pt)"]
[null,null,null,null,null,"","",null,null,null,4.5,"DELEMME","T",14,null,"F ou FET",null,null,null,"Femme Française ou étangère <5pts (Bonus 1,5pt)"]
[null,null,null,null,null,"","","",null,"F",4.5,"BRICQHET","L",19,null,"FV",null,null,null,"Femme française ou étrangère  = 5pts (Bonus de 0,5pt)"]
[null,null,null,null,null,"","","",null,null,null,null,null,20,null,"Autres possibilités sans Bonus"]
[null,null,null,null,null,"","","",null,null,null,null,null,21,null,"FID",null,"Pour un joueur à un groupement sportif"]
[null,null,null,null,null,"","",null,null,null,null,null,null,22,null,"ET",null,"Pour un joueur étranger "]
[null,null,null,null,null,"","","",null,null,null,null,null,23,null,"VAL",null,"Masculin français (=5 pts) sans bonus"]
[null,null,null,null,null,"","",null,null,null,null,null,null,24,null,"R",null,"Tous joueurs révisables en classification (sauf valide)"]
[null,null,null,null,null,"","",null,null,null,null,null,null,25,null,null,null,"Pour tous joueurs sans symbole sur la carte de classification"]
[null,null,null,null,null,"","",null,null,null,null,null,null,null,null,"Spécificités Nat 2 et 3 (plus de 55 ans)"]
[null,null,null,null,null,"","",null,null,null,null,null,null,null,null,"S",null,null,null,"Français < 5pts (Bonus de 0,5pt)"]
[null,null,null,null,null,null,null,null,null,null,null,null,null,null,null,"SFID",null,null,null,"Joueurs (FIDET) ou étanger < 5pts (Bonus de 0,5pt)"]
[{"$f":"IF(F32<1,\"\",\"Joueurs ou joueuses étrangers\")","v":""},null,null,null,null,null,null,null,null,null,null,null,null,null,null,"SET"]
[{"$f":"IF(F32=0,\"\",IF(F32>5,\"Trop de joueurs étangers-max 5)\",\"OK\"))","v":""},null,null,null,null,null,null,null,null,null,null,null,null,null,null,"SF",null,null,null,"Femme française  < 5pts (Bonus de 2pts): 1,5pts+0,5pt"]
[null,null,null,null,null,null,null,null,null,null,null,null,null,null,null,"SFET",null,null,null,"Femme étrangère  < 5pts (Bonus de 2pts): 1,5pts+0,5pt"]
[{"$f":"IF(G32<1,\"\",\"Joueurs ou joueuses valides de l'équipe\")","v":""},null,null,null,null,null,null,null,null,null,null,null,null,null,null,"JS",null,null,null,"Jeune français <5pts (Bonus 2pts)"]
[{"$f":"IF(G32=0,\"\",IF(G32>2,\"Trop de valides inscrit sur la feuille-max 1)\",\"OK\"))","v":""},null,null,null,null,null,null,null,null,null,null,null,null,null,null,"JFS",null,null,null,"Jeune française <5pts (Bonus 3pts)"]
[null,null,null,null,null,{"$f":"SUM(F6:F29)","v":0},{"$f":"SUM(G6:G31)","v":0}]

{"sheet":"CORBEIL","index":35,"n_rows":32,"n_cols":29,"rows_kept":32,"cut":false,"hidden":false,"merged":[[24,15,24,16],[25,15,25,16],[26,15,26,16],[27,15,27,16],[28,15,28,16],[14,15,14,30],[15,15,15,16],[16,15,16,16],[17,15,17,16],[18,15,18,16],[9,15,9,30],[10,15,10,30],[11,15,11,16],[12,15,12,16],[13,15,13,16],[8,25,8,27],[8,28,8,30],[3,25,3,30],[4,15,4,30],[5,15,6,16],[5,17,6,18],[5,19,6,20],[5,21,6,22],[5,23,6,24],[5,25,6,27],[5,28,6,30],[29,0,29,4],[30,0,30,4],[26,0,26,4],[27,0,27,4],[7,17,8,18],[7,15,8,16],[20,15,20,30],[21,15,21,16],[22,15,22,16],[22,19,23,30],[23,15,23,16],[7,19,8,20],[7,21,8,22],[7,23,8,24],[7,25,7,27],[7,28,7,30],[1,0,2,0],[1,1,2,3],[1,9,1,13],[2,9,2,13],[0,15,1,29],[2,15,3,19],[2,20,2,24],[2,25,2,30],[3,20,3,24]]}
["ASCE  CORBEIL ESSONNES",null,null,null,null,null,null,null,null,null,null,null,null,null,null,"Saison 2024-2025                                                                         Points en jeu"]
[null,"Joueur(es) participant à la rencontre",null,null,null,null,null,null,null,"Saisir votre liste complète en MAJUSCULES "]
[null,null,null,null,null,null,null,null,null,"Joueurs(es) qualifié(es) saison 2024 -2025",null,null,null,null,null,"Nationale 2",null,null,null,null,"Sans carte spécifique",null,null,null,null,"Si cartes de couleurs"]
[null,null,null,null,null,null,null,null,null,null,null,null,null,null,null,null,null,null,null,null,"15 pts",null,null,null,null,"maxi 19 pts"]
["Statuts","Classif.","          Noms      /    Prénoms",null,"Numéros","ET","VALIDE",null,null,"Statuts","Classif.","          Noms      /    Prénoms",null,"Numéros",null,"Avec une date de validité"]
[null,null,null,null,null,{"$f":"IF(A6=\"ET\",1,\"\")","v":""},{"$f":"IF(B6=5,1,\"\")","v":""},null,null,"J",1,"DIJON","P",4,null,"Carte Verte",null,"Carte Jaune",null,"Carte Rose",null,"Carte      Bleue",null,"Carte      Orange",null,"Joueurs(es) valides (5pts)",null,null,"Non Sélectionnables en EDF (hors FIDET)"]
[null,null,null,null,null,{"$f":"IF(A7=\"ET\",1,\"\")","v":""},{"$f":"IF(B7=5,1,\"\")","v":""},null,null,null,null,null,null,5]
[null,null,null,null,null,{"$f":"IF(A8=\"ET\",1,\"\")","v":""},{"$f":"IF(B8=5,1,\"\")","v":""},null,null,null,null,null,null,6,null,"+  1,5",null,"+  2,5",null,"+  1,5",null,"+  0,5",null,"+  0,5",null,"2 sur la feuille",null,null,"5 sur la feuille"]
[null,null,null,null,null,"","",null,null,"S",3.5,"CELESTIN","M",7,null,null,null,null,null,null,null,null,null,null,null,"2 sur le terrain",null,null,"4 sur le terrain"]
[null,null,null,null,null,"","",null,null,"N",4,"NDOMANDJI","R",8,null,"Pour le calcul des points"]
[null,null,null,null,null,"","",null,null,"N",1,"MALARDIER","G",9,null,"Inscrire dans la colonne de gauche le \"Statut\" des joueurs ou joueuses "]
[null,null,null,null,null,"","",null,null,null,null,null,null,10,null,"J",null,null,null,"Jeune joueur débutant (Bonus1,5pt)"]
[null,null,null,null,null,"","",null,null,null,null,null,null,11,null,"JF",null,null,null,"Jeune joueuse débutante (Bonus 2,5pt)"]
[null,null,null,null,null,"","",null,null,"N",1,"MARTEL","F",12,null,"F ou FET",null,null,null,"Pour une femme Française ou étangère <5pts (Bonus 1,5pt)"]
[null,null,null,null,null,"","",null,null,"S",4,"FONTAINE","JP",13,null,"Autres possibilités sans Bonus"]
[null,null,null,null,null,"","",null,null,null,null,null,null,30,null,"FID",null,"Pour un joueur à un groupement sportif"]
[null,null,null,null,null,"","","",null,"N",2,"KHIER","F",31,null,"ET",null,"Pour un joueur étranger <55ans"]
[null,null,null,null,null,"","","",null,"N",4.5,"RAZOUANE","M",91,null,"VAL",null,"Masculin français sans bonus"]
[null,null,null,null,null,"","","",null,null,null,null,null,21,null,"R",null,"Tous joueurs révisables en classification (sauf valide)"]
[null,null,null,null,null,"","",null,null,null,null,null,null,22,null,null,null,"Pour tous joueurs sans symbole sur la carte de classification"]
[null,null,null,null,null,"","","",null,null,null,null,null,23,null,"Spécificités Nat 2 et 3 (plus de 55 ans)"]
[null,null,null,null,null,"","",null,null,null,null,null,null,24,null,"S",null,null,null,"Français < 5pts (Bonus de 0,5pt)"]
[null,null,null,null,null,"","",null,null,null,null,null,null,25,null,"SFID",null,null,null,"Joueurs (FIDET) ou étanger < 5pts (Bonus de 0,5pt)"]
[null,null,null,null,null,"","",null,null,null,null,null,null,null,null,"SET"]
[null,null,null,null,null,"","",null,null,null,null,null,null,null,null,"SF",null,null,null,"Femme française  < 5pts (Bonus de 2pts): 1,5pts+0,5pt"]
[null,null,null,null,null,null,null,null,null,null,null,null,null,null,null,"SFET",null,null,null,"Femme étrangère  < 5pts (Bonus de 2pts): 1,5pts+0,5pt"]
[{"$f":"IF(F32<1,\"\",\"Joueurs ou joueuses étrangers\")","v":""},null,null,null,null,null,null,null,null,null,null,null,null,null,null,"FSV",null,null,null,"Femme française  < 5pts (Bonus de 0,5pt)"]
[{"$f":"IF(F32=0,\"\",IF(F32>5,\"Trop de joueurs étangers-max 5)\",\"OK\"))","v":""},null,null,null,null,null,null,null,null,null,null,null,null,null,null,"JS",null,null,null,"Jeune français <5pts (Bonus 2pts)"]
[null,null,null,null,null,null,null,null,null,null,null,null,null,null,null,"JFS",null,null,null,"Jeune française <5pts (Bonus 3pts)"]
[{"$f":"IF(G32<1,\"\",\"Joueurs ou joueuses valides de l'équipe\")","v":""}]
[{"$f":"IF(G32=0,\"\",IF(G32>2,\"Trop de valides inscrit sur la feuille-max 1)\",\"OK\"))","v":""}]
[null,null,null,null,null,{"$f":"SUM(F6:F29)","v":0},{"$f":"SUM(G6:G31)","v":0}]

{"sheet":"LE PUY 2","index":36,"n_rows":32,"n_cols":29,"rows_kept":32,"cut":false,"hidden":false,"merged":[[29,15,29,16],[30,15,30,16],[5,15,6,31],[7,25,8,27],[7,28,8,31],[9,15,10,16],[9,17,10,18],[9,19,10,20],[9,21,10,22],[9,23,10,24],[9,25,9,27],[9,28,9,31],[10,25,10,27],[10,28,10,31],[25,15,25,16],[26,15,26,16],[25,19,26,31],[0,15,0,31],[1,15,4,18],[1,19,1,24],[1,25,1,31],[2,19,3,24],[2,25,3,31],[16,15,16,16],[18,15,18,16],[24,15,24,16],[17,15,17,31],[19,15,19,16],[20,15,20,16],[23,15,23,31],[30,0,30,4],[26,0,26,4],[27,0,27,4],[7,17,8,18],[7,15,8,16],[21,15,21,16],[13,15,13,16],[11,15,11,31],[12,15,12,31],[14,15,14,16],[7,19,8,20],[7,21,8,22],[7,23,8,24],[27,15,27,16],[28,15,28,16],[15,15,15,16],[1,0,2,0],[1,1,2,3],[1,9,1,13],[2,9,2,13],[29,0,29,4]]}
["LE AIGLES DU VELAY 2",null,null,null,null,null,null,null,null,null,null,null,null,null,null,"Saison 2024-2025                                                                      Points en jeu"]
[null,"Joueur(es) participant à la rencontre",null,null,null,null,null,null,null,"Saisir votre liste complète en MAJUSCULES ",null,null,null,null,null,"Nationale 2",null,null,null,"Sans carte spécifique",null,null,null,null,null,"Si cartes de couleurs"]
[null,null,null,null,null,null,null,null,null,"Joueurs(es) qualifié(es) saison 2024 -2025",null,null,null,null,null,null,null,null,null,"15 pts",null,null,null,null,null,"maxi 19 pts"]
[]
["Statuts","Classif.","          Noms      /    Prénoms",null,"Numéros","ET","VALIDE",null,null,"Statuts","Classif.","          Noms      /    Prénoms",null,"Numéros",null,null,null,null,null,"Si >16pts au début du match (+10 pts adversaire)"]
[null,null,null,null,null,{"$f":"IF(A6=\"ET\",1,\"\")","v":""},{"$f":"IF(B6=5,1,\"\")","v":""},null,null,null,1,"COAT","G",2,null,"Avec une date de validité"]
[null,null,null,null,null,{"$f":"IF(A7=\"ET\",1,\"\")","v":""},{"$f":"IF(B7=5,1,\"\")","v":""},null,null,"S",4.5,"GASTON","F",4]
[null,null,null,null,null,{"$f":"IF(A8=\"ET\",1,\"\")","v":""},{"$f":"IF(B8=5,1,\"\")","v":""},null,null,null,4,"CHANCELADE","F",5,null,"Carte Verte",null,"Carte Jaune",null,"Carte Rose",null,"Carte      Bleue",null,"Carte      Orange",null,"Joueurs(es) valides (5pts)",null,null,"Non Sélectionnables en EDF (hors FIDET)"]
[null,null,null,null,null,"","",null,null,null,1.5,"MARTINEZ","JC",7]
[null,null,null,null,null,"","",null,null,null,null,null,null,7,null,"+  1,5",null,"+  2,5",null,"+  1,5",null,"+  0,5",null,"+  0,5",null,"2 sur la feuille ",null,null,"5 sur la feuille"]
[null,null,null,null,null,"","",null,null,null,null,null,null,8,null,null,null,null,null,null,null,null,null,null,null,"2 sur le terrain ",null,null,"4 sur le terrain "]
[null,null,null,null,null,"","",null,null,null,4,"SAVARY","JC",9,null,"Pour le calcul des points"]
[null,null,null,null,null,"","",null,null,null,1,"ARNAUD","G",10,null,"Inscrire dans la colonne de gauche le \"Statut\" des joueurs ou joueuses "]
[null,null,null,null,null,"","",null,null,null,null,null,null,11,null,"J",null,null,null,"Jeune joueur débutant (Bonus1,5pt)"]
[null,null,null,null,null,"","",null,null,"SF",2,"DORGET","S",12,null,"JF",null,null,null,"Jeune joueuse débutante (Bonus 2,5pt)"]
[null,null,null,null,null,"","",null,null,"FV",5,"DORGET","C",13,null,"F ou FET",null,null,null,"Femme Française ou étangère <5pts (Bonus 1,5pt)"]
[null,null,null,null,null,"","","",null,"J",2,"PERSET","Y",14,null,"FV",null,null,null,"Femme française ou étrangère  = 5pts (Bonus de 0,5pt)"]
[null,null,null,null,null,"","","",null,null,3,"MARIANI","G",15,null,"Autres possibilités sans Bonus"]
[null,null,null,null,null,"","","",null,null,null,null,null,null,null,"FID",null,"Pour un joueur à un groupement sportif"]
[null,null,null,null,null,"","",null,null,null,null,null,null,null,null,"ET",null,"Pour un joueur étranger "]
[null,null,null,null,null,"","","",null,null,null,null,null,null,null,"VAL",null,"Masculin français (=5 pts) sans bonus"]
[null,null,null,null,null,"","",null,null,null,null,null,null,null,null,"R",null,"Tous joueurs révisables en classification (sauf valide)"]
[null,null,null,null,null,"","",null,null,null,null,null,null,null,null,null,null,"Pour tous joueurs sans symbole sur la carte de classification"]
[null,null,null,null,null,"","",null,null,null,null,null,null,null,null,"Spécificités Nat 2 et 3 (plus de 55 ans)"]
[null,null,null,null,null,"","",null,null,null,null,null,null,null,null,"S",null,null,null,"Français < 5pts (Bonus de 0,5pt)"]
[null,null,null,null,null,null,null,null,null,null,null,null,null,null,null,"SFID",null,null,null,"Joueurs (FIDET) ou étanger < 5pts (Bonus de 0,5pt)"]
[{"$f":"IF(F32<1,\"\",\"Joueurs ou joueuses étrangers\")","v":""},null,null,null,null,null,null,null,null,null,null,null,null,null,null,"SET"]
[{"$f":"IF(F32=0,\"\",IF(F32>5,\"Trop de joueurs étangers-max 5)\",\"OK\"))","v":""},null,null,null,null,null,null,null,null,null,null,null,null,null,null,"SF",null,null,null,"Femme française  < 5pts (Bonus de 2pts): 1,5pts+0,5pt"]
[null,null,null,null,null,null,null,null,null,null,null,null,null,null,null,"SFET",null,null,null,"Femme étrangère  < 5pts (Bonus de 2pts): 1,5pts+0,5pt"]
[{"$f":"IF(G32<1,\"\",\"Joueurs ou joueuses valides de l'équipe\")","v":""},null,null,null,null,null,null,null,null,null,null,null,null,null,null,"JS",null,null,null,"Jeune français <5pts (Bonus 2pts)"]
[{"$f":"IF(G32=0,\"\",IF(G32>2,\"Trop de valides inscrit sur la feuille-max 1)\",\"OK\"))","v":""},null,null,null,null,null,null,null,null,null,null,null,null,null,null,"JFS",null,null,null,"Jeune française <5pts (Bonus 3pts)"]
[null,null,null,null,null,{"$f":"SUM(F6:F29)","v":0},{"$f":"SUM(G6:G31)","v":0}]

{"sheet":"STRASBOURG 2","index":37,"n_rows":32,"n_cols":29,"rows_kept":32,"cut":false,"hidden":false,"merged":[[29,15,29,16],[30,15,30,16],[5,15,6,31],[7,25,8,27],[7,28,8,31],[9,15,10,16],[9,17,10,18],[9,19,10,20],[9,21,10,22],[9,23,10,24],[9,25,9,27],[9,28,9,31],[10,25,10,27],[10,28,10,31],[25,15,25,16],[26,15,26,16],[25,19,26,31],[0,15,0,31],[1,15,4,18],[1,19,1,24],[1,25,1,31],[2,19,3,24],[2,25,3,31],[16,15,16,16],[18,15,18,16],[24,15,24,16],[17,15,17,31],[19,15,19,16],[20,15,20,16],[23,15,23,31],[30,0,30,4],[26,0,26,4],[27,0,27,4],[7,17,8,18],[7,15,8,16],[21,15,21,16],[13,15,13,16],[11,15,11,31],[12,15,12,31],[14,15,14,16],[7,19,8,20],[7,21,8,22],[7,23,8,24],[27,15,27,16],[28,15,28,16],[15,15,15,16],[1,0,2,0],[1,1,2,3],[1,9,1,13],[2,9,2,13],[29,0,29,4]]}
["ASPHA STRASBOURG 2",null,null,null,null,null,null,null,null,null,null,null,null,null,null,"Saison 2024-2025                                                                      Points en jeu"]
[null,"Joueur(es) participant à la rencontre",null,null,null,null,null,null,null,"Saisir votre liste complète en MAJUSCULES ",null,null,null,null,null,"Nationale 2",null,null,null,"Sans carte spécifique",null,null,null,null,null,"Si cartes de couleurs"]
[null,null,null,null,null,null,null,null,null,"Joueurs(es) qualifié(es) saison 2024 -2025",null,null,null,null,null,null,null,null,null,"15 pts",null,null,null,null,null,"maxi 19 pts"]
[]
["Statuts","Classif.","          Noms      /    Prénoms",null,"Numéros","ET","VALIDE",null,null,"Statuts","Classif.","          Noms      /    Prénoms",null,"Numéros",null,null,null,null,null,"Si >16pts au début du match (+10 pts adversaire)"]
[null,null,null,null,null,{"$f":"IF(A6=\"ET\",1,\"\")","v":""},{"$f":"IF(B6=5,1,\"\")","v":""},null,null,"FET",3,"SHITTU","FH",3,null,"Avec une date de validité"]
[null,null,null,null,null,{"$f":"IF(A7=\"ET\",1,\"\")","v":""},{"$f":"IF(B7=5,1,\"\")","v":""},null,null,null,null,null,null,5]
[null,null,null,null,null,{"$f":"IF(A8=\"ET\",1,\"\")","v":""},{"$f":"IF(B8=5,1,\"\")","v":""},null,null,null,null,null,null,6,null,"Carte Verte",null,"Carte Jaune",null,"Carte Rose",null,"Carte      Bleue",null,"Carte      Orange",null,"Joueurs(es) valides (5pts)",null,null,"Non Sélectionnables en EDF (hors FIDET)"]
[null,null,null,null,null,"","",null,null,null,null,null,null,7]
[null,null,null,null,null,"","",null,null,null,null,null,null,8,null,"+  1,5",null,"+  2,5",null,"+  1,5",null,"+  0,5",null,"+  0,5",null,"2 sur la feuille ",null,null,"5 sur la feuille"]
[null,null,null,null,null,"","",null,null,null,null,null,null,9,null,null,null,null,null,null,null,null,null,null,null,"2 sur le terrain ",null,null,"4 sur le terrain "]
[null,null,null,null,null,"","",null,null,null,null,null,null,10,null,"Pour le calcul des points"]
[null,null,null,null,null,"","",null,null,null,null,null,null,11,null,"Inscrire dans la colonne de gauche le \"Statut\" des joueurs ou joueuses "]
[null,null,null,null,null,"","",null,null,null,1.5,"ERBS","JF",12,null,"J",null,null,null,"Jeune joueur débutant (Bonus1,5pt)"]
[null,null,null,null,null,"","",null,null,null,null,null,null,13,null,"JF",null,null,null,"Jeune joueuse débutante (Bonus 2,5pt)"]
[null,null,null,null,null,"","",null,null,null,null,null,null,14,null,"F ou FET",null,null,null,"Femme Française ou étangère <5pts (Bonus 1,5pt)"]
[null,null,null,null,null,"","","",null,"FID",1.5,"KHRIBECH","H",15,null,"FV",null,null,null,"Femme française ou étrangère  = 5pts (Bonus de 0,5pt)"]
[null,null,null,null,null,"","","",null,"JF",1,"BERNARD",null,16,null,"Autres possibilités sans Bonus"]
[null,null,null,null,null,"","","",null,"J",4.5,"HOFFBECK","M",24,null,"FID",null,"Pour un joueur à un groupement sportif"]
[null,null,null,null,null,"","",null,null,"FET",3,"OLUWASEGUN","K",55,null,"ET",null,"Pour un joueur étranger "]
[null,null,null,null,null,"","","",null,"S",3.5,"BENETAS","F",67,null,"VAL",null,"Masculin français (=5 pts) sans bonus"]
[null,null,null,null,null,"","",null,null,"S",2.5,"DUCHENE","F",69,null,"R",null,"Tous joueurs révisables en classification (sauf valide)"]
[null,null,null,null,null,"","",null,null,"FID",3,"SOLTYKHANOV","A",95,null,null,null,"Pour tous joueurs sans symbole sur la carte de classification"]
[null,null,null,null,null,"","",null,null,null,null,null,null,null,null,"Spécificités Nat 2 et 3 (plus de 55 ans)"]
[null,null,null,null,null,"","",null,null,null,null,null,null,null,null,"S",null,null,null,"Français < 5pts (Bonus de 0,5pt)"]
[null,null,null,null,null,null,null,null,null,null,null,null,null,null,null,"SFID",null,null,null,"Joueurs (FIDET) ou étanger < 5pts (Bonus de 0,5pt)"]
[{"$f":"IF(F32<1,\"\",\"Joueurs ou joueuses étrangers\")","v":""},null,null,null,null,null,null,null,null,null,null,null,null,null,null,"SET"]
[{"$f":"IF(F32=0,\"\",IF(F32>5,\"Trop de joueurs étangers-max 5)\",\"OK\"))","v":""},null,null,null,null,null,null,null,null,null,null,null,null,null,null,"SF",null,null,null,"Femme française  < 5pts (Bonus de 2pts): 1,5pts+0,5pt"]
[null,null,null,null,null,null,null,null,null,null,null,null,null,null,null,"SFET",null,null,null,"Femme étrangère  < 5pts (Bonus de 2pts): 1,5pts+0,5pt"]
[{"$f":"IF(G32<1,\"\",\"Joueurs ou joueuses valides de l'équipe\")","v":""},null,null,null,null,null,null,null,null,null,null,null,null,null,null,"JS",null,null,null,"Jeune français <5pts (Bonus 2pts)"]
[{"$f":"IF(G32=0,\"\",IF(G32>2,\"Trop de valides inscrit sur la feuille-max 1)\",\"OK\"))","v":""},null,null,null,null,null,null,null,null,null,null,null,null,null,null,"JFS",null,null,null,"Jeune française <5pts (Bonus 3pts)"]
[null,null,null,null,null,{"$f":"SUM(F6:F29)","v":0},{"$f":"SUM(G6:G31)","v":0}]

{"sheet":"VANDOEUVRE","index":38,"n_rows":32,"n_cols":29,"rows_kept":32,"cut":false,"hidden":false,"merged":[[29,15,29,16],[30,15,30,16],[5,15,6,31],[7,25,8,27],[7,28,8,31],[9,15,10,16],[9,17,10,18],[9,19,10,20],[9,21,10,22],[9,23,10,24],[9,25,9,27],[9,28,9,31],[10,25,10,27],[10,28,10,31],[25,15,25,16],[26,15,26,16],[25,19,26,31],[0,15,0,31],[1,15,4,18],[1,19,1,24],[1,25,1,31],[2,19,3,24],[2,25,3,31],[16,15,16,16],[18,15,18,16],[24,15,24,16],[17,15,17,31],[19,15,19,16],[20,15,20,16],[23,15,23,31],[30,0,30,4],[26,0,26,4],[27,0,27,4],[7,17,8,18],[7,15,8,16],[21,15,21,16],[13,15,13,16],[11,15,11,31],[12,15,12,31],[14,15,14,16],[7,19,8,20],[7,21,8,22],[7,23,8,24],[27,15,27,16],[28,15,28,16],[15,15,15,16],[1,0,2,0],[1,1,2,3],[1,9,1,13],[2,9,2,13],[29,0,29,4]]}
["US VANDOEUVRE",null,null,null,null,null,null,null,null,null,null,null,null,null,null,"Saison 2024-2025                                                                      Points en jeu"]
[null,"Joueur(es) participant à la rencontre",null,null,null,null,null,null,null,"Saisir votre liste complète en MAJUSCULES ",null,null,null,null,null,"Nationale 2",null,null,null,"Sans carte spécifique",null,null,null,null,null,"Si cartes de couleurs"]
[null,null,null,null,null,null,null,null,null,"Joueurs(es) qualifié(es) saison 2024 -2025",null,null,null,null,null,null,null,null,null,"15 pts",null,null,null,null,null,"maxi 19 pts"]
[]
["Statuts","Classif.","          Noms      /    Prénoms",null,"Numéros","ET","VALIDE",null,null,"Statuts","Classif.","          Noms      /    Prénoms",null,"Numéros",null,null,null,null,null,"Si >16pts au début du match (+10 pts adversaire)"]
[null,null,null,null,null,{"$f":"IF(A6=\"ET\",1,\"\")","v":""},{"$f":"IF(B6=5,1,\"\")","v":""},null,null,null,null,null,null,0,null,"Avec une date de validité"]
[null,null,null,null,null,{"$f":"IF(A7=\"ET\",1,\"\")","v":""},{"$f":"IF(B7=5,1,\"\")","v":""},null,null,"ET",2.5,"HAMMANA-SAROUI","A",2]
[null,null,null,null,null,{"$f":"IF(A8=\"ET\",1,\"\")","v":""},{"$f":"IF(B8=5,1,\"\")","v":""},null,null,null,null,null,null,null,null,"Carte Verte",null,"Carte Jaune",null,"Carte Rose",null,"Carte      Bleue",null,"Carte      Orange",null,"Joueurs(es) valides (5pts)",null,null,"Non Sélectionnables en EDF (hors FIDET)"]
[null,null,null,null,null,"","",null,null,"F",1,"HOSTE","A",4]
[null,null,null,null,null,"","",null,null,null,null,null,null,5,null,"+  1,5",null,"+  2,5",null,"+  1,5",null,"+  0,5",null,"+  0,5",null,"2 sur la feuille ",null,null,"5 sur la feuille"]
[null,null,null,null,null,"","",null,null,"ET",2.5,"KHAN","A",6,null,null,null,null,null,null,null,null,null,null,null,"2 sur le terrain ",null,null,"4 sur le terrain "]
[null,null,null,null,null,"","",null,null,null,null,null,null,7,null,"Pour le calcul des points"]
[null,null,null,null,null,"","",null,null,"S",4,"ROBIN","P",8,null,"Inscrire dans la colonne de gauche le \"Statut\" des joueurs ou joueuses "]
[null,null,null,null,null,"","",null,null,null,2,"ZAKI","Y",9,null,"J",null,null,null,"Jeune joueur débutant (Bonus1,5pt)"]
[null,null,null,null,null,"","",null,null,"S",4,"ROBIN","P",10,null,"JF",null,null,null,"Jeune joueuse débutante (Bonus 2,5pt)"]
[null,null,null,null,null,"","",null,null,null,null,null,null,11,null,"F ou FET",null,null,null,"Femme Française ou étangère <5pts (Bonus 1,5pt)"]
[null,null,null,null,null,"","","",null,"J",4.5,"DEMONGEOT","F",12,null,"FV",null,null,null,"Femme française ou étrangère  = 5pts (Bonus de 0,5pt)"]
[null,null,null,null,null,"","","",null,null,4,"AKRIM","M",11,null,"Autres possibilités sans Bonus"]
[null,null,null,null,null,"","","",null,"F",4.5,"CLAUSSE","C",17,null,"FID",null,"Pour un joueur à un groupement sportif"]
[null,null,null,null,null,"","",null,null,null,4,"AKRIM","M",21,null,"ET",null,"Pour un joueur étranger "]
[null,null,null,null,null,"","","",null,null,2.5,"COUGOUILLE","V",29,null,"VAL",null,"Masculin français (=5 pts) sans bonus"]
[null,null,null,null,null,"","",null,null,null,5,"KAJGANIC","F",34,null,"R",null,"Tous joueurs révisables en classification (sauf valide)"]
[null,null,null,null,null,"","",null,null,null,5,"BAYARD","A",15,null,null,null,"Pour tous joueurs sans symbole sur la carte de classification"]
[null,null,null,null,null,"","",null,null,null,null,null,null,null,null,"Spécificités Nat 2 et 3 (plus de 55 ans)"]
[null,null,null,null,null,"","",null,null,null,null,null,null,null,null,"S",null,null,null,"Français < 5pts (Bonus de 0,5pt)"]
[null,null,null,null,null,null,null,null,null,null,null,null,null,null,null,"SFID",null,null,null,"Joueurs (FIDET) ou étanger < 5pts (Bonus de 0,5pt)"]
[{"$f":"IF(F32<1,\"\",\"Joueurs ou joueuses étrangers\")","v":""},null,null,null,null,null,null,null,null,null,null,null,null,null,null,"SET"]
[{"$f":"IF(F32=0,\"\",IF(F32>5,\"Trop de joueurs étangers-max 5)\",\"OK\"))","v":""},null,null,null,null,null,null,null,null,null,null,null,null,null,null,"SF",null,null,null,"Femme française  < 5pts (Bonus de 2pts): 1,5pts+0,5pt"]
[null,null,null,null,null,null,null,null,null,null,null,null,null,null,null,"SFET",null,null,null,"Femme étrangère  < 5pts (Bonus de 2pts): 1,5pts+0,5pt"]
[{"$f":"IF(G32<1,\"\",\"Joueurs ou joueuses valides de l'équipe\")","v":""},null,null,null,null,null,null,null,null,null,null,null,null,null,null,"JS",null,null,null,"Jeune français <5pts (Bonus 2pts)"]
[{"$f":"IF(G32=0,\"\",IF(G32>2,\"Trop de valides inscrit sur la feuille-max 1)\",\"OK\"))","v":""},null,null,null,null,null,null,null,null,null,null,null,null,null,null,"JFS",null,null,null,"Jeune française <5pts (Bonus 3pts)"]
[null,null,null,null,null,{"$f":"SUM(F6:F29)","v":0},{"$f":"SUM(G6:G31)","v":0}]

{"sheet":"AMIENS","index":39,"n_rows":32,"n_cols":29,"rows_kept":32,"cut":false,"hidden":false,"merged":[[19,15,19,16],[20,15,20,16],[23,15,23,31],[25,19,26,31],[29,15,29,16],[5,15,6,31],[7,25,8,27],[7,28,8,31],[9,15,10,16],[9,17,10,18],[9,19,10,20],[9,21,10,22],[9,23,10,24],[9,25,9,27],[9,28,9,31],[10,25,10,27],[10,28,10,31],[7,19,8,20],[7,21,8,22],[7,23,8,24],[7,15,8,16],[29,0,29,4],[30,0,30,4],[26,0,26,4],[27,0,27,4],[21,15,21,16],[24,15,24,16],[25,15,25,16],[26,15,26,16],[27,15,27,16],[28,15,28,16],[30,15,30,16],[1,0,2,0],[1,1,2,3],[1,9,1,13],[2,9,2,13],[0,15,0,31],[1,15,4,18],[1,19,1,24],[1,25,1,31],[2,19,3,24],[2,25,3,31],[16,15,16,16],[18,15,18,16],[14,15,14,16],[17,15,17,31],[7,17,8,18],[13,15,13,16],[11,15,11,31],[12,15,12,31],[15,15,15,16]]}
["HSAM AMIENS",null,null,null,null,null,null,null,null,null,null,null,null,null,null,"Saison 2024-2025                                                                      Points en jeu"]
[null,"Joueur(es) participant à la rencontre",null,null,null,null,null,null,null,"Saisir votre liste complète en MAJUSCULES ",null,null,null,null,null,"Nationale 2",null,null,null,"Sans carte spécifique",null,null,null,null,null,"Si cartes de couleurs"]
[null,null,null,null,null,null,null,null,null,"Joueurs(es) qualifié(es) saison 2024 -2025",null,null,null,null,null,null,null,null,null,"15 pts",null,null,null,null,null,"maxi 19 pts"]
[]
["Statuts","Classif.","          Noms      /    Prénoms",null,"Numéros","ET","VALIDE",null,null,"Statuts","Classif.","          Noms      /    Prénoms",null,"Numéros",null,null,null,null,null,"Si >16pts au début du match (+10 pts adversaire)"]
[null,null,null,null,null,{"$f":"IF(A6=\"ET\",1,\"\")","v":""},{"$f":"IF(B6=5,1,\"\")","v":""},null,null,null,1.5,"LAMY","E",4,null,"Avec une date de validité"]
[null,null,null,null,null,{"$f":"IF(A7=\"ET\",1,\"\")","v":""},{"$f":"IF(B7=5,1,\"\")","v":""},null,null,null,null,null,null,5]
[null,null,null,null,null,{"$f":"IF(A8=\"ET\",1,\"\")","v":""},{"$f":"IF(B8=5,1,\"\")","v":""},null,null,"F",4.5,"FONTAINE","E",6,null,"Carte Verte",null,"Carte Jaune",null,"Carte Rose",null,"Carte      Bleue",null,"Carte      Orange",null,"Joueurs(es) valides (5pts)",null,null,"Non Sélectionnables en EDF (hors FIDET)"]
[null,null,null,null,null,"","",null,null,null,5,"LE SAUSSE","K",7]
[null,null,null,null,null,"","",null,null,null,4,"JOLY","R",8,null,"+  1,5",null,"+  2,5",null,"+  1,5",null,"+  0,5",null,"+  0,5",null,"2 sur la feuille ",null,null,"5 sur la feuille"]
[null,null,null,null,null,"","",null,null,null,4,"LEDOUX","C",9,null,null,null,null,null,null,null,null,null,null,null,"2 sur le terrain ",null,null,"4 sur le terrain "]
[null,null,null,null,null,"","",null,null,"JF",3.5,"DIJOUX","M",10,null,"Pour le calcul des points"]
[null,null,null,null,null,"","",null,null,null,1,"ISAMBERT","M",11,null,"Inscrire dans la colonne de gauche le \"Statut\" des joueurs ou joueuses "]
[null,null,null,null,null,"","",null,null,null,4.5,"SECHERESSE","G",12,null,"J",null,null,null,"Jeune joueur débutant (Bonus1,5pt)"]
[null,null,null,null,null,"","",null,null,null,2,"TERNISSIEN","R",13,null,"JF",null,null,null,"Jeune joueuse débutante (Bonus 2,5pt)"]
[null,null,null,null,null,"","",null,null,null,null,null,null,14,null,"F ou FET",null,null,null,"Femme Française ou étrangère <5pts (Bonus 1,5pt)"]
[null,null,null,null,null,"","","",null,null,null,null,null,15,null,"FV",null,null,null,"Femme française ou étrangère  = 5pts (Bonus de 0,5pt)"]
[null,null,null,null,null,"","","",null,null,2,"LECLERCQ","Y",16,null,"Autres possibilités sans Bonus"]
[null,null,null,null,null,"","","",null,null,5,"BARNABE","N",18,null,"FID",null,"Pour un joueur à un groupement sportif"]
[null,null,null,null,null,"","",null,null,null,null,null,null,20,null,"ET",null,"Pour un joueur étranger "]
[null,null,null,null,null,"","","",null,null,null,null,null,null,null,"VAL",null,"Masculin français (=5 pts) sans bonus"]
[null,null,null,null,null,"","",null,null,null,null,null,null,27,null,"R",null,"Tous joueurs révisables en classification (sauf valide)"]
[null,null,null,null,null,"","",null,null,null,null,null,null,null,null,null,null,"Pour tous joueurs sans symbole sur la carte de classification"]
[null,null,null,null,null,"","",null,null,null,null,null,null,null,null,"Spécificités Nat 2 et 3 (plus de 55 ans)"]
[null,null,null,null,null,"","",null,null,null,null,null,null,null,null,"S",null,null,null,"Français < 5pts (Bonus de 0,5pt)"]
[null,null,null,null,null,null,null,null,null,null,null,null,null,null,null,"SFID",null,null,null,"Joueurs (FIDET) ou étanger < 5pts (Bonus de 0,5pt)"]
[{"$f":"IF(F32<1,\"\",\"Joueurs ou joueuses étrangers\")","v":""},null,null,null,null,null,null,null,null,null,null,null,null,null,null,"SET"]
[{"$f":"IF(F32=0,\"\",IF(F32>5,\"Trop de joueurs étangers-max 5)\",\"OK\"))","v":""},null,null,null,null,null,null,null,null,null,null,null,null,null,null,"SF",null,null,null,"Femme française  < 5pts (Bonus de 2pts): 1,5pts+0,5pt"]
[null,null,null,null,null,null,null,null,null,null,null,null,null,null,null,"SFET",null,null,null,"Femme étrangère  < 5pts (Bonus de 2pts): 1,5pts+0,5pt"]
[{"$f":"IF(G32<1,\"\",\"Joueurs ou joueuses valides de l'équipe\")","v":""},null,null,null,null,null,null,null,null,null,null,null,null,null,null,"JS",null,null,null,"Jeune français <5pts (Bonus 2pts)"]
[{"$f":"IF(G32=0,\"\",IF(G32>2,\"Trop de valides inscrit sur la feuille-max 1)\",\"OK\"))","v":""},null,null,null,null,null,null,null,null,null,null,null,null,null,null,"JFS",null,null,null,"Jeune française <5pts (Bonus 3pts)"]
[null,null,null,null,null,{"$f":"SUM(F6:F29)","v":0},{"$f":"SUM(G6:G31)","v":0}]

{"sheet":"AULNOYE","index":40,"n_rows":32,"n_cols":29,"rows_kept":32,"cut":false,"hidden":false,"merged":[[7,17,8,18],[7,19,8,20],[7,21,8,22],[7,23,8,24],[25,19,26,31],[11,15,11,31],[12,15,12,31],[14,15,14,16],[17,15,17,31],[19,15,19,16],[20,15,20,16],[9,23,10,24],[9,25,9,27],[9,28,9,31],[10,25,10,27],[10,28,10,31],[0,15,0,31],[1,15,4,18],[1,19,1,24],[1,25,1,31],[2,19,3,24],[2,25,3,31],[1,0,2,0],[1,1,2,3],[1,9,1,13],[2,9,2,13],[18,15,18,16],[13,15,13,16],[16,15,16,16],[15,15,15,16],[7,15,8,16],[5,15,6,31],[7,25,8,27],[7,28,8,31],[9,15,10,16],[9,17,10,18],[9,19,10,20],[9,21,10,22],[29,0,29,4],[30,0,30,4],[26,0,26,4],[27,0,27,4],[21,15,21,16],[24,15,24,16],[25,15,25,16],[26,15,26,16],[27,15,27,16],[28,15,28,16],[23,15,23,31],[29,15,29,16],[30,15,30,16]]}
["HB AULNOYE AYMERIES",null,null,null,null,null,null,null,null,null,null,null,null,null,null,"Saison 2024-2025                                                                      Points en jeu"]
[null,"Joueur(es) participant à la rencontre",null,null,null,null,null,null,null,"Saisir votre liste complète en MAJUSCULES ",null,null,null,null,null,"Nationale 2",null,null,null,"Sans carte spécifique",null,null,null,null,null,"Si cartes de couleurs"]
[null,null,null,null,null,null,null,null,null,"Joueurs(es) qualifié(es) saison 2024 -2025",null,null,null,null,null,null,null,null,null,"15 pts",null,null,null,null,null,"maxi 19 pts"]
[]
["Statuts","Classif.","          Noms      /    Prénoms",null,"Numéros","ET","VALIDE",null,null,"Statuts","Classif.","          Noms      /    Prénoms",null,"Numéros",null,null,null,null,null,"Si >16pts au début du match (+10 pts adversaire)"]
[null,null,null,null,null,{"$f":"IF(A6=\"ET\",1,\"\")","v":""},{"$f":"IF(B6=5,1,\"\")","v":""},null,null,null,null,null,null,4,null,"Avec une date de validité"]
[null,null,null,null,null,{"$f":"IF(A7=\"ET\",1,\"\")","v":""},{"$f":"IF(B7=5,1,\"\")","v":""},null,null,null,null,null,null,5]
[null,null,null,null,null,{"$f":"IF(A8=\"ET\",1,\"\")","v":""},{"$f":"IF(B8=5,1,\"\")","v":""},null,null,"J",1,"MAIRESSE","D",6,null,"Carte Verte",null,"Carte Jaune",null,"Carte Rose",null,"Carte      Bleue",null,"Carte      Orange",null,"Joueurs(es) valides (5pts)",null,null,"Non Sélectionnables en EDF (hors FIDET)"]
[null,null,null,null,null,"","",null,null,null,1,"CRODRON","C",7]
[null,null,null,null,null,"","",null,null,null,3.5,"SOMME","C",8,null,"+  1,5",null,"+  2,5",null,"+  1,5",null,"+  0,5",null,"+  0,5",null,"2 sur la feuille ",null,null,"5 sur la feuille"]
[null,null,null,null,null,"","",null,null,null,1.5,"ROUSIES","S",9,null,null,null,null,null,null,null,null,null,null,null,"2 sur le terrain ",null,null,"4 sur le terrain "]
[null,null,null,null,null,"","",null,null,null,null,null,null,10,null,"Pour le calcul des points"]
[null,null,null,null,null,"","",null,null,"FV",5,"FOUTERET","M",11,null,"Inscrire dans la colonne de gauche le \"Statut\" des joueurs ou joueuses "]
[null,null,null,null,null,"","",null,null,"S",3,"TASKIN","L",12,null,"J",null,null,null,"Jeune joueur débutant (Bonus1,5pt)"]
[null,null,null,null,null,"","",null,null,"J",4.5,"DEBOOFEDE",0,13,null,"JF",null,null,null,"Jeune joueuse débutante (Bonus 2,5pt)"]
[null,null,null,null,null,"","",null,null,null,5,"COURTIN","M",14,null,"F ou FET",null,null,null,"Femme Française ou étrangère <5pts (Bonus 1,5pt)"]
[null,null,null,null,null,"","","",null,null,4,"BAIJOT","L",15,null,"FV",null,null,null,"Femme française ou étrangère  = 5pts (Bonus de 0,5pt)"]
[null,null,null,null,null,"","","",null,null,null,null,null,null,null,"Autres possibilités sans Bonus"]
[null,null,null,null,null,"","","",null,null,null,null,null,null,null,"FID",null,"Pour un joueur à un groupement sportif"]
[null,null,null,null,null,"","",null,null,null,null,null,null,null,null,"ET",null,"Pour un joueur étranger "]
[null,null,null,null,null,"","","",null,null,null,null,null,null,null,"VAL",null,"Masculin français (=5 pts) sans bonus"]
[null,null,null,null,null,"","",null,null,null,null,null,null,null,null,"R",null,"Tous joueurs révisables en classification (sauf valide)"]
[null,null,null,null,null,"","",null,null,null,null,null,null,null,null,null,null,"Pour tous joueurs sans symbole sur la carte de classification"]
[null,null,null,null,null,"","",null,null,"S",4.5,"PIECHOWIAK","T",null,null,"Spécificités Nat 2 et 3 (plus de 55 ans)"]
[null,null,null,null,null,"","",null,null,null,null,null,null,null,null,"S",null,null,null,"Français < 5pts (Bonus de 0,5pt)"]
[null,null,null,null,null,null,null,null,null,null,null,null,null,null,null,"SFID",null,null,null,"Joueurs (FIDET) ou étanger < 5pts (Bonus de 0,5pt)"]
[{"$f":"IF(F32<1,\"\",\"Joueurs ou joueuses étrangers\")","v":""},null,null,null,null,null,null,null,null,null,null,null,null,null,null,"SET"]
[{"$f":"IF(F32=0,\"\",IF(F32>5,\"Trop de joueurs étangers-max 5)\",\"OK\"))","v":""},null,null,null,null,null,null,null,null,null,null,null,null,null,null,"SF",null,null,null,"Femme française  < 5pts (Bonus de 2pts): 1,5pts+0,5pt"]
[null,null,null,null,null,null,null,null,null,null,null,null,null,null,null,"SFET",null,null,null,"Femme étrangère  < 5pts (Bonus de 2pts): 1,5pts+0,5pt"]
[{"$f":"IF(G32<1,\"\",\"Joueurs ou joueuses valides de l'équipe\")","v":""},null,null,null,null,null,null,null,null,null,null,null,null,null,null,"JS",null,null,null,"Jeune français <5pts (Bonus 2pts)"]
[{"$f":"IF(G32=0,\"\",IF(G32>2,\"Trop de valides inscrit sur la feuille-max 1)\",\"OK\"))","v":""},null,null,null,null,null,null,null,null,null,null,null,null,null,null,"JFS",null,null,null,"Jeune française <5pts (Bonus 3pts)"]
[null,null,null,null,null,{"$f":"SUM(F6:F29)","v":0},{"$f":"SUM(G6:G31)","v":0}]

{"sheet":"CAMBRAI","index":41,"n_rows":32,"n_cols":29,"rows_kept":32,"cut":false,"hidden":false,"merged":[[25,19,26,31],[29,15,29,16],[30,15,30,16],[11,15,11,31],[12,15,12,31],[14,15,14,16],[17,15,17,31],[19,15,19,16],[15,15,15,16],[16,15,16,16],[13,15,13,16],[18,15,18,16],[21,15,21,16],[20,15,20,16],[23,15,23,31],[9,25,9,27],[9,28,9,31],[10,25,10,27],[10,28,10,31],[7,15,8,16],[7,17,8,18],[7,19,8,20],[9,15,10,16],[9,17,10,18],[9,19,10,20],[9,21,10,22],[9,23,10,24],[7,21,8,22],[7,23,8,24],[7,25,8,27],[7,28,8,31],[1,0,2,0],[1,1,2,3],[1,9,1,13],[2,9,2,13],[5,15,6,31],[0,15,0,31],[1,15,4,18],[1,19,1,24],[1,25,1,31],[2,19,3,24],[2,25,3,31],[29,0,29,4],[30,0,30,4],[26,0,26,4],[27,0,27,4],[24,15,24,16],[25,15,25,16],[26,15,26,16],[27,15,27,16],[28,15,28,16]]}
["BF CAMBRAI",null,null,null,null,null,null,null,null,null,null,null,null,null,null,"Saison 2024-2025                                                                      Points en jeu"]
[null,"Joueur(es) participant à la rencontre",null,null,null,null,null,null,null,"Saisir votre liste complète en MAJUSCULES ",null,null,null,null,null,"Nationale 2",null,null,null,"Sans carte spécifique",null,null,null,null,null,"Si cartes de couleurs"]
[null,null,null,null,null,null,null,null,null,"Joueurs(es) qualifié(es) saison 2024 -2025",null,null,null,null,null,null,null,null,null,"15 pts",null,null,null,null,null,"maxi 19 pts"]
[]
["Statuts","Classif.","          Noms      /    Prénoms",null,"Numéros","ET","VALIDE",null,null,"Statuts","Classif.","          Noms      /    Prénoms",null,"Numéros",null,null,null,null,null,"Si >16pts au début du match (+10 pts adversaire)"]
[null,null,null,null,null,{"$f":"IF(A6=\"ET\",1,\"\")","v":""},{"$f":"IF(B6=5,1,\"\")","v":""},null,null,"ET",1,"WEEMAELS","C",4,null,"Avec une date de validité"]
[null,null,null,null,null,{"$f":"IF(A7=\"ET\",1,\"\")","v":""},{"$f":"IF(B7=5,1,\"\")","v":""},null,null,"ET",4,"BAYNE","Y",5]
[null,null,null,null,null,{"$f":"IF(A8=\"ET\",1,\"\")","v":""},{"$f":"IF(B8=5,1,\"\")","v":""},null,null,null,1,"KANIA","Y",6,null,"Carte Verte",null,"Carte Jaune",null,"Carte Rose",null,"Carte      Bleue",null,"Carte      Orange",null,"Joueurs(es) valides (5pts)",null,null,"Non Sélectionnables en EDF (hors FIDET)"]
[null,null,null,null,null,"","",null,null,"ET",2.5,"ETAOUKIL","L",7]
[null,null,null,null,null,"","",null,null,null,null,null,null,8,null,"+  1,5",null,"+  2,5",null,"+  1,5",null,"+  0,5",null,"+  0,5",null,"2 sur la feuille ",null,null,"5 sur la feuille"]
[null,null,null,null,null,"","",null,null,null,1.5,"RESZEL","R",9,null,null,null,null,null,null,null,null,null,null,null,"2 sur le terrain ",null,null,"4 sur le terrain "]
[null,null,null,null,null,"","",null,null,null,5,"CARPENTIER","T",10,null,"Pour le calcul des points"]
[null,null,null,null,null,"","",null,null,null,2,"HONORE","B",11,null,"Inscrire dans la colonne de gauche le \"Statut\" des joueurs ou joueuses "]
[null,null,null,null,null,"","",null,null,null,2.5,"NYBELEN","M",12,null,"J",null,null,null,"Jeune joueur débutant (Bonus1,5pt)"]
[null,null,null,null,null,"","",null,null,"ET",3,"RUBELLI","S",13,null,"JF",null,null,null,"Jeune joueuse débutante (Bonus 2,5pt)"]
[null,null,null,null,null,"","",null,null,"ET",2.5,"ETAOUAKIL","L",14,null,"F ou FET",null,null,null,"Femme Française ou étrangère <5pts (Bonus 1,5pt)"]
[null,null,null,null,null,"","","",null,"ET",1,"JAEGERS","K",15,null,"FV",null,null,null,"Femme Française ou étrangère  = 5pts (Bonus de 0,5pt)"]
[null,null,null,null,null,"","","",null,null,null,null,null,16,null,"Autres possibilités sans Bonus"]
[null,null,null,null,null,"","","",null,null,4,"DEREGNAUCOURT","S",23,null,"FID",null,"Pour un joueur à un groupement sportif"]
[null,null,null,null,null,"","",null,null,null,null,null,null,null,null,"ET",null,"Pour un joueur étranger "]
[null,null,null,null,null,"","","",null,null,null,null,null,null,null,"VAL",null,"Masculin français (=5 pts) sans bonus"]
[null,null,null,null,null,"","",null,null,null,null,null,null,null,null,"R",null,"Tous joueurs révisables en classification (sauf valide)"]
[null,null,null,null,null,"","",null,null,null,null,null,null,null,null,null,null,"Pour tous joueurs sans symbole sur la carte de classification"]
[null,null,null,null,null,"","",null,null,null,null,null,null,null,null,"Spécificités Nat 2 et 3 (plus de 55 ans)"]
[null,null,null,null,null,"","",null,null,null,null,null,null,null,null,"S",null,null,null,"Français < 5pts (Bonus de 0,5pt)"]
[null,null,null,null,null,null,null,null,null,null,null,null,null,null,null,"SFID",null,null,null,"Joueurs (FIDET) ou étanger < 5pts (Bonus de 0,5pt)"]
[{"$f":"IF(F32<1,\"\",\"Joueurs ou joueuses étrangers\")","v":""},null,null,null,null,null,null,null,null,null,null,null,null,null,null,"SET"]
[{"$f":"IF(F32=0,\"\",IF(F32>5,\"Trop de joueurs étangers-max 5)\",\"OK\"))","v":""},null,null,null,null,null,null,null,null,null,null,null,null,null,null,"SF",null,null,null,"Femme française  < 5pts (Bonus de 2pts): 1,5pts+0,5pt"]
[null,null,null,null,null,null,null,null,null,null,null,null,null,null,null,"SFET",null,null,null,"Femme étrangère  < 5pts (Bonus de 2pts): 1,5pts+0,5pt"]
[{"$f":"IF(G32<1,\"\",\"Joueurs ou joueuses valides de l'équipe\")","v":""},null,null,null,null,null,null,null,null,null,null,null,null,null,null,"JS",null,null,null,"Jeune français <5pts (Bonus 2pts)"]
[{"$f":"IF(G32=0,\"\",IF(G32>2,\"Trop de valides inscrit sur la feuille-max 1)\",\"OK\"))","v":""},null,null,null,null,null,null,null,null,null,null,null,null,null,null,"JFS",null,null,null,"Jeune française <5pts (Bonus 3pts)"]
[null,null,null,null,null,{"$f":"SUM(F6:F29)","v":0},{"$f":"SUM(G6:G31)","v":0}]

{"sheet":"POLE NATIONAL","index":42,"n_rows":32,"n_cols":29,"rows_kept":32,"cut":false,"hidden":false,"merged":[[25,19,26,31],[29,15,29,16],[30,15,30,16],[11,15,11,31],[12,15,12,31],[14,15,14,16],[17,15,17,31],[19,15,19,16],[15,15,15,16],[16,15,16,16],[13,15,13,16],[18,15,18,16],[21,15,21,16],[20,15,20,16],[23,15,23,31],[9,25,9,27],[9,28,9,31],[10,25,10,27],[10,28,10,31],[7,15,8,16],[7,17,8,18],[7,19,8,20],[9,15,10,16],[9,17,10,18],[9,19,10,20],[9,21,10,22],[9,23,10,24],[7,21,8,22],[7,23,8,24],[7,25,8,27],[7,28,8,31],[1,0,2,0],[1,1,2,3],[1,9,1,13],[2,9,2,13],[5,15,6,31],[0,15,0,31],[1,15,4,18],[1,19,1,24],[1,25,1,31],[2,19,3,24],[2,25,3,31],[29,0,29,4],[30,0,30,4],[26,0,26,4],[27,0,27,4],[24,15,24,16],[25,15,25,16],[26,15,26,16],[27,15,27,16],[28,15,28,16]]}
["POLE NATIONAL",null,null,null,null,null,null,null,null,null,null,null,null,null,null,"Saison 2024-2025                                                                      Points en jeu"]
[null,"Joueur(es) participant à la rencontre",null,null,null,null,null,null,null,"Saisir votre liste complète en MAJUSCULES ",null,null,null,null,null,"Nationale 2",null,null,null,"Sans carte spécifique",null,null,null,null,null,"Si cartes de couleurs"]
[null,null,null,null,null,null,null,null,null,"Joueurs(es) qualifié(es) saison 2024 -2025",null,null,null,null,null,null,null,null,null,"15 pts",null,null,null,null,null,"maxi 19 pts"]
[]
["Statuts","Classif.","          Noms      /    Prénoms",null,"Numéros","ET","VALIDE",null,null,"Statuts","Classif.","          Noms      /    Prénoms",null,"Numéros",null,null,null,null,null,"Si >16pts au début du match (+10 pts adversaire)"]
[null,null,null,null,null,{"$f":"IF(A6=\"ET\",1,\"\")","v":""},{"$f":"IF(B6=5,1,\"\")","v":""},null,null,"J",3.5,"POLUTELE","N",4,null,"Avec une date de validité"]
[null,null,null,null,null,{"$f":"IF(A7=\"ET\",1,\"\")","v":""},{"$f":"IF(B7=5,1,\"\")","v":""},null,null,"J",3.5,"KOLOSA","J",5]
[null,null,null,null,null,{"$f":"IF(A8=\"ET\",1,\"\")","v":""},{"$f":"IF(B8=5,1,\"\")","v":""},null,null,"JF",3.5,"CLAVIER","M",9,null,"Carte Verte",null,"Carte Jaune",null,"Carte Rose",null,"Carte      Bleue",null,"Carte      Orange",null,"Joueurs(es) valides (5pts)",null,null,"Non Sélectionnables en EDF (hors FIDET)"]
[null,null,null,null,null,"","",null,null,"J",3.5,"LAYER","V",9]
[null,null,null,null,null,"","",null,null,"ET",3.5,"NZITA VANGU","S",10,null,"+  1,5",null,"+  2,5",null,"+  1,5",null,"+  0,5",null,"+  0,5",null,"2 sur la feuille ",null,null,"5 sur la feuille"]
[null,null,null,null,null,"","",null,null,"J",1,"VERLANDE","E",11,null,null,null,null,null,null,null,null,null,null,null,"2 sur le terrain ",null,null,"4 sur le terrain "]
[null,null,null,null,null,"","",null,null,"J",4,"ROGNARD","A",14,null,"Pour le calcul des points"]
[null,null,null,null,null,"","",null,null,"J",4.5,"CAMARA","D",16,null,"Inscrire dans la colonne de gauche le \"Statut\" des joueurs ou joueuses "]
[null,null,null,null,null,"","",null,null,"J",4.5,"DEBARD","C",19,null,"J",null,null,null,"Jeune joueur débutant (Bonus1,5pt)"]
[null,null,null,null,null,"","",null,null,null,null,null,null,null,null,"JF",null,null,null,"Jeune joueuse débutante (Bonus 2,5pt)"]
[null,null,null,null,null,"","",null,null,null,null,null,null,null,null,"F ou FET",null,null,null,"Femme Française ou étangère <5pts (Bonus 1,5pt)"]
[null,null,null,null,null,"","","",null,null,null,null,null,null,null,"FV",null,null,null,"Femme française ou étrangère  = 5pts (Bonus de 0,5pt)"]
[null,null,null,null,null,"","","",null,null,null,null,null,null,null,"Autres possibilités sans Bonus"]
[null,null,null,null,null,"","","",null,null,null,null,null,null,null,"FID",null,"Pour un joueur à un groupement sportif"]
[null,null,null,null,null,"","",null,null,null,null,null,null,null,null,"ET",null,"Pour un joueur étranger "]
[null,null,null,null,null,"","","",null,null,null,null,null,null,null,"VAL",null,"Masculin français (=5 pts) sans bonus"]
[null,null,null,null,null,"","",null,null,null,null,null,null,null,null,"R",null,"Tous joueurs révisables en classification (sauf valide)"]
[null,null,null,null,null,"","",null,null,null,null,null,null,null,null,null,null,"Pour tous joueurs sans symbole sur la carte de classification"]
[null,null,null,null,null,"","",null,null,null,null,null,null,null,null,"Spécificités Nat 2 et 3 (plus de 55 ans)"]
[null,null,null,null,null,"","",null,null,null,null,null,null,null,null,"S",null,null,null,"Français < 5pts (Bonus de 0,5pt)"]
[null,null,null,null,null,null,null,null,null,null,null,null,null,null,null,"SFID",null,null,null,"Joueurs (FIDET) ou étanger < 5pts (Bonus de 0,5pt)"]
[{"$f":"IF(F32<1,\"\",\"Joueurs ou joueuses étrangers\")","v":""},null,null,null,null,null,null,null,null,null,null,null,null,null,null,"SET"]
[{"$f":"IF(F32=0,\"\",IF(F32>5,\"Trop de joueurs étangers-max 5)\",\"OK\"))","v":""},null,null,null,null,null,null,null,null,null,null,null,null,null,null,"SF",null,null,null,"Femme française  < 5pts (Bonus de 2pts): 1,5pts+0,5pt"]
[null,null,null,null,null,null,null,null,null,null,null,null,null,null,null,"SFET",null,null,null,"Femme étrangère  < 5pts (Bonus de 2pts): 1,5pts+0,5pt"]
[{"$f":"IF(G32<1,\"\",\"Joueurs ou joueuses valides de l'équipe\")","v":""},null,null,null,null,null,null,null,null,null,null,null,null,null,null,"JS",null,null,null,"Jeune français <5pts (Bonus 2pts)"]
[{"$f":"IF(G32=0,\"\",IF(G32>2,\"Trop de valides inscrit sur la feuille-max 1)\",\"OK\"))","v":""},null,null,null,null,null,null,null,null,null,null,null,null,null,null,"JFS",null,null,null,"Jeune française <5pts (Bonus 3pts)"]
[null,null,null,null,null,{"$f":"SUM(F6:F29)","v":0},{"$f":"SUM(G6:G31)","v":0}]

{"sheet":"SAINT HERBLAIN","index":43,"n_rows":32,"n_cols":29,"rows_kept":32,"cut":false,"hidden":false,"merged":[[25,19,26,31],[29,15,29,16],[30,15,30,16],[11,15,11,31],[12,15,12,31],[14,15,14,16],[17,15,17,31],[19,15,19,16],[15,15,15,16],[16,15,16,16],[13,15,13,16],[18,15,18,16],[21,15,21,16],[20,15,20,16],[23,15,23,31],[9,25,9,27],[9,28,9,31],[10,25,10,27],[10,28,10,31],[7,15,8,16],[7,17,8,18],[7,19,8,20],[9,15,10,16],[9,17,10,18],[9,19,10,20],[9,21,10,22],[9,23,10,24],[7,21,8,22],[7,23,8,24],[7,25,8,27],[7,28,8,31],[1,0,2,0],[1,1,2,3],[1,9,1,13],[2,9,2,13],[5,15,6,31],[0,15,0,31],[1,15,4,18],[1,19,1,24],[1,25,1,31],[2,19,3,24],[2,25,3,31],[29,0,29,4],[30,0,30,4],[26,0,26,4],[27,0,27,4],[24,15,24,16],[25,15,25,16],[26,15,26,16],[27,15,27,16],[28,15,28,16]]}
["REDA SAINT HERBLAIN",null,null,null,null,null,null,null,null,null,null,null,null,null,null,"Saison 2024-2025                                                                      Points en jeu"]
[null,"Joueur(es) participant à la rencontre",null,null,null,null,null,null,null,"Saisir votre liste complète en MAJUSCULES ",null,null,null,null,null,"Nationale 2",null,null,null,"Sans carte spécifique",null,null,null,null,null,"Si cartes de couleurs"]
[null,null,null,null,null,null,null,null,null,"Joueurs(es) qualifié(es) saison 2024 -2025",null,null,null,null,null,null,null,null,null,"15 pts",null,null,null,null,null,"maxi 19 pts"]
[]
["Statuts","Classif.","          Noms      /    Prénoms",null,"Numéros","ET","VALIDE",null,null,"Statuts","Classif.","          Noms      /    Prénoms",null,"Numéros",null,null,null,null,null,"Si >16pts au début du match (+10 pts adversaire)"]
[null,null,null,null,null,{"$f":"IF(A6=\"ET\",1,\"\")","v":""},{"$f":"IF(B6=5,1,\"\")","v":""},null,null,"ET",2,"HAMMADI","C",4,null,"Avec une date de validité"]
[null,null,null,null,null,{"$f":"IF(A7=\"ET\",1,\"\")","v":""},{"$f":"IF(B7=5,1,\"\")","v":""},null,null,"F",1,"MARCHAND","J",5]
[null,null,null,null,null,{"$f":"IF(A8=\"ET\",1,\"\")","v":""},{"$f":"IF(B8=5,1,\"\")","v":""},null,null,null,5,"FALLOU","E",6,null,"Carte Verte",null,"Carte Jaune",null,"Carte Rose",null,"Carte      Bleue",null,"Carte      Orange",null,"Joueurs(es) valides (5pts)",null,null,"Non Sélectionnables en EDF (hors FIDET)"]
[null,null,null,null,null,"","",null,null,null,5,"MAJECA","M",7]
[null,null,null,null,null,"","",null,null,null,3,"ROBIN","B",8,null,"+  1,5",null,"+  2,5",null,"+  1,5",null,"+  0,5",null,"+  0,5",null,"2 sur la feuille ",null,null,"5 sur la feuille"]
[null,null,null,null,null,"","",null,null,null,4.5,"RENARD","A",9,null,null,null,null,null,null,null,null,null,null,null,"2 sur le terrain ",null,null,"4 sur le terrain "]
[null,null,null,null,null,"","",null,null,"F",4.5,"DAVID","E",10,null,"Pour le calcul des points"]
[null,null,null,null,null,"","",null,null,null,3,"AVRIL","JM",11,null,"Inscrire dans la colonne de gauche le \"Statut\" des joueurs ou joueuses "]
[null,null,null,null,null,"","",null,null,null,4.5,"LE MEUR","D",12,null,"J",null,null,null,"Jeune joueur débutant (Bonus1,5pt)"]
[null,null,null,null,null,"","",null,null,null,4.5,"JUSSO","J",13,null,"JF",null,null,null,"Jeune joueuse débutante (Bonus 2,5pt)"]
[null,null,null,null,null,"","",null,null,null,5,"CAROFF","D",14,null,"F ou FET",null,null,null,"Femme Française ou étangère <5pts (Bonus 1,5pt)"]
[null,null,null,null,null,"","","",null,"ET",4,"MAYOMBO","P",15,null,"FV",null,null,null,"Femme française ou étrangère  = 5pts (Bonus de 0,5pt)"]
[null,null,null,null,null,"","","",null,null,3,"DIXNEUF","L",19,null,"Autres possibilités sans Bonus"]
[null,null,null,null,null,"","","",null,null,null,null,null,null,null,"FID",null,"Pour un joueur à un groupement sportif"]
[null,null,null,null,null,"","",null,null,null,null,null,null,null,null,"ET",null,"Pour un joueur étranger "]
[null,null,null,null,null,"","","",null,null,null,null,null,null,null,"VAL",null,"Masculin français (=5 pts) sans bonus"]
[null,null,null,null,null,"","",null,null,null,null,null,null,null,null,"R",null,"Tous joueurs révisables en classification (sauf valide)"]
[null,null,null,null,null,"","",null,null,null,null,null,null,null,null,null,null,"Pour tous joueurs sans symbole sur la carte de classification"]
[null,null,null,null,null,"","",null,null,null,null,null,null,null,null,"Spécificités Nat 2 et 3 (plus de 55 ans)"]
[null,null,null,null,null,"","",null,null,null,null,null,null,null,null,"S",null,null,null,"Français < 5pts (Bonus de 0,5pt)"]
[null,null,null,null,null,null,null,null,null,null,null,null,null,null,null,"SFID",null,null,null,"Joueurs (FIDET) ou étanger < 5pts (Bonus de 0,5pt)"]
[{"$f":"IF(F32<1,\"\",\"Joueurs ou joueuses étrangers\")","v":""},null,null,null,null,null,null,null,null,null,null,null,null,null,null,"SET"]
[{"$f":"IF(F32=0,\"\",IF(F32>5,\"Trop de joueurs étangers-max 5)\",\"OK\"))","v":""},null,null,null,null,null,null,null,null,null,null,null,null,null,null,"SF",null,null,null,"Femme française  < 5pts (Bonus de 2pts): 1,5pts+0,5pt"]
[null,null,null,null,null,null,null,null,null,null,null,null,null,null,null,"SFET",null,null,null,"Femme étrangère  < 5pts (Bonus de 2pts): 1,5pts+0,5pt"]
[{"$f":"IF(G32<1,\"\",\"Joueurs ou joueuses valides de l'équipe\")","v":""},null,null,null,null,null,null,null,null,null,null,null,null,null,null,"JS",null,null,null,"Jeune français <5pts (Bonus 2pts)"]
[{"$f":"IF(G32=0,\"\",IF(G32>2,\"Trop de valides inscrit sur la feuille-max 1)\",\"OK\"))","v":""},null,null,null,null,null,null,null,null,null,null,null,null,null,null,"JFS",null,null,null,"Jeune française <5pts (Bonus 3pts)"]
[null,null,null,null,null,{"$f":"SUM(F6:F29)","v":0},{"$f":"SUM(G6:G31)","v":0}]

{"sheet":"YFFINIAC","index":44,"n_rows":32,"n_cols":29,"rows_kept":32,"cut":false,"hidden":false,"merged":[[25,19,26,31],[29,15,29,16],[30,15,30,16],[11,15,11,31],[12,15,12,31],[14,15,14,16],[17,15,17,31],[19,15,19,16],[15,15,15,16],[16,15,16,16],[13,15,13,16],[18,15,18,16],[21,15,21,16],[20,15,20,16],[23,15,23,31],[9,25,9,27],[9,28,9,31],[10,25,10,27],[10,28,10,31],[7,15,8,16],[7,17,8,18],[7,19,8,20],[9,15,10,16],[9,17,10,18],[9,19,10,20],[9,21,10,22],[9,23,10,24],[7,21,8,22],[7,23,8,24],[7,25,8,27],[7,28,8,31],[1,0,2,0],[1,1,2,3],[1,9,1,13],[2,9,2,13],[5,15,6,31],[0,15,0,31],[1,15,4,18],[1,19,1,24],[1,25,1,31],[2,19,3,24],[2,25,3,31],[29,0,29,4],[30,0,30,4],[26,0,26,4],[27,0,27,4],[24,15,24,16],[25,15,25,16],[26,15,26,16],[27,15,27,16],[28,15,28,16]]}
["YFFINIAC BF",null,null,null,null,null,null,null,null,null,null,null,null,null,null,"Saison 2024-2025                                                                      Points en jeu"]
[null,"Joueur(es) participant à la rencontre",null,null,null,null,null,null,null,"Saisir votre liste complète en MAJUSCULES ",null,null,null,null,null,"Nationale 2",null,null,null,"Sans carte spécifique",null,null,null,null,null,"Si cartes de couleurs"]
[null,null,null,null,null,null,null,null,null,"Joueurs(es) qualifié(es) saison 2024 -2025",null,null,null,null,null,null,null,null,null,"15 pts",null,null,null,null,null,"maxi 19 pts"]
[]
["Statuts","Classif.","          Noms      /    Prénoms",null,"Numéros","ET","VALIDE",null,null,"Statuts","Classif.","          Noms      /    Prénoms",null,"Numéros",null,null,null,null,null,"Si >16pts au début du match (+10 pts adversaire)"]
[null,null,null,null,null,{"$f":"IF(A6=\"ET\",1,\"\")","v":""},{"$f":"IF(B6=5,1,\"\")","v":""},null,null,null,null,null,null,4,null,"Avec une date de validité"]
[null,null,null,null,null,{"$f":"IF(A7=\"ET\",1,\"\")","v":""},{"$f":"IF(B7=5,1,\"\")","v":""},null,null,null,null,null,null,5]
[null,null,null,null,null,{"$f":"IF(A8=\"ET\",1,\"\")","v":""},{"$f":"IF(B8=5,1,\"\")","v":""},null,null,null,null,null,null,6,null,"Carte Verte",null,"Carte Jaune",null,"Carte Rose",null,"Carte      Bleue",null,"Carte      Orange",null,"Joueurs(es) valides (5pts)",null,null,"Non Sélectionnables en EDF (hors FIDET)"]
[null,null,null,null,null,"","",null,null,"F",1,"COATANTIEC","C",7]
[null,null,null,null,null,"","",null,null,null,null,null,null,8,null,"+  1,5",null,"+  2,5",null,"+  1,5",null,"+  0,5",null,"+  0,5",null,"2 sur la feuille ",null,null,"5 sur la feuille"]
[null,null,null,null,null,"","",null,null,null,2,"QUEMENER","D",9,null,null,null,null,null,null,null,null,null,null,null,"2 sur le terrain ",null,null,"4 sur le terrain "]
[null,null,null,null,null,"","",null,null,null,null,null,null,10,null,"Pour le calcul des points"]
[null,null,null,null,null,"","",null,null,null,4,"FIAULT","M",11,null,"Inscrire dans la colonne de gauche le \"Statut\" des joueurs ou joueuses "]
[null,null,null,null,null,"","",null,null,null,null,null,null,12,null,"J",null,null,null,"Jeune joueur débutant (Bonus1,5pt)"]
[null,null,null,null,null,"","",null,null,null,3.5,"SIEUR","G",13,null,"JF",null,null,null,"Jeune joueuse débutante (Bonus 2,5pt)"]
[null,null,null,null,null,"","",null,null,null,5,"CAROFF","Y",16,null,"F ou FET",null,null,null,"Femme Française ou étangère <5pts (Bonus 1,5pt)"]
[null,null,null,null,null,"","","",null,null,4,"RENEZ","G",29,null,"FV",null,null,null,"Femme française ou étrangère = 5pts (Bonus de 0,5pt)"]
[null,null,null,null,null,"","","",null,"S",4,"REMOND","F",66,null,"Autres possibilités sans Bonus"]
[null,null,null,null,null,"","","",null,null,3,"SABBIO","S",80,null,"FID",null,"Pour un joueur à un groupement sportif"]
[null,null,null,null,null,"","",null,null,null,4.5,"BOUAZIZ","A",99,null,"ET",null,"Pour un joueur étranger "]
[null,null,null,null,null,"","","",null,null,null,null,null,null,null,"VAL",null,"Masculin français (=5 pts) sans bonus"]
[null,null,null,null,null,"","",null,null,null,null,null,null,null,null,"R",null,"Tous joueurs révisables en classification (sauf valide)"]
[null,null,null,null,null,"","",null,null,null,null,null,null,null,null,null,null,"Pour tous joueurs sans symbole sur la carte de classification"]
[null,null,null,null,null,"","",null,null,null,null,null,null,null,null,"Spécificités Nat 2 et 3 (plus de 55 ans)"]
[null,null,null,null,null,"","",null,null,null,null,null,null,null,null,"S",null,null,null,"Français < 5pts (Bonus de 0,5pt)"]
[null,null,null,null,null,null,null,null,null,null,null,null,null,null,null,"SFID",null,null,null,"Joueurs (FIDET) ou étanger < 5pts (Bonus de 0,5pt)"]
[{"$f":"IF(F32<1,\"\",\"Joueurs ou joueuses étrangers\")","v":""},null,null,null,null,null,null,null,null,null,null,null,null,null,null,"SET"]
[{"$f":"IF(F32=0,\"\",IF(F32>5,\"Trop de joueurs étangers-max 5)\",\"OK\"))","v":""},null,null,null,null,null,null,null,null,null,null,null,null,null,null,"SF",null,null,null,"Femme française  < 5pts (Bonus de 2pts): 1,5pts+0,5pt"]
[null,null,null,null,null,null,null,null,null,null,null,null,null,null,null,"SFET",null,null,null,"Femme étrangère  < 5pts (Bonus de 2pts): 1,5pts+0,5pt"]
[{"$f":"IF(G32<1,\"\",\"Joueurs ou joueuses valides de l'équipe\")","v":""},null,null,null,null,null,null,null,null,null,null,null,null,null,null,"JS",null,null,null,"Jeune français <5pts (Bonus 2pts)"]
[{"$f":"IF(G32=0,\"\",IF(G32>2,\"Trop de valides inscrit sur la feuille-max 1)\",\"OK\"))","v":""},null,null,null,null,null,null,null,null,null,null,null,null,null,null,"JFS",null,null,null,"Jeune française <5pts (Bonus 3pts)"]
[null,null,null,null,null,{"$f":"SUM(F6:F29)","v":0},{"$f":"SUM(G6:G31)","v":0}]

{"sheet":"BERCK","index":45,"n_rows":32,"n_cols":29,"rows_kept":32,"cut":false,"hidden":false,"merged":[[1,0,2,0],[1,1,2,3],[1,9,1,13],[2,9,2,13],[7,15,8,16],[5,15,6,31],[7,25,8,27],[7,28,8,31],[30,0,30,4],[26,0,26,4],[27,0,27,4],[24,15,24,16],[25,15,25,16],[26,15,26,16],[27,15,27,16],[29,0,29,4],[30,15,30,16],[28,15,28,16],[29,15,29,16],[23,15,23,31],[25,19,26,31],[7,17,8,18],[7,19,8,20],[7,21,8,22],[7,23,8,24],[9,25,9,27],[10,25,10,27],[13,15,13,16],[9,28,9,31],[10,28,10,31],[9,15,10,16],[9,17,10,18],[9,19,10,20],[9,21,10,22],[9,23,10,24],[0,15,0,31],[1,15,4,18],[1,19,1,24],[1,25,1,31],[2,19,3,24],[2,25,3,31],[11,15,11,31],[12,15,12,31],[15,15,15,16],[14,15,14,16],[18,15,18,16],[19,15,19,16],[20,15,20,16],[16,15,16,16],[17,15,17,31],[21,15,21,16]]}
["AS BERCK Rang du Fliers",null,null,null,null,null,null,null,null,null,null,null,null,null,null,"Saison 2024-2025                                                                      Points en jeu"]
[null,"Joueur(es) participant à la rencontre",null,null,null,null,null,null,null,"Saisir votre liste complète en MAJUSCULES ",null,null,null,null,null,"Nationale 3",null,null,null,"Sans carte spécifique",null,null,null,null,null,"Si cartes de couleurs"]
[null,null,null,null,null,null,null,null,null,"Joueurs(es) qualifié(es) saison 2024 -2025",null,null,null,null,null,null,null,null,null,"15,5 pts",null,null,null,null,null,"maxi 19 pts"]
[]
["Statuts","Classif.","          Noms      /    Prénoms",null,"Numéros","ET","VALIDE",null,null,"Statuts","Classif.","          Noms      /    Prénoms",null,"Numéros",null,null,null,null,null,"Si >16pts au début du match (+10 pts adversaire)"]
[null,null,null,null,null,{"$f":"IF(A6=\"ET\",1,\"\")","v":""},{"$f":"IF(B6=5,1,\"\")","v":""},null,null,null,null,null,null,4,null,"Avec une date de validité"]
[null,null,null,null,null,{"$f":"IF(A7=\"ET\",1,\"\")","v":""},{"$f":"IF(B7=5,1,\"\")","v":""},null,null,null,2.5,"LARRIEU","Q",5]
[null,null,null,null,null,{"$f":"IF(A8=\"ET\",1,\"\")","v":""},{"$f":"IF(B8=5,1,\"\")","v":""},null,null,null,1,"DANIEL","A",6,null,"Carte Verte",null,"Carte Jaune",null,"Carte Rose",null,"Carte      Bleue",null,"Carte      Orange",null,"Joueurs(es) valides (5pts)",null,null,"Non Sélectionnables en EDF (hors FIDET)"]
[null,null,null,null,null,"","",null,null,null,null,null,null,7]
[null,null,null,null,null,"","",null,null,null,null,null,null,8,null,"+  1,5",null,"+  2,5",null,"+  1,5",null,"+  0,5",null,"+  0,5",null,"2 sur la feuille ",null,null,"5 sur la feuille"]
[null,null,null,null,null,"","",null,null,null,null,null,null,9,null,null,null,null,null,null,null,null,null,null,null,"2 sur le terrain ",null,null,"4 sur le terrain "]
[null,null,null,null,null,"","",null,null,null,5,"JOLY","B",10,null,"Pour le calcul des points"]
[null,null,null,null,null,"","",null,null,null,4,"DA VEIGA COSTA","G",11,null,"Inscrire dans la colonne de gauche le \"Statut\" des joueurs ou joueuses "]
[null,null,null,null,null,"","",null,null,"S",4.5,"PLANCKE","R",12,null,"J",null,null,null,"Jeune joueur débutant (Bonus1,5pt)"]
[null,null,null,null,null,"","",null,null,"SF",null,"WAROT",null,13,null,"JF",null,null,null,"Jeune joueuse débutante (Bonus 2,5pt)"]
[null,null,null,null,null,"","",null,null,null,3,"BRIQUET","R",14,null,"F ou FET",null,null,null,"Femme française ou étrangère < 5pts (Bonus 1,5pt)"]
[null,null,null,null,null,"","","",null,"F",3,"MAURIZOT","V",15,null,"FV",null,null,null,"Femme française ou étangère  = 5pts (Bonus de 0,5pt)"]
[null,null,null,null,null,"","","",null,null,null,null,null,16,null,"Autres possibilités sans Bonus"]
[null,null,null,null,null,"","","",null,null,null,null,null,null,null,"FID",null,"Pour un joueur à un groupement sportif"]
[null,null,null,null,null,"","",null,null,null,null,null,null,null,null,"ET",null,"Pour un joueur étranger "]
[null,null,null,null,null,"","","",null,null,null,null,null,null,null,"VAL",null,"Masculin français (=5 pts) sans bonus"]
[null,null,null,null,null,"","",null,null,null,null,null,null,null,null,"R",null,"Tous joueurs révisables en classification (sauf valide)"]
[null,null,null,null,null,"","",null,null,null,null,null,null,null,null,null,null,"Pour tous joueurs sans symbole sur la carte de classification"]
[null,null,null,null,null,"","",null,null,null,null,null,null,null,null,"Spécificités Nat 2 et 3 (plus de 55 ans)"]
[null,null,null,null,null,"","",null,null,null,null,null,null,null,null,"S",null,null,null,"Français < 5pts (Bonus de 0,5pt)"]
[null,null,null,null,null,null,null,null,null,null,null,null,null,null,null,"SFID",null,null,null,"Joueurs (FIDET) ou étanger < 5pts (Bonus de 0,5pt)"]
[{"$f":"IF(F32<1,\"\",\"Joueurs ou joueuses étrangers\")","v":""},null,null,null,null,null,null,null,null,null,null,null,null,null,null,"SET"]
[{"$f":"IF(F32=0,\"\",IF(F32>5,\"Trop de joueurs étangers-max 5)\",\"OK\"))","v":""},null,null,null,null,null,null,null,null,null,null,null,null,null,null,"SF",null,null,null,"Femme française  < 5pts (Bonus de 2pts): 1,5pts+0,5pt"]
[null,null,null,null,null,null,null,null,null,null,null,null,null,null,null,"SFET",null,null,null,"Femme étrangère  < 5pts (Bonus de 2pts): 1,5pts+0,5pt"]
[{"$f":"IF(G32<1,\"\",\"Joueurs ou joueuses valides de l'équipe\")","v":""},null,null,null,null,null,null,null,null,null,null,null,null,null,null,"JS",null,null,null,"Jeune français <5pts (Bonus 2pts)"]
[{"$f":"IF(G32=0,\"\",IF(G32>2,\"Trop de valides inscrit sur la feuille-max 1)\",\"OK\"))","v":""},null,null,null,null,null,null,null,null,null,null,null,null,null,null,"JFS",null,null,null,"Jeune française <5pts (Bonus 3pts)"]
[null,null,null,null,null,{"$f":"SUM(F6:F29)","v":0},{"$f":"SUM(G6:G31)","v":0}]

{"sheet":"CAPSAAA 2","index":46,"n_rows":32,"n_cols":29,"rows_kept":32,"cut":false,"hidden":false,"merged":[[1,9,1,13],[2,9,2,13],[7,21,8,22],[7,23,8,24],[7,25,8,27],[1,15,4,18],[1,19,1,24],[30,0,30,4],[26,0,26,4],[27,0,27,4],[29,0,29,4],[1,0,2,0],[1,1,2,3],[13,15,13,16],[9,15,10,16],[9,17,10,18],[9,19,10,20],[9,21,10,22],[11,15,11,31],[12,15,12,31],[9,23,10,24],[9,25,9,27],[10,25,10,27],[9,28,9,31],[10,28,10,31],[15,15,15,16],[18,15,18,16],[14,15,14,16],[16,15,16,16],[17,15,17,31],[30,15,30,16],[19,15,19,16],[20,15,20,16],[29,15,29,16],[24,15,24,16],[25,15,25,16],[26,15,26,16],[27,15,27,16],[28,15,28,16],[21,15,21,16],[23,15,23,31],[25,19,26,31],[0,15,0,31],[1,25,1,31],[2,25,3,31],[5,15,6,31],[7,28,8,31],[2,19,3,24],[7,15,8,16],[7,17,8,18],[7,19,8,20]]}
["CAPSAAA 2",null,null,null,null,null,null,null,null,null,null,null,null,null,null,"Saison 2024-2025                                                                      Points en jeu"]
[null,"Joueur(es) participant à la rencontre",null,null,null,null,null,null,null,"Saisir votre liste complète en MAJUSCULES ",null,null,null,null,null,"Nationale 3",null,null,null,"Sans carte spécifique",null,null,null,null,null,"Si cartes de couleurs"]
[null,null,null,null,null,null,null,null,null,"Joueurs(es) qualifié(es) saison 2024 -2025",null,null,null,null,null,null,null,null,null,"15,5 pts",null,null,null,null,null,"maxi 19 pts"]
[]
["Statuts","Classif.","          Noms      /    Prénoms",null,"Numéros","ET","VALIDE",null,null,"Statuts","Classif.","          Noms      /    Prénoms",null,"Numéros",null,null,null,null,null,"Si >16pts au début du match (+10 pts adversaire)"]
[null,null,null,null,null,{"$f":"IF(A6=\"ET\",1,\"\")","v":""},{"$f":"IF(B6=5,1,\"\")","v":""},null,null,"S",4,"JALABERT","F",0,null,"Avec une date de validité"]
[null,null,null,null,null,{"$f":"IF(A7=\"ET\",1,\"\")","v":""},{"$f":"IF(B7=5,1,\"\")","v":""},null,null,null,1,"SOUBABE","Y",3]
[null,null,null,null,null,{"$f":"IF(A8=\"ET\",1,\"\")","v":""},{"$f":"IF(B8=5,1,\"\")","v":""},null,null,null,3,"VIGNEAU","C",4,null,"Carte Verte",null,"Carte Jaune",null,"Carte Rose",null,"Carte      Bleue",null,"Carte      Orange",null,"Joueurs(es) valides (5pts)",null,null,"Non Sélectionnables en EDF (hors FIDET)"]
[null,null,null,null,null,"","",null,null,null,5,"ZACCARON","JP",5]
[null,null,null,null,null,"","",null,null,"F",1,"PORET","A",7,null,"+  1,5",null,"+  2,5",null,"+  1,5",null,"+  0,5",null,"+  0,5",null,"2 sur la feuille ",null,null,"5 sur la feuille"]
[null,null,null,null,null,"","",null,null,null,2.5,"PREVOST","N",8,null,null,null,null,null,null,null,null,null,null,null,"2 sur le terrain ",null,null,"4 sur le terrain "]
[null,null,null,null,null,"","",null,null,null,1,"SALEM","R",9,null,"Pour le calcul des points"]
[null,null,null,null,null,"","",null,null,null,2.5,"HADDOU","S",10,null,"Inscrire dans la colonne de gauche le \"Statut\" des joueurs ou joueuses "]
[null,null,null,null,null,"","",null,null,null,null,null,null,8,null,"J",null,null,null,"Jeune joueur débutant (Bonus1,5pt)"]
[null,null,null,null,null,"","",null,null,null,2,"MBAYE","I",12,null,"JF",null,null,null,"Jeune joueuse débutante (Bonus 2,5pt)"]
[null,null,null,null,null,"","",null,null,"J",4,"JARRY","A",11,null,"F ou FET",null,null,null,"Femme française ou étrangère < 5pts (Bonus 1,5pt)"]
[null,null,null,null,null,"","","",null,null,2.5,"YOYOTTE","M",14,null,"FV",null,null,null,"Femme française ou étangère  = 5pts (Bonus de 0,5pt)"]
[null,null,null,null,null,"","","",null,null,null,null,null,15,null,"Autres possibilités sans Bonus"]
[null,null,null,null,null,"","","",null,null,5,"JULVE","M",17,null,"FID",null,"Pour un joueur à un groupement sportif"]
[null,null,null,null,null,"","",null,null,null,5,"COLMERAUER","R",24,null,"ET",null,"Pour un joueur étranger "]
[null,null,null,null,null,"","","",null,"ET",2,"APOLLON","JP",50,null,"VAL",null,"Masculin français (=5 pts) sans bonus"]
[null,null,null,null,null,"","",null,null,"F",1,"D'ACREMONT","A",98,null,"R",null,"Tous joueurs révisables en classification (sauf valide)"]
[null,null,null,null,null,"","",null,null,null,null,null,null,null,null,null,null,"Pour tous joueurs sans symbole sur la carte de classification"]
[null,null,null,null,null,"","",null,null,null,null,null,null,null,null,"Spécificités Nat 2 et 3 (plus de 55 ans)"]
[null,null,null,null,null,"","",null,null,null,null,null,null,null,null,"S",null,null,null,"Français < 5pts (Bonus de 0,5pt)"]
[null,null,null,null,null,null,null,null,null,null,null,null,null,null,null,"SFID",null,null,null,"Joueurs (FIDET) ou étanger < 5pts (Bonus de 0,5pt)"]
[{"$f":"IF(F32<1,\"\",\"Joueurs ou joueuses étrangers\")","v":""},null,null,null,null,null,null,null,null,null,null,null,null,null,null,"SET"]
[{"$f":"IF(F32=0,\"\",IF(F32>5,\"Trop de joueurs étangers-max 5)\",\"OK\"))","v":""},null,null,null,null,null,null,null,null,null,null,null,null,null,null,"SF",null,null,null,"Femme française  < 5pts (Bonus de 2pts): 1,5pts+0,5pt"]
[null,null,null,null,null,null,null,null,null,null,null,null,null,null,null,"SFET",null,null,null,"Femme étrangère  < 5pts (Bonus de 2pts): 1,5pts+0,5pt"]
[{"$f":"IF(G32<1,\"\",\"Joueurs ou joueuses valides de l'équipe\")","v":""},null,null,null,null,null,null,null,null,null,null,null,null,null,null,"JS",null,null,null,"Jeune français <5pts (Bonus 2pts)"]
[{"$f":"IF(G32=0,\"\",IF(G32>2,\"Trop de valides inscrit sur la feuille-max 1)\",\"OK\"))","v":""},null,null,null,null,null,null,null,null,null,null,null,null,null,null,"JFS",null,null,null,"Jeune française <5pts (Bonus 3pts)"]
[null,null,null,null,null,{"$f":"SUM(F6:F29)","v":0},{"$f":"SUM(G6:G31)","v":0}]

{"sheet":"CERGY PONTOISE","index":47,"n_rows":32,"n_cols":29,"rows_kept":32,"cut":false,"hidden":false,"merged":[[1,0,2,0],[1,1,2,3],[1,9,1,13],[2,9,2,13],[7,25,8,27],[7,21,8,22],[5,15,6,31],[1,15,4,18],[1,19,1,24],[2,19,3,24],[30,0,30,4],[26,0,26,4],[27,0,27,4],[29,0,29,4],[7,23,8,24],[15,15,15,16],[18,15,18,16],[9,15,10,16],[9,17,10,18],[9,19,10,20],[9,21,10,22],[9,23,10,24],[7,15,8,16],[7,17,8,18],[7,19,8,20],[11,15,11,31],[29,15,29,16],[30,15,30,16],[14,15,14,16],[19,15,19,16],[24,15,24,16],[25,15,25,16],[26,15,26,16],[27,15,27,16],[28,15,28,16],[20,15,20,16],[17,15,17,31],[21,15,21,16],[23,15,23,31],[25,19,26,31],[9,25,9,27],[10,25,10,27],[16,15,16,16],[0,15,0,31],[1,25,1,31],[2,25,3,31],[7,28,8,31],[9,28,9,31],[10,28,10,31],[12,15,12,31],[13,15,13,16]]}
["CERGY PONTOISE",null,null,null,null,null,null,null,null,null,null,null,null,null,null,"Saison 2024-2025                                                                      Points en jeu"]
[null,"Joueur(es) participant à la rencontre",null,null,null,null,null,null,null,"Saisir votre liste complète en MAJUSCULES ",null,null,null,null,null,"Nationale 3",null,null,null,"Sans carte spécifique",null,null,null,null,null,"Si cartes de couleurs"]
[null,null,null,null,null,null,null,null,null,"Joueurs(es) qualifié(es) saison 2024 -2025",null,null,null,null,null,null,null,null,null,"15,5 pts",null,null,null,null,null,"maxi 19 pts"]
[]
["Statuts","Classif.","          Noms      /    Prénoms",null,"Numéros","ET","VALIDE",null,null,"Statuts","Classif.","          Noms      /    Prénoms",null,"Numéros",null,null,null,null,null,"Si >16pts au début du match (+10 pts adversaire)"]
[null,null,null,null,null,{"$f":"IF(A6=\"ET\",1,\"\")","v":""},{"$f":"IF(B6=5,1,\"\")","v":""},null,null,"J",3,"CHOUASNARD","V",4,null,"Avec une date de validité"]
[null,null,null,null,null,{"$f":"IF(A7=\"ET\",1,\"\")","v":""},{"$f":"IF(B7=5,1,\"\")","v":""},null,null,"S",4,"BENNOUR","C",6]
[null,null,null,null,null,{"$f":"IF(A8=\"ET\",1,\"\")","v":""},{"$f":"IF(B8=5,1,\"\")","v":""},null,null,"ET",1,"DE ANDRADE CADEIRA","C",7,null,"Carte Verte",null,"Carte Jaune",null,"Carte Rose",null,"Carte      Bleue",null,"Carte      Orange",null,"Joueurs(es) valides (5pts)",null,null,"Non Sélectionnables en EDF (hors FIDET)"]
[null,null,null,null,null,"","",null,null,null,4,"DIALLO","M",12]
[null,null,null,null,null,"","",null,null,null,3,"REGNIER","P",12,null,"+  1,5",null,"+  2,5",null,"+  1,5",null,"+  0,5",null,"+  0,5",null,"2 sur la feuille ",null,null,"5 sur la feuille"]
[null,null,null,null,null,"","",null,null,"J",3.5,"N'AT OUAHIM","R",15,null,null,null,null,null,null,null,null,null,null,null,"2 sur le terrain ",null,null,"4 sur le terrain "]
[null,null,null,null,null,"","",null,null,null,1,"CERIVAL","T",15,null,"Pour le calcul des points"]
[null,null,null,null,null,"","",null,null,null,5,"FIRMIN","F",16,null,"Inscrire dans la colonne de gauche le \"Statut\" des joueurs ou joueuses "]
[null,null,null,null,null,"","",null,null,null,null,null,null,null,null,"J",null,null,null,"Jeune joueur débutant (Bonus1,5pt)"]
[null,null,null,null,null,"","",null,null,null,null,null,null,null,null,"JF",null,null,null,"Jeune joueuse débutante (Bonus 2,5pt)"]
[null,null,null,null,null,"","",null,null,null,null,null,null,null,null,"F ou FET",null,null,null,"Femme française ou étrangère < 5pts (Bonus 1,5pt)"]
[null,null,null,null,null,"","","",null,null,null,null,null,null,null,"FV",null,null,null,"Femme française ou étangère  = 5pts (Bonus de 0,5pt)"]
[null,null,null,null,null,"","","",null,null,null,null,null,null,null,"Autres possibilités sans Bonus"]
[null,null,null,null,null,"","","",null,null,null,null,null,null,null,"FID",null,"Pour un joueur à un groupement sportif"]
[null,null,null,null,null,"","",null,null,null,null,null,null,null,null,"ET",null,"Pour un joueur étranger "]
[null,null,null,null,null,"","","",null,null,null,null,null,null,null,"VAL",null,"Masculin français (=5 pts) sans bonus"]
[null,null,null,null,null,"","",null,null,null,null,null,null,null,null,"R",null,"Tous joueurs révisables en classification (sauf valide)"]
[null,null,null,null,null,"","",null,null,null,null,null,null,null,null,null,null,"Pour tous joueurs sans symbole sur la carte de classification"]
[null,null,null,null,null,"","",null,null,null,null,null,null,null,null,"Spécificités Nat 2 et 3 (plus de 55 ans)"]
[null,null,null,null,null,"","",null,null,null,null,null,null,null,null,"S",null,null,null,"Français < 5pts (Bonus de 0,5pt)"]
[null,null,null,null,null,null,null,null,null,null,null,null,null,null,null,"SFID",null,null,null,"Joueurs (FIDET) ou étanger < 5pts (Bonus de 0,5pt)"]
[{"$f":"IF(F32<1,\"\",\"Joueurs ou joueuses étrangers\")","v":""},null,null,null,null,null,null,null,null,null,null,null,null,null,null,"SET"]
[{"$f":"IF(F32=0,\"\",IF(F32>5,\"Trop de joueurs étangers-max 5)\",\"OK\"))","v":""},null,null,null,null,null,null,null,null,null,null,null,null,null,null,"SF",null,null,null,"Femme française  < 5pts (Bonus de 2pts): 1,5pts+0,5pt"]
[null,null,null,null,null,null,null,null,null,null,null,null,null,null,null,"SFET",null,null,null,"Femme étrangère  < 5pts (Bonus de 2pts): 1,5pts+0,5pt"]
[{"$f":"IF(G32<1,\"\",\"Joueurs ou joueuses valides de l'équipe\")","v":""},null,null,null,null,null,null,null,null,null,null,null,null,null,null,"JS",null,null,null,"Jeune français <5pts (Bonus 2pts)"]
[{"$f":"IF(G32=0,\"\",IF(G32>1,\"Trop de valides inscrit sur la feuille-max 1)\",\"OK\"))","v":""},null,null,null,null,null,null,null,null,null,null,null,null,null,null,"JFS",null,null,null,"Jeune française <5pts (Bonus 3pts)"]
[null,null,null,null,null,{"$f":"SUM(F6:F29)","v":0},{"$f":"SUM(G6:G31)","v":0}]

{"sheet":"CHARLEVILLE","index":48,"n_rows":32,"n_cols":29,"rows_kept":32,"cut":false,"hidden":false,"merged":[[0,15,0,31],[1,0,2,0],[1,1,2,3],[1,9,1,13],[1,15,4,18],[1,19,1,24],[1,25,1,31],[2,9,2,13],[2,19,3,24],[2,25,3,31],[14,15,14,16],[15,15,15,16],[16,15,16,16],[5,15,6,31],[7,15,8,16],[7,17,8,18],[7,19,8,20],[7,21,8,22],[7,23,8,24],[7,25,8,27],[7,28,8,31],[13,15,13,16],[9,15,10,16],[9,17,10,18],[9,19,10,20],[9,21,10,22],[9,28,9,31],[10,25,10,27],[10,28,10,31],[11,15,11,31],[12,15,12,31],[9,23,10,24],[9,25,9,27],[17,15,17,31],[18,15,18,16],[20,15,20,16],[21,15,21,16],[23,15,23,31],[19,15,19,16],[24,15,24,16],[25,15,25,16],[25,19,26,31],[30,0,30,4],[30,15,30,16],[26,0,26,4],[26,15,26,16],[27,0,27,4],[27,15,27,16],[28,15,28,16],[29,0,29,4],[29,15,29,16]]}
["CHARLEVILLE",null,null,null,null,null,null,null,null,null,null,null,null,null,null,"Saison 2024-2025                                                                      Points en jeu"]
[null,"Joueur(es) participant à la rencontre",null,null,null,null,null,null,null,"Saisir votre liste complète en MAJUSCULES ",null,null,null,null,null,"Nationale 3",null,null,null,"Sans carte spécifique",null,null,null,null,null,"Si cartes de couleurs"]
[null,null,null,null,null,null,null,null,null,"Joueurs(es) qualifié(es) saison 2024 -2025",null,null,null,null,null,null,null,null,null,"15,5 pts",null,null,null,null,null,"maxi 19 pts"]
[]
["Statuts","Classif.","          Noms      /    Prénoms",null,"Numéros","ET","VALIDE",null,null,"Statuts","Classif.","          Noms      /    Prénoms",null,"Numéros",null,null,null,null,null,"Si >16pts au début du match (+10 pts adversaire)"]
[null,null,null,null,null,{"$f":"IF(A6=\"ET\",1,\"\")","v":""},{"$f":"IF(B6=5,1,\"\")","v":""},null,null,null,5,"TORRES","N",5,null,"Avec une date de validité"]
[null,null,null,null,null,{"$f":"IF(A7=\"ET\",1,\"\")","v":""},{"$f":"IF(B7=5,1,\"\")","v":""},null,null,"J",1.5,"THIRY","K",7]
[null,null,null,null,null,{"$f":"IF(A8=\"ET\",1,\"\")","v":""},{"$f":"IF(B8=5,1,\"\")","v":""},null,null,null,4,"BERTRAND","V",9,null,"Carte Verte",null,"Carte Jaune",null,"Carte Rose",null,"Carte      Bleue",null,"Carte      Orange",null,"Joueurs(es) valides (5pts)",null,null,"Non Sélectionnables en EDF (hors FIDET)"]
[null,null,null,null,null,"","",null,null,null,4.5,"HAMEN","J",10]
[null,null,null,null,null,"","",null,null,"S",3.5,"MARCHEGIANI",null,11,null,"+  1,5",null,"+  2,5",null,"+  1,5",null,"+  0,5",null,"+  0,5",null,"2 sur la feuille ",null,null,"5 sur la feuille"]
[null,null,null,null,null,"","",null,null,"J",1,"MUWHAVONG","M",14,null,null,null,null,null,null,null,null,null,null,null,"2 sur le terrain ",null,null,"4 sur le terrain "]
[null,null,null,null,null,"","",null,null,"S",3.5,"CLADEL","P",15,null,"Pour le calcul des points"]
[null,null,null,null,null,"","",null,null,null,null,null,null,null,null,"Inscrire dans la colonne de gauche le \"Statut\" des joueurs ou joueuses "]
[null,null,null,null,null,"","",null,null,null,null,null,null,null,null,"J",null,null,null,"Jeune joueur débutant (Bonus1,5pt)"]
[null,null,null,null,null,"","",null,null,null,null,null,null,null,null,"JF",null,null,null,"Jeune joueuse débutante (Bonus 2,5pt)"]
[null,null,null,null,null,"","",null,null,null,null,null,null,null,null,"F ou FET",null,null,null,"Femme française ou étrangère < 5pts (Bonus 1,5pt)"]
[null,null,null,null,null,"","","",null,null,null,null,null,null,null,"FV",null,null,null,"Femme française ou étangère  = 5pts (Bonus de 0,5pt)"]
[null,null,null,null,null,"","","",null,null,null,null,null,null,null,"Autres possibilités sans Bonus"]
[null,null,null,null,null,"","","",null,null,null,null,null,null,null,"FID",null,"Pour un joueur à un groupement sportif"]
[null,null,null,null,null,"","",null,null,null,null,null,null,null,null,"ET",null,"Pour un joueur étranger "]
[null,null,null,null,null,"","","",null,null,null,null,null,null,null,"VAL",null,"Masculin français (=5 pts) sans bonus"]
[null,null,null,null,null,"","",null,null,null,null,null,null,null,null,"R",null,"Tous joueurs révisables en classification (sauf valide)"]
[null,null,null,null,null,"","",null,null,null,null,null,null,null,null,null,null,"Pour tous joueurs sans symbole sur la carte de classification"]
[null,null,null,null,null,"","",null,null,null,null,null,null,null,null,"Spécificités Nat 2 et 3 (plus de 55 ans)"]
[null,null,null,null,null,"","",null,null,null,null,null,null,null,null,"S",null,null,null,"Français < 5pts (Bonus de 0,5pt)"]
[null,null,null,null,null,null,null,null,null,null,null,null,null,null,null,"SFID",null,null,null,"Joueurs (FIDET) ou étanger < 5pts (Bonus de 0,5pt)"]
[{"$f":"IF(F32<1,\"\",\"Joueurs ou joueuses étrangers\")","v":""},null,null,null,null,null,null,null,null,null,null,null,null,null,null,"SET"]
[{"$f":"IF(F32=0,\"\",IF(F32>5,\"Trop de joueurs étangers-max 5)\",\"OK\"))","v":""},null,null,null,null,null,null,null,null,null,null,null,null,null,null,"SF",null,null,null,"Femme française  < 5pts (Bonus de 2pts): 1,5pts+0,5pt"]
[null,null,null,null,null,null,null,null,null,null,null,null,null,null,null,"SFET",null,null,null,"Femme étrangère  < 5pts (Bonus de 2pts): 1,5pts+0,5pt"]
[{"$f":"IF(G32<1,\"\",\"Joueurs ou joueuses valides de l'équipe\")","v":""},null,null,null,null,null,null,null,null,null,null,null,null,null,null,"JS",null,null,null,"Jeune français <5pts (Bonus 2pts)"]
[{"$f":"IF(G32=0,\"\",IF(G32>1,\"Trop de valides inscrit sur la feuille-max 1)\",\"OK\"))","v":""},null,null,null,null,null,null,null,null,null,null,null,null,null,null,"JFS",null,null,null,"Jeune française <5pts (Bonus 3pts)"]
[null,null,null,null,null,{"$f":"SUM(F6:F29)","v":0},{"$f":"SUM(G6:G31)","v":0}]

{"sheet":"LILLE 2","index":49,"n_rows":32,"n_cols":29,"rows_kept":32,"cut":false,"hidden":false,"merged":[[1,9,1,13],[2,9,2,13],[7,21,8,22],[7,23,8,24],[7,25,8,27],[1,15,4,18],[1,19,1,24],[30,0,30,4],[26,0,26,4],[27,0,27,4],[29,0,29,4],[1,0,2,0],[1,1,2,3],[13,15,13,16],[9,15,10,16],[9,17,10,18],[9,19,10,20],[9,21,10,22],[11,15,11,31],[12,15,12,31],[9,23,10,24],[9,25,9,27],[10,25,10,27],[9,28,9,31],[10,28,10,31],[15,15,15,16],[18,15,18,16],[14,15,14,16],[16,15,16,16],[17,15,17,31],[30,15,30,16],[19,15,19,16],[20,15,20,16],[29,15,29,16],[24,15,24,16],[25,15,25,16],[26,15,26,16],[27,15,27,16],[28,15,28,16],[21,15,21,16],[23,15,23,31],[25,19,26,31],[0,15,0,31],[1,25,1,31],[2,25,3,31],[5,15,6,31],[7,28,8,31],[2,19,3,24],[7,15,8,16],[7,17,8,18],[7,19,8,20]]}
["LILLE 2",null,null,null,null,null,null,null,null,null,null,null,null,null,null,"Saison 2024-2025                                                                      Points en jeu"]
[null,"Joueur(es) participant à la rencontre",null,null,null,null,null,null,null,"Saisir votre liste complète en MAJUSCULES ",null,null,null,null,null,"Nationale 3",null,null,null,"Sans carte spécifique",null,null,null,null,null,"Si cartes de couleurs"]
[null,null,null,null,null,null,null,null,null,"Joueurs(es) qualifié(es) saison 2024 -2025",null,null,null,null,null,null,null,null,null,"15,5 pts",null,null,null,null,null,"maxi 19 pts"]
[]
["Statuts","Classif.","          Noms      /    Prénoms",null,"Numéros","ET","VALIDE",null,null,"Statuts","Classif.","          Noms      /    Prénoms",null,"Numéros",null,null,null,null,null,"Si >16pts au début du match (+10 pts adversaire)"]
[null,null,null,null,null,{"$f":"IF(A6=\"ET\",1,\"\")","v":""},{"$f":"IF(B6=5,1,\"\")","v":""},null,null,null,null,null,null,4,null,"Avec une date de validité"]
[null,null,null,null,null,{"$f":"IF(A7=\"ET\",1,\"\")","v":""},{"$f":"IF(B7=5,1,\"\")","v":""},null,null,null,2.5,"FARES","A",5]
[null,null,null,null,null,{"$f":"IF(A8=\"ET\",1,\"\")","v":""},{"$f":"IF(B8=5,1,\"\")","v":""},null,null,null,4.5,"BOULET","D",6,null,"Carte Verte",null,"Carte Jaune",null,"Carte Rose",null,"Carte      Bleue",null,"Carte      Orange",null,"Joueurs(es) valides (5pts)",null,null,"Non Sélectionnables en EDF (hors FIDET)"]
[null,null,null,null,null,"","",null,null,null,null,null,null,7]
[null,null,null,null,null,"","",null,null,null,null,null,null,8,null,"+  1,5",null,"+  2,5",null,"+  1,5",null,"+  0,5",null,"+  0,5",null,"2 sur la feuille ",null,null,"5 sur la feuille"]
[null,null,null,null,null,"","",null,null,null,null,null,null,9,null,null,null,null,null,null,null,null,null,null,null,"2 sur le terrain ",null,null,"4 sur le terrain "]
[null,null,null,null,null,"","",null,null,null,2.5,"DE MATOS","T",10,null,"Pour le calcul des points"]
[null,null,null,null,null,"","",null,null,"JF",4.5,"CANAT","J",11,null,"Inscrire dans la colonne de gauche le \"Statut\" des joueurs ou joueuses "]
[null,null,null,null,null,"","",null,null,null,4.5,"BOULET","D",12,null,"J",null,null,null,"Jeune joueur débutant (Bonus1,5pt)"]
[null,null,null,null,null,"","",null,null,null,5,"DURAND","P",13,null,"JF",null,null,null,"Jeune joueuse débutante (Bonus 2,5pt)"]
[null,null,null,null,null,"","",null,null,null,1.5,"BEAUMONT","J",14,null,"F ou FET",null,null,null,"Femme française ou étrangère < 5 pts (Bonus 1,5pt)"]
[null,null,null,null,null,"","","",null,null,null,null,null,15,null,"FV",null,null,null,"Femme française ou étangère  = 5pts (Bonus de 0,5pt)"]
[null,null,null,null,null,"","","",null,"S",4,"GOUZAUT ","C",16,null,"Autres possibilités sans Bonus"]
[null,null,null,null,null,"","","",null,null,null,null,null,17,null,"FID",null,"Pour un joueur à un groupement sportif"]
[null,null,null,null,null,"","",null,null,null,null,null,null,18,null,"ET",null,"Pour un joueur étranger "]
[null,null,null,null,null,"","","",null,"S",1,"ACOSTA","P",19,null,"VAL",null,"Masculin français (=5 pts) sans bonus"]
[null,null,null,null,null,"","",null,null,null,null,null,null,20,null,"R",null,"Tous joueurs révisables en classification (sauf valide)"]
[null,null,null,null,null,"","",null,null,null,null,null,null,98,null,null,null,"Pour tous joueurs sans symbole sur la carte de classification"]
[null,null,null,null,null,"","",null,null,null,null,null,null,null,null,"Spécificités Nat 2 et 3 (plus de 55 ans)"]
[null,null,null,null,null,"","",null,null,null,null,null,null,null,null,"S",null,null,null,"Français < 5pts (Bonus de 0,5pt)"]
[null,null,null,null,null,null,null,null,null,null,null,null,null,null,null,"SFID",null,null,null,"Joueurs (FIDET) ou étanger < 5pts (Bonus de 0,5pt)"]
[{"$f":"IF(F32<1,\"\",\"Joueurs ou joueuses étrangers\")","v":""},null,null,null,null,null,null,null,null,null,null,null,null,null,null,"SET"]
[{"$f":"IF(F32=0,\"\",IF(F32>5,\"Trop de joueurs étangers-max 5)\",\"OK\"))","v":""},null,null,null,null,null,null,null,null,null,null,null,null,null,null,"SF",null,null,null,"Femme française  < 5pts (Bonus de 2pts): 1,5pts+0,5pt"]
[null,null,null,null,null,null,null,null,null,null,null,null,null,null,null,"SFET",null,null,null,"Femme étrangère  < 5pts (Bonus de 2pts): 1,5pts+0,5pt"]
[{"$f":"IF(G32<1,\"\",\"Joueurs ou joueuses valides de l'équipe\")","v":""},null,null,null,null,null,null,null,null,null,null,null,null,null,null,"JS",null,null,null,"Jeune français <5pts (Bonus 2pts)"]
[{"$f":"IF(G32=0,\"\",IF(G32>2,\"Trop de valides inscrit sur la feuille-max 1)\",\"OK\"))","v":""},null,null,null,null,null,null,null,null,null,null,null,null,null,null,"JFS",null,null,null,"Jeune française <5pts (Bonus 3pts)"]
[null,null,null,null,null,{"$f":"SUM(F6:F29)","v":0},{"$f":"SUM(G6:G31)","v":0}]

{"sheet":"ORLEANS","index":50,"n_rows":32,"n_cols":29,"rows_kept":32,"cut":false,"hidden":false,"merged":[[1,9,1,13],[2,9,2,13],[7,21,8,22],[7,23,8,24],[7,25,8,27],[1,15,4,18],[1,19,1,24],[30,0,30,4],[26,0,26,4],[27,0,27,4],[29,0,29,4],[1,0,2,0],[1,1,2,3],[13,15,13,16],[9,15,10,16],[9,17,10,18],[9,19,10,20],[9,21,10,22],[11,15,11,31],[12,15,12,31],[9,23,10,24],[9,25,9,27],[10,25,10,27],[9,28,9,31],[10,28,10,31],[15,15,15,16],[18,15,18,16],[14,15,14,16],[16,15,16,16],[17,15,17,31],[30,15,30,16],[19,15,19,16],[20,15,20,16],[29,15,29,16],[24,15,24,16],[25,15,25,16],[26,15,26,16],[27,15,27,16],[28,15,28,16],[21,15,21,16],[23,15,23,31],[25,19,26,31],[0,15,0,31],[1,25,1,31],[2,25,3,31],[5,15,6,31],[7,28,8,31],[2,19,3,24],[7,15,8,16],[7,17,8,18],[7,19,8,20]]}
["ORLEANS",null,null,null,null,null,null,null,null,null,null,null,null,null,null,"Saison 2024-2025                                                                      Points en jeu"]
[null,"Joueur(es) participant à la rencontre",null,null,null,null,null,null,null,"Saisir votre liste complète en MAJUSCULES ",null,null,null,null,null,"Nationale 3",null,null,null,"Sans carte spécifique",null,null,null,null,null,"Si cartes de couleurs"]
[null,null,null,null,null,null,null,null,null,"Joueurs(es) qualifié(es) saison 2024 -2025",null,null,null,null,null,null,null,null,null,"15,5 pts",null,null,null,null,null,"maxi 19 pts"]
[]
["Statuts","Classif.","          Noms      /    Prénoms",null,"Numéros","ET","VALIDE",null,null,"Statuts","Classif.","          Noms      /    Prénoms",null,"Numéros",null,null,null,null,null,"Si >16pts au début du match (+10 pts adversaire)"]
[null,null,null,null,null,{"$f":"IF(A6=\"ET\",1,\"\")","v":""},{"$f":"IF(B6=5,1,\"\")","v":""},null,null,null,5,"ROCHON","B",4,null,"Avec une date de validité"]
[null,null,null,null,null,{"$f":"IF(A7=\"ET\",1,\"\")","v":""},{"$f":"IF(B7=5,1,\"\")","v":""},null,null,null,null,null,null,5]
[null,null,null,null,null,{"$f":"IF(A8=\"ET\",1,\"\")","v":""},{"$f":"IF(B8=5,1,\"\")","v":""},null,null,null,null,null,null,6,null,"Carte Verte",null,"Carte Jaune",null,"Carte Rose",null,"Carte      Bleue",null,"Carte      Orange",null,"Joueurs(es) valides (5pts)",null,null,"Non Sélectionnables en EDF (hors FIDET)"]
[null,null,null,null,null,"","",null,null,null,null,null,null,7]
[null,null,null,null,null,"","",null,null,null,1.5,"ENG","V",8,null,"+  1,5",null,"+  2,5",null,"+  1,5",null,"+  0,5",null,"+  0,5",null,"2 sur la feuille ",null,null,"5 sur la feuille"]
[null,null,null,null,null,"","",null,null,null,2,"RAJOHNSON","T",9,null,null,null,null,null,null,null,null,null,null,null,"2 sur le terrain ",null,null,"4 sur le terrain "]
[null,null,null,null,null,"","",null,null,null,null,null,null,10,null,"Pour le calcul des points"]
[null,null,null,null,null,"","",null,null,null,null,null,null,11,null,"Inscrire dans la colonne de gauche le \"Statut\" des joueurs ou joueuses "]
[null,null,null,null,null,"","",null,null,null,null,null,null,12,null,"J",null,null,null,"Jeune joueur débutant (Bonus1,5pt)"]
[null,null,null,null,null,"","",null,null,null,4.5,"MURIENTE","E",13,null,"JF",null,null,null,"Jeune joueuse débutante (Bonus 2,5pt)"]
[null,null,null,null,null,"","",null,null,null,4,"MASRANE","S",14,null,"F ou FET",null,null,null,"Femme française ou étrangère < 5pts (Bonus 1,5pt)"]
[null,null,null,null,null,"","","",null,null,2,"LEBRETON","F",15,null,"FV",null,null,null,"Femme française ou étangère  = 5pts (Bonus de 0,5pt)"]
[null,null,null,null,null,"","","",null,null,null,null,null,16,null,"Autres possibilités sans Bonus"]
[null,null,null,null,null,"","","",null,null,5,"RIDOR","J",23,null,"FID",null,"Pour un joueur à un groupement sportif"]
[null,null,null,null,null,"","",null,null,null,null,null,null,null,null,"ET",null,"Pour un joueur étranger "]
[null,null,null,null,null,"","","",null,null,null,null,null,null,null,"VAL",null,"Masculin français (=5 pts) sans bonus"]
[null,null,null,null,null,"","",null,null,null,null,null,null,null,null,"R",null,"Tous joueurs révisables en classification (sauf valide)"]
[null,null,null,null,null,"","",null,null,null,null,null,null,null,null,null,null,"Pour tous joueurs sans symbole sur la carte de classification"]
[null,null,null,null,null,"","",null,null,null,null,null,null,null,null,"Spécificités Nat 2 et 3 (plus de 55 ans)"]
[null,null,null,null,null,"","",null,null,null,null,null,null,null,null,"S",null,null,null,"Français < 5pts (Bonus de 0,5pt)"]
[null,null,null,null,null,null,null,null,null,null,null,null,null,null,null,"SFID",null,null,null,"Joueurs (FIDET) ou étanger < 5pts (Bonus de 0,5pt)"]
[{"$f":"IF(F32<1,\"\",\"Joueurs ou joueuses étrangers\")","v":""},null,null,null,null,null,null,null,null,null,null,null,null,null,null,"SET"]
[{"$f":"IF(F32=0,\"\",IF(F32>5,\"Trop de joueurs étangers-max 5)\",\"OK\"))","v":""},null,null,null,null,null,null,null,null,null,null,null,null,null,null,"SF",null,null,null,"Femme française  < 5pts (Bonus de 2pts): 1,5pts+0,5pt"]
[null,null,null,null,null,null,null,null,null,null,null,null,null,null,null,"SFET",null,null,null,"Femme étrangère  < 5pts (Bonus de 2pts): 1,5pts+0,5pt"]
[{"$f":"IF(G32<1,\"\",\"Joueurs ou joueuses valides de l'équipe\")","v":""},null,null,null,null,null,null,null,null,null,null,null,null,null,null,"JS",null,null,null,"Jeune français <5pts (Bonus 2pts)"]
[{"$f":"IF(G32=0,\"\",IF(G32>2,\"Trop de valides inscrit sur la feuille-max 1)\",\"OK\"))","v":""},null,null,null,null,null,null,null,null,null,null,null,null,null,null,"JFS",null,null,null,"Jeune française <5pts (Bonus 3pts)"]
[null,null,null,null,null,{"$f":"SUM(F6:F29)","v":0},{"$f":"SUM(G6:G31)","v":0}]

{"sheet":"PARIS BASKET","index":51,"n_rows":32,"n_cols":29,"rows_kept":32,"cut":false,"hidden":false,"merged":[[1,9,1,13],[2,9,2,13],[7,21,8,22],[7,23,8,24],[7,25,8,27],[1,15,4,18],[1,19,1,24],[30,0,30,4],[26,0,26,4],[27,0,27,4],[29,0,29,4],[1,0,2,0],[1,1,2,3],[13,15,13,16],[9,15,10,16],[9,17,10,18],[9,19,10,20],[9,21,10,22],[11,15,11,31],[12,15,12,31],[9,23,10,24],[9,25,9,27],[10,25,10,27],[9,28,9,31],[10,28,10,31],[15,15,15,16],[18,15,18,16],[14,15,14,16],[16,15,16,16],[17,15,17,31],[30,15,30,16],[19,15,19,16],[20,15,20,16],[29,15,29,16],[24,15,24,16],[25,15,25,16],[26,15,26,16],[27,15,27,16],[28,15,28,16],[21,15,21,16],[23,15,23,31],[25,19,26,31],[0,15,0,31],[1,25,1,31],[2,25,3,31],[5,15,6,31],[7,28,8,31],[2,19,3,24],[7,15,8,16],[7,17,8,18],[7,19,8,20]]}
["PARIS BASKET",null,null,null,null,null,null,null,null,null,null,null,null,null,null,"Saison 2024-2025                                                                      Points en jeu"]
[null,"Joueur(es) participant à la rencontre",null,null,null,null,null,null,null,"Saisir votre liste complète en MAJUSCULES ",null,null,null,null,null,"Nationale 3",null,null,null,"Sans carte spécifique",null,null,null,null,null,"Si cartes de couleurs"]
[null,null,null,null,null,null,null,null,null,"Joueurs(es) qualifié(es) saison 2024 -2025",null,null,null,null,null,null,null,null,null,"15,5 pts",null,null,null,null,null,"maxi 19 pts"]
[]
["Statuts","Classif.","          Noms      /    Prénoms",null,"Numéros","ET","VALIDE",null,null,"Statuts","Classif.","          Noms      /    Prénoms",null,"Numéros",null,null,null,null,null,"Si >16pts au début du match (+10 pts adversaire)"]
[null,null,null,null,null,{"$f":"IF(A6=\"ET\",1,\"\")","v":""},{"$f":"IF(B6=5,1,\"\")","v":""},null,null,"ET",2.5,"SYLLA","L",0,null,"Avec une date de validité"]
[null,null,null,null,null,{"$f":"IF(A7=\"ET\",1,\"\")","v":""},{"$f":"IF(B7=5,1,\"\")","v":""},null,null,"J",1,"HAMADOU","M",1]
[null,null,null,null,null,{"$f":"IF(A8=\"ET\",1,\"\")","v":""},{"$f":"IF(B8=5,1,\"\")","v":""},null,null,"JF",3.5,"DIALLO","M",2,null,"Carte Verte",null,"Carte Jaune",null,"Carte Rose",null,"Carte      Bleue",null,"Carte      Orange",null,"Joueurs(es) valides (5pts)",null,null,"Non Sélectionnables en EDF (hors FIDET)"]
[null,null,null,null,null,"","",null,null,null,2,"BAALI","I",4]
[null,null,null,null,null,"","",null,null,null,2,"MBAYE","I",5,null,"+  1,5",null,"+  2,5",null,"+  1,5",null,"+  0,5",null,"+  0,5",null,"2 sur la feuille ",null,null,"5 sur la feuille"]
[null,null,null,null,null,"","",null,null,null,5,"BENZENAT","K",6,null,null,null,null,null,null,null,null,null,null,null,"2 sur le terrain ",null,null,"4 sur le terrain "]
[null,null,null,null,null,"","",null,null,null,null,"ALI","F",7,null,"Pour le calcul des points"]
[null,null,null,null,null,"","",null,null,null,null,null,null,8,null,"Inscrire dans la colonne de gauche le \"Statut\" des joueurs ou joueuses "]
[null,null,null,null,null,"","",null,null,null,null,null,null,9,null,"J",null,null,null,"Jeune joueur débutant (Bonus1,5pt)"]
[null,null,null,null,null,"","",null,null,"ET",3,"BAHA","G",10,null,"JF",null,null,null,"Jeune joueuse débutante (Bonus 2,5pt)"]
[null,null,null,null,null,"","",null,null,null,1.5,"FOFANA","B",11,null,"F ou FET",null,null,null,"Femme française ou étrangère < 5pts (Bonus 1,5pt)"]
[null,null,null,null,null,"","","",null,"J",3,"GASSAMA","M",12,null,"FV",null,null,null,"Femme française ou étangère  = 5pts (Bonus de 0,5pt)"]
[null,null,null,null,null,"","","",null,null,1,"HAMACHE","D",24,null,"Autres possibilités sans Bonus"]
[null,null,null,null,null,"","","",null,null,4,"COUVE DE MEURVILLE","J",44,null,"FID",null,"Pour un joueur à un groupement sportif"]
[null,null,null,null,null,"","",null,null,null,null,null,null,null,null,"ET",null,"Pour un joueur étranger "]
[null,null,null,null,null,"","","",null,null,null,null,null,null,null,"VAL",null,"Masculin français (=5 pts) sans bonus"]
[null,null,null,null,null,"","",null,null,"J",2,"SAHAOUI","M",null,null,"R",null,"Tous joueurs révisables en classification (sauf valide)"]
[null,null,null,null,null,"","",null,null,"ET",3.5,"COHAR","L",null,null,null,null,"Pour tous joueurs sans symbole sur la carte de classification"]
[null,null,null,null,null,"","",null,null,"J",4.5,"BOTTE","p",null,null,"Spécificités Nat 2 et 3 (plus de 55 ans)"]
[null,null,null,null,null,"","",null,null,"ET",3,"OUHOCINE","A",null,null,"S",null,null,null,"Français < 5pts (Bonus de 0,5pt)"]
[null,null,null,null,null,null,null,null,null,null,null,null,null,null,null,"SFID",null,null,null,"Joueurs (FIDET) ou étanger < 5pts (Bonus de 0,5pt)"]
[{"$f":"IF(F32<1,\"\",\"Joueurs ou joueuses étrangers\")","v":""},null,null,null,null,null,null,null,null,null,null,null,null,null,null,"SET"]
[{"$f":"IF(F32=0,\"\",IF(F32>5,\"Trop de joueurs étangers-max 5)\",\"OK\"))","v":""},null,null,null,null,null,null,null,null,null,null,null,null,null,null,"SF",null,null,null,"Femme française  < 5pts (Bonus de 2pts): 1,5pts+0,5pt"]
[null,null,null,null,null,null,null,null,null,null,null,null,null,null,null,"SFET",null,null,null,"Femme étrangère  < 5pts (Bonus de 2pts): 1,5pts+0,5pt"]
[{"$f":"IF(G32<1,\"\",\"Joueurs ou joueuses valides de l'équipe\")","v":""},null,null,null,null,null,null,null,null,null,null,null,null,null,null,"JS",null,null,null,"Jeune français <5pts (Bonus 2pts)"]
[{"$f":"IF(G32=0,\"\",IF(G32>2,\"Trop de valides inscrit sur la feuille-max 1)\",\"OK\"))","v":""},null,null,null,null,null,null,null,null,null,null,null,null,null,null,"JFS",null,null,null,"Jeune française <5pts (Bonus 3pts)"]
[null,null,null,null,null,{"$f":"SUM(F6:F29)","v":0},{"$f":"SUM(G6:G31)","v":0}]

{"sheet":"REIMS","index":52,"n_rows":32,"n_cols":29,"rows_kept":32,"cut":false,"hidden":false,"merged":[[1,9,1,13],[2,9,2,13],[7,21,8,22],[7,23,8,24],[7,25,8,27],[1,15,4,18],[1,19,1,24],[30,0,30,4],[26,0,26,4],[27,0,27,4],[29,0,29,4],[1,0,2,0],[1,1,2,3],[13,15,13,16],[9,15,10,16],[9,17,10,18],[9,19,10,20],[9,21,10,22],[11,15,11,31],[12,15,12,31],[9,23,10,24],[9,25,9,27],[10,25,10,27],[9,28,9,31],[10,28,10,31],[15,15,15,16],[18,15,18,16],[14,15,14,16],[16,15,16,16],[17,15,17,31],[30,15,30,16],[19,15,19,16],[20,15,20,16],[29,15,29,16],[24,15,24,16],[25,15,25,16],[26,15,26,16],[27,15,27,16],[28,15,28,16],[21,15,21,16],[23,15,23,31],[25,19,26,31],[0,15,0,31],[1,25,1,31],[2,25,3,31],[5,15,6,31],[7,28,8,31],[2,19,3,24],[7,15,8,16],[7,17,8,18],[7,19,8,20]]}
["ES REIMS",null,null,null,null,null,null,null,null,null,null,null,null,null,null,"Saison 2024-2025                                                                      Points en jeu"]
[null,"Joueur(es) participant à la rencontre",null,null,null,null,null,null,null,"Saisir votre liste complète en MAJUSCULES ",null,null,null,null,null,"Nationale 3",null,null,null,"Sans carte spécifique",null,null,null,null,null,"Si cartes de couleurs"]
[null,null,null,null,null,null,null,null,null,"Joueurs(es) qualifié(es) saison 2024 -2025",null,null,null,null,null,null,null,null,null,"15,5 pts",null,null,null,null,null,"maxi 19 pts"]
[]
["Statuts","Classif.","          Noms      /    Prénoms",null,"Numéros","ET","VALIDE",null,null,"Statuts","Classif.","          Noms      /    Prénoms",null,"Numéros",null,null,null,null,null,"Si >16pts au début du match (+10 pts adversaire)"]
[null,null,null,null,null,{"$f":"IF(A6=\"ET\",1,\"\")","v":""},{"$f":"IF(B6=5,1,\"\")","v":""},null,null,null,5,"GILGENMANN","J",1,null,"Avec une date de validité"]
[null,null,null,null,null,{"$f":"IF(A7=\"ET\",1,\"\")","v":""},{"$f":"IF(B7=5,1,\"\")","v":""},null,null,null,1,"TORVAL","J",2]
[null,null,null,null,null,{"$f":"IF(A8=\"ET\",1,\"\")","v":""},{"$f":"IF(B8=5,1,\"\")","v":""},null,null,"JF",4.5,"DANI","N",3,null,"Carte Verte",null,"Carte Jaune",null,"Carte Rose",null,"Carte      Bleue",null,"Carte      Orange",null,"Joueurs(es) valides (5pts)",null,null,"Non Sélectionnables en EDF (hors FIDET)"]
[null,null,null,null,null,"","",null,null,"J",4.5,"PRIN","P",4]
[null,null,null,null,null,"","",null,null,null,1,"AUFFRET","T",5,null,"+  1,5",null,"+  2,5",null,"+  1,5",null,"+  0,5",null,"+  0,5",null,"2 sur la feuille ",null,null,"5 sur la feuille"]
[null,null,null,null,null,"","",null,null,"J",2.5,"BACK","J",7,null,null,null,null,null,null,null,null,null,null,null,"2 sur le terrain ",null,null,"4 sur le terrain "]
[null,null,null,null,null,"","",null,null,"S",1,"DEPOIVRE","P",8,null,"Pour le calcul des points"]
[null,null,null,null,null,"","",null,null,null,5,"THURIOT","F",9,null,"Inscrire dans la colonne de gauche le \"Statut\" des joueurs ou joueuses "]
[null,null,null,null,null,"","",null,null,null,5,"JUMELLE","D",10,null,"J",null,null,null,"Jeune joueur débutant (Bonus1,5pt)"]
[null,null,null,null,null,"","",null,null,null,5,"HASSAN","N",13,null,"JF",null,null,null,"Jeune joueuse débutante (Bonus 2,5pt)"]
[null,null,null,null,null,"","",null,null,null,4,"SOUFFANE","H",13,null,"F ou FET",null,null,null,"Femme française ou étrangère < 5pts (Bonus 1,5pt)"]
[null,null,null,null,null,"","","",null,"ET",2,"ZAHORULKO","S",14,null,"FV",null,null,null,"Femme française ou étangère  = 5pts (Bonus de 0,5pt)"]
[null,null,null,null,null,"","","",null,null,null,null,null,null,null,"Autres possibilités sans Bonus"]
[null,null,null,null,null,"","","",null,null,null,null,null,null,null,"FID",null,"Pour un joueur à un groupement sportif"]
[null,null,null,null,null,"","",null,null,null,null,null,null,null,null,"ET",null,"Pour un joueur étranger "]
[null,null,null,null,null,"","","",null,null,null,null,null,null,null,"VAL",null,"Masculin français (=5 pts) sans bonus"]
[null,null,null,null,null,"","",null,null,null,null,null,null,null,null,"R",null,"Tous joueurs révisables en classification (sauf valide)"]
[null,null,null,null,null,"","",null,null,null,null,null,null,null,null,null,null,"Pour tous joueurs sans symbole sur la carte de classification"]
[null,null,null,null,null,"","",null,null,null,null,null,null,null,null,"Spécificités Nat 2 et 3 (plus de 55 ans)"]
[null,null,null,null,null,"","",null,null,null,null,null,null,null,null,"S",null,null,null,"Français < 5pts (Bonus de 0,5pt)"]
[null,null,null,null,null,null,null,null,null,null,null,null,null,null,null,"SFID",null,null,null,"Joueurs (FIDET) ou étanger < 5pts (Bonus de 0,5pt)"]
[{"$f":"IF(F32<1,\"\",\"Joueurs ou joueuses étrangers\")","v":""},null,null,null,null,null,null,null,null,null,null,null,null,null,null,"SET"]
[{"$f":"IF(F32=0,\"\",IF(F32>5,\"Trop de joueurs étangers-max 5)\",\"OK\"))","v":""},null,null,null,null,null,null,null,null,null,null,null,null,null,null,"SF",null,null,null,"Femme française  < 5pts (Bonus de 2pts): 1,5pts+0,5pt"]
[null,null,null,null,null,null,null,null,null,null,null,null,null,null,null,"SFET",null,null,null,"Femme étrangère  < 5pts (Bonus de 2pts): 1,5pts+0,5pt"]
[{"$f":"IF(G32<1,\"\",\"Joueurs ou joueuses valides de l'équipe\")","v":""},null,null,null,null,null,null,null,null,null,null,null,null,null,null,"JS",null,null,null,"Jeune français <5pts (Bonus 2pts)"]
[{"$f":"IF(G32=0,\"\",IF(G32>1,\"Trop de valides inscrit sur la feuille-max 1)\",\"OK\"))","v":""},null,null,null,null,null,null,null,null,null,null,null,null,null,null,"JFS",null,null,null,"Jeune française <5pts (Bonus 3pts)"]
[null,null,null,null,null,{"$f":"SUM(F6:F29)","v":0},{"$f":"SUM(G6:G31)","v":0}]

{"sheet":"SUD OISE SPORTS ET HANDICAPS","index":53,"n_rows":32,"n_cols":29,"rows_kept":32,"cut":false,"hidden":false,"merged":[[9,28,9,31],[10,28,10,31],[11,15,11,31],[12,15,12,31],[13,15,13,16],[9,25,9,27],[10,25,10,27],[9,23,10,24],[1,9,1,13],[2,9,2,13],[7,21,8,22],[7,23,8,24],[7,25,8,27],[1,15,4,18],[1,19,1,24],[30,0,30,4],[26,0,26,4],[27,0,27,4],[29,0,29,4],[1,0,2,0],[1,1,2,3],[30,15,30,16],[14,15,14,16],[19,15,19,16],[20,15,20,16],[29,15,29,16],[24,15,24,16],[25,15,25,16],[26,15,26,16],[27,15,27,16],[28,15,28,16],[15,15,15,16],[18,15,18,16],[17,15,17,31],[21,15,21,16],[23,15,23,31],[25,19,26,31],[0,15,0,31],[1,25,1,31],[2,25,3,31],[5,15,6,31],[7,28,8,31],[2,19,3,24],[7,15,8,16],[7,17,8,18],[7,19,8,20],[16,15,16,16],[9,15,10,16],[9,17,10,18],[9,19,10,20],[9,21,10,22]]}
["SUD OISE SPORTS ET HANDICAPS",null,null,null,null,null,null,null,null,null,null,null,null,null,null,"Saison 2024-2025                                                                      Points en jeu"]
[null,"Joueur(es) participant à la rencontre",null,null,null,null,null,null,null,"Saisir votre liste complète en MAJUSCULES ",null,null,null,null,null,"Nationale 3",null,null,null,"Sans carte spécifique",null,null,null,null,null,"Si cartes de couleurs"]
[null,null,null,null,null,null,null,null,null,"Joueurs(es) qualifié(es) saison 2024 -2025",null,null,null,null,null,null,null,null,null,"15,5 pts",null,null,null,null,null,"maxi 19 pts"]
[]
["Statuts","Classif.","          Noms      /    Prénoms",null,"Numéros","ET","VALIDE",null,null,"Statuts","Classif.","          Noms      /    Prénoms",null,"Numéros",null,null,null,null,null,"Si >16pts au début du match (+10 pts adversaire)"]
[null,null,null,null,null,{"$f":"IF(A6=\"ET\",1,\"\")","v":""},{"$f":"IF(B6=5,1,\"\")","v":""},null,null,"F",2,"TRAGER","S",4,null,"Avec une date de validité"]
[null,null,null,null,null,{"$f":"IF(A7=\"ET\",1,\"\")","v":""},{"$f":"IF(B7=5,1,\"\")","v":""},null,null,null,2.5,"DE BARROS","P",5]
[null,null,null,null,null,{"$f":"IF(A8=\"ET\",1,\"\")","v":""},{"$f":"IF(B8=5,1,\"\")","v":""},null,null,null,2,"JOLY","C",6,null,"Carte Verte",null,"Carte Jaune",null,"Carte Rose",null,"Carte      Bleue",null,"Carte      Orange",null,"Joueurs(es) valides (5pts)",null,null,"Non Sélectionnables en EDF (hors FIDET)"]
[null,null,null,null,null,"","",null,null,null,null,null,null,7]
[null,null,null,null,null,"","",null,null,"S",2,"DA SILVA","C",8,null,"+  1,5",null,"+  2,5",null,"+  1,5",null,"+  0,5",null,"+  0,5",null,"2 sur la feuille ",null,null,"5 sur la feuille"]
[null,null,null,null,null,"","",null,null,null,5,"NOIRAULT","C",9,null,null,null,null,null,null,null,null,null,null,null,"2 sur le terrain ",null,null,"4 sur le terrain "]
[null,null,null,null,null,"","",null,null,null,1.5,"DELVOYE","R",10,null,"Pour le calcul des points"]
[null,null,null,null,null,"","",null,null,null,null,null,null,11,null,"Inscrire dans la colonne de gauche le \"Statut\" des joueurs ou joueuses "]
[null,null,null,null,null,"","",null,null,null,5,"MABILLE","M",12,null,"J",null,null,null,"Jeune joueur débutant (Bonus1,5pt)"]
[null,null,null,null,null,"","",null,null,null,1.5,"DESAINT","G",13,null,"JF",null,null,null,"Jeune joueuse débutante (Bonus 2,5pt)"]
[null,null,null,null,null,"","",null,null,null,1,"HENIN","B",14,null,"F ou FET",null,null,null,"Femme française ou étrangère < 5pts (Bonus 1,5pt)"]
[null,null,null,null,null,"","","",null,null,null,null,null,15,null,"FV",null,null,null,"Femme française ou étangère  = 5pts (Bonus de 0,5pt)"]
[null,null,null,null,null,"","","",null,null,null,null,null,16,null,"Autres possibilités sans Bonus"]
[null,null,null,null,null,"","","",null,null,null,null,null,null,null,"FID",null,"Pour un joueur à un groupement sportif"]
[null,null,null,null,null,"","",null,null,null,null,null,null,null,null,"ET",null,"Pour un joueur étranger "]
[null,null,null,null,null,"","","",null,null,null,null,null,null,null,"VAL",null,"Masculin français (=5 pts) sans bonus"]
[null,null,null,null,null,"","",null,null,null,null,null,null,null,null,"R",null,"Tous joueurs révisables en classification (sauf valide)"]
[null,null,null,null,null,"","",null,null,null,null,null,null,null,null,null,null,"Pour tous joueurs sans symbole sur la carte de classification"]
[null,null,null,null,null,"","",null,null,null,null,null,null,null,null,"Spécificités Nat 2 et 3 (plus de 55 ans)"]
[null,null,null,null,null,"","",null,null,null,null,null,null,null,null,"S",null,null,null,"Français < 5pts (Bonus de 0,5pt)"]
[null,null,null,null,null,null,null,null,null,null,null,null,null,null,null,"SFID",null,null,null,"Joueurs (FIDET) ou étanger < 5pts (Bonus de 0,5pt)"]
[{"$f":"IF(F32<1,\"\",\"Joueurs ou joueuses étrangers\")","v":""},null,null,null,null,null,null,null,null,null,null,null,null,null,null,"SET"]
[{"$f":"IF(F32=0,\"\",IF(F32>5,\"Trop de joueurs étangers-max 5)\",\"OK\"))","v":""},null,null,null,null,null,null,null,null,null,null,null,null,null,null,"SF",null,null,null,"Femme française  < 5pts (Bonus de 2pts): 1,5pts+0,5pt"]
[null,null,null,null,null,null,null,null,null,null,null,null,null,null,null,"SFET",null,null,null,"Femme étrangère  < 5pts (Bonus de 2pts): 1,5pts+0,5pt"]
[{"$f":"IF(G32<1,\"\",\"Joueurs ou joueuses valides de l'équipe\")","v":""},null,null,null,null,null,null,null,null,null,null,null,null,null,null,"JS",null,null,null,"Jeune français <5pts (Bonus 2pts)"]
[{"$f":"IF(G32=0,\"\",IF(G32>2,\"Trop de valides inscrit sur la feuille-max 1)\",\"OK\"))","v":""},null,null,null,null,null,null,null,null,null,null,null,null,null,null,"JFS",null,null,null,"Jeune française <5pts (Bonus 3pts)"]
[null,null,null,null,null,{"$f":"SUM(F6:F29)","v":0},{"$f":"SUM(G6:G31)","v":0}]

{"sheet":"VALENCIENNES","index":54,"n_rows":32,"n_cols":29,"rows_kept":32,"cut":false,"hidden":false,"merged":[[9,28,9,31],[10,28,10,31],[16,15,16,16],[17,15,17,31],[21,15,21,16],[13,15,13,16],[11,15,11,31],[12,15,12,31],[9,25,9,27],[10,25,10,27],[9,21,10,22],[9,23,10,24],[24,15,24,16],[25,15,25,16],[23,15,23,31],[25,19,26,31],[1,0,2,0],[1,1,2,3],[1,9,1,13],[2,9,2,13],[9,15,10,16],[9,17,10,18],[9,19,10,20],[19,15,19,16],[20,15,20,16],[14,15,14,16],[15,15,15,16],[18,15,18,16],[30,0,30,4],[26,0,26,4],[27,0,27,4],[29,0,29,4],[30,15,30,16],[29,15,29,16],[26,15,26,16],[27,15,27,16],[28,15,28,16],[0,15,0,31],[1,25,1,31],[2,25,3,31],[5,15,6,31],[7,28,8,31],[7,25,8,27],[1,15,4,18],[2,19,3,24],[7,21,8,22],[7,23,8,24],[7,15,8,16],[7,17,8,18],[7,19,8,20],[1,19,1,24]]}
["ASHH VALENCIENNES",null,null,null,null,null,null,null,null,null,null,null,null,null,null,"Saison 2024-2025                                                                      Points en jeu"]
[null,"Joueur(es) participant à la rencontre",null,null,null,null,null,null,null,"Saisir votre liste complète en MAJUSCULES ",null,null,null,null,null,"Nationale 3",null,null,null,"Sans carte spécifique",null,null,null,null,null,"Si cartes de couleurs"]
[null,null,null,null,null,null,null,null,null,"Joueurs(es) qualifié(es) saison 2024 -2025",null,null,null,null,null,null,null,null,null,"15,5 pts",null,null,null,null,null,"maxi 19 pts"]
[]
["Statuts","Classif.","          Noms      /    Prénoms",null,"Numéros","ET","VALIDE",null,null,"Statuts","Classif.","          Noms      /    Prénoms",null,"Numéros",null,null,null,null,null,"Si >16pts au début du match (+10 pts adversaire)"]
[null,null,null,null,null,{"$f":"IF(A6=\"ET\",1,\"\")","v":""},{"$f":"IF(B6=5,1,\"\")","v":""},null,null,null,null,null,null,4,null,"Avec une date de validité"]
[null,null,null,null,null,{"$f":"IF(A7=\"ET\",1,\"\")","v":""},{"$f":"IF(B7=5,1,\"\")","v":""},null,null,"J",1,"SARRAZIN","R",5]
[null,null,null,null,null,{"$f":"IF(A8=\"ET\",1,\"\")","v":""},{"$f":"IF(B8=5,1,\"\")","v":""},null,null,null,5,"MARCANT","A",6,null,"Carte Verte",null,"Carte Jaune",null,"Carte Rose",null,"Carte      Bleue",null,"Carte      Orange",null,"Joueurs(es) valides (5pts)",null,null,"Non Sélectionnables en EDF (hors FIDET)"]
[null,null,null,null,null,"","",null,null,null,5,"FROMONT","T",7]
[null,null,null,null,null,"","",null,null,null,null,null,null,8,null,"+  1,5",null,"+  2,5",null,"+  1,5",null,"+  0,5",null,"+  0,5",null,"2 sur la feuille ",null,null,"5 sur la feuille"]
[null,null,null,null,null,"","",null,null,null,null,null,null,9,null,null,null,null,null,null,null,null,null,null,null,"2 sur le terrain ",null,null,"4 sur le terrain "]
[null,null,null,null,null,"","",null,null,"S",1,"HAMDAT","A",10,null,"Pour le calcul des points"]
[null,null,null,null,null,"","",null,null,null,null,null,null,11,null,"Inscrire dans la colonne de gauche le \"Statut\" des joueurs ou joueuses "]
[null,null,null,null,null,"","",null,null,"S",3,"LECONTE","D",12,null,"J",null,null,null,"Jeune joueur débutant (Bonus1,5pt)"]
[null,null,null,null,null,"","",null,null,null,null,null,null,13,null,"JF",null,null,null,"Jeune joueuse débutante (Bonus 2,5pt)"]
[null,null,null,null,null,"","",null,null,null,3,"GALAN","L",14,null,"F ou FET",null,null,null,"Femme française ou étrangère < 5pts (Bonus 1,5pt)"]
[null,null,null,null,null,"","","",null,null,null,null,null,15,null,"FV",null,null,null,"Femme française ou étrangère = 5pts (Bonus de 0,5pt)"]
[null,null,null,null,null,"","","",null,null,2,"FAVRY","Y",18,null,"Autres possibilités sans Bonus"]
[null,null,null,null,null,"","","",null,null,4.5,"DESCAR  PENTRIES","N",19,null,"FID",null,"Pour un joueur à un groupement sportif"]
[null,null,null,null,null,"","",null,null,null,null,null,null,20,null,"ET",null,"Pour un joueur étranger "]
[null,null,null,null,null,"","","",null,null,null,null,null,null,null,"VAL",null,"Masculin français (=5 pts) sans bonus"]
[null,null,null,null,null,"","",null,null,null,null,null,null,null,null,"R",null,"Tous joueurs révisables en classification (sauf valide)"]
[null,null,null,null,null,"","",null,null,null,null,null,null,null,null,null,null,"Pour tous joueurs sans symbole sur la carte de classification"]
[null,null,null,null,null,"","",null,null,null,null,null,null,null,null,"Spécificités Nat 2 et 3 (plus de 55 ans)"]
[null,null,null,null,null,"","",null,null,null,null,null,null,null,null,"S",null,null,null,"Français < 5pts (Bonus de 0,5pt)"]
[null,null,null,null,null,null,null,null,null,null,null,null,null,null,null,"SFID",null,null,null,"Joueurs (FIDET) ou étanger < 5pts (Bonus de 0,5pt)"]
[{"$f":"IF(F32<1,\"\",\"Joueurs ou joueuses étrangers\")","v":""},null,null,null,null,null,null,null,null,null,null,null,null,null,null,"SET"]
[{"$f":"IF(F32=0,\"\",IF(F32>5,\"Trop de joueurs étangers-max 5)\",\"OK\"))","v":""},null,null,null,null,null,null,null,null,null,null,null,null,null,null,"SF",null,null,null,"Femme française  < 5pts (Bonus de 2pts): 1,5pts+0,5pt"]
[null,null,null,null,null,null,null,null,null,null,null,null,null,null,null,"SFET",null,null,null,"Femme étrangère  < 5pts (Bonus de 2pts): 1,5pts+0,5pt"]
[{"$f":"IF(G32<1,\"\",\"Joueurs ou joueuses valides de l'équipe\")","v":""},null,null,null,null,null,null,null,null,null,null,null,null,null,null,"JS",null,null,null,"Jeune français <5pts (Bonus 2pts)"]
[{"$f":"IF(G32=0,\"\",IF(G32>2,\"Trop de valides inscrit sur la feuille-max 1)\",\"OK\"))","v":""},null,null,null,null,null,null,null,null,null,null,null,null,null,null,"JFS",null,null,null,"Jeune française <5pts (Bonus 3pts)"]
[null,null,null,null,null,{"$f":"SUM(F6:F29)","v":0},{"$f":"SUM(G6:G31)","v":0}]

{"sheet":"AUXERRE","index":55,"n_rows":32,"n_cols":29,"rows_kept":32,"cut":false,"hidden":false,"merged":[[0,15,0,31],[1,0,2,0],[1,1,2,3],[1,9,1,13],[1,15,4,18],[1,19,1,24],[1,25,1,31],[2,9,2,13],[2,19,3,24],[2,25,3,31],[14,15,14,16],[15,15,15,16],[16,15,16,16],[5,15,6,31],[7,15,8,16],[7,17,8,18],[7,19,8,20],[7,21,8,22],[7,23,8,24],[7,25,8,27],[7,28,8,31],[13,15,13,16],[9,15,10,16],[9,17,10,18],[9,19,10,20],[9,21,10,22],[9,28,9,31],[10,25,10,27],[10,28,10,31],[11,15,11,31],[12,15,12,31],[9,23,10,24],[9,25,9,27],[17,15,17,31],[18,15,18,16],[20,15,20,16],[21,15,21,16],[23,15,23,31],[19,15,19,16],[24,15,24,16],[25,15,25,16],[25,19,26,31],[30,0,30,4],[30,15,30,16],[26,0,26,4],[26,15,26,16],[27,0,27,4],[27,15,27,16],[28,15,28,16],[29,0,29,4],[29,15,29,16]]}
["Stade AUXERROIS",null,null,null,null,null,null,null,null,null,null,null,null,null,null,"Saison 2024-2025                                                                      Points en jeu"]
[null,"Joueur(es) participant à la rencontre",null,null,null,null,null,null,null,"Saisir votre liste complète en MAJUSCULES ",null,null,null,null,null,"Nationale 3",null,null,null,"Sans carte spécifique",null,null,null,null,null,"Si cartes de couleurs"]
[null,null,null,null,null,null,null,null,null,"Joueurs(es) qualifié(es) saison 2024 -2025",null,null,null,null,null,null,null,null,null,"15,5 pts",null,null,null,null,null,"maxi 19 pts"]
[]
["Statuts","Classif.","          Noms      /    Prénoms",null,"Numéros","ET","VALIDE",null,null,"Statuts","Classif.","          Noms      /    Prénoms",null,"Numéros",null,null,null,null,null,"Si >16pts au début du match (+10 pts adversaire)"]
[null,null,null,null,null,{"$f":"IF(A6=\"ET\",1,\"\")","v":""},{"$f":"IF(B6=5,1,\"\")","v":""},null,null,null,null,null,null,4,null,"Avec une date de validité"]
[null,null,null,null,null,{"$f":"IF(A7=\"ET\",1,\"\")","v":""},{"$f":"IF(B7=5,1,\"\")","v":""},null,null,null,1,"LAGHOUITI","S",5]
[null,null,null,null,null,{"$f":"IF(A8=\"ET\",1,\"\")","v":""},{"$f":"IF(B8=5,1,\"\")","v":""},null,null,"S",4,"BONINE","C",7,null,"Carte Verte",null,"Carte Jaune",null,"Carte Rose",null,"Carte      Bleue",null,"Carte      Orange",null,"Joueurs(es) valides (5pts)",null,null,"Non Sélectionnables en EDF (hors FIDET)"]
[null,null,null,null,null,"","",null,null,null,3.5,"TUDOR","A",6]
[null,null,null,null,null,"","",null,null,null,2.5,"ABOUKIR","JD",9,null,"+  1,5",null,"+  2,5",null,"+  1,5",null,"+  0,5",null,"+  0,5",null,"2 sur la feuille ",null,null,"5 sur la feuille"]
[null,null,null,null,null,"","",null,null,null,3.5,"CLAUSTRA","R",12,null,null,null,null,null,null,null,null,null,null,null,"2 sur le terrain ",null,null,"4 sur le terrain "]
[null,null,null,null,null,"","",null,null,"S",4.5,"THEREZO","J",13,null,"Pour le calcul des points"]
[null,null,null,null,null,"","",null,null,"ET",2,"DALI-YOUCEF","N",14,null,"Inscrire dans la colonne de gauche le \"Statut\" des joueurs ou joueuses "]
[null,null,null,null,null,"","",null,null,"F",5,"PICOUET","A",15,null,"J",null,null,null,"Jeune joueur débutant (Bonus1,5pt)"]
[null,null,null,null,null,"","",null,null,"FID",4.5,"NAUMOV","M",24,null,"JF",null,null,null,"Jeune joueuse débutante (Bonus 2,5pt)"]
[null,null,null,null,null,"","",null,null,null,null,null,null,null,null,"F ou FET",null,null,null,"Femme française ou étrangère < 5pts (Bonus 1,5pt)"]
[null,null,null,null,null,"","","",null,null,null,null,null,null,null,"FV",null,null,null,"Femme française ou étrangère = 5pts (Bonus de 0,5pt)"]
[null,null,null,null,null,"","","",null,null,null,null,null,null,null,"Autres possibilités sans Bonus"]
[null,null,null,null,null,"","","",null,null,null,null,null,null,null,"FID",null,"Pour un joueur à un groupement sportif"]
[null,null,null,null,null,"","",null,null,null,null,null,null,null,null,"ET",null,"Pour un joueur étranger "]
[null,null,null,null,null,"","","",null,null,null,null,null,null,null,"VAL",null,"Masculin français (=5 pts) sans bonus"]
[null,null,null,null,null,"","",null,null,null,null,null,null,null,null,"R",null,"Tous joueurs révisables en classification (sauf valide)"]
[null,null,null,null,null,"","",null,null,null,null,null,null,null,null,null,null,"Pour tous joueurs sans symbole sur la carte de classification"]
[null,null,null,null,null,"","",null,null,null,null,null,null,null,null,"Spécificités Nat 2 et 3 (plus de 55 ans)"]
[null,null,null,null,null,"","",null,null,null,null,null,null,null,null,"S",null,null,null,"Français < 5pts (Bonus de 0,5pt)"]
[null,null,null,null,null,null,null,null,null,null,null,null,null,null,null,"SFID",null,null,null,"Joueurs (FIDET) ou étanger < 5pts (Bonus de 0,5pt)"]
[{"$f":"IF(F32<1,\"\",\"Joueurs ou joueuses étrangers\")","v":""},null,null,null,null,null,null,null,null,null,null,null,null,null,null,"SET"]
[{"$f":"IF(F32=0,\"\",IF(F32>5,\"Trop de joueurs étangers-max 5)\",\"OK\"))","v":""},null,null,null,null,null,null,null,null,null,null,null,null,null,null,"SF",null,null,null,"Femme française  < 5pts (Bonus de 2pts): 1,5pts+0,5pt"]
[null,null,null,null,null,null,null,null,null,null,null,null,null,null,null,"SFET",null,null,null,"Femme étrangère  < 5pts (Bonus de 2pts): 1,5pts+0,5pt"]
[{"$f":"IF(G32<1,\"\",\"Joueurs ou joueuses valides de l'équipe\")","v":""},null,null,null,null,null,null,null,null,null,null,null,null,null,null,"JS",null,null,null,"Jeune français <5pts (Bonus 2pts)"]
[{"$f":"IF(G32=0,\"\",IF(G32>2,\"Trop de valides inscrit sur la feuille-max 1)\",\"OK\"))","v":""},null,null,null,null,null,null,null,null,null,null,null,null,null,null,"JFS",null,null,null,"Jeune française <5pts (Bonus 3pts)"]
[null,null,null,null,null,{"$f":"SUM(F6:F29)","v":0},{"$f":"SUM(G6:G31)","v":0}]

{"sheet":"BELFORT","index":56,"n_rows":32,"n_cols":29,"rows_kept":32,"cut":false,"hidden":false,"merged":[[0,15,0,31],[1,0,2,0],[1,1,2,3],[1,9,1,13],[1,15,4,18],[1,19,1,24],[1,25,1,31],[2,9,2,13],[2,19,3,24],[2,25,3,31],[14,15,14,16],[15,15,15,16],[16,15,16,16],[5,15,6,31],[7,15,8,16],[7,17,8,18],[7,19,8,20],[7,21,8,22],[7,23,8,24],[7,25,8,27],[7,28,8,31],[13,15,13,16],[9,15,10,16],[9,17,10,18],[9,19,10,20],[9,21,10,22],[9,28,9,31],[10,25,10,27],[10,28,10,31],[11,15,11,31],[12,15,12,31],[9,23,10,24],[9,25,9,27],[17,15,17,31],[18,15,18,16],[20,15,20,16],[21,15,21,16],[23,15,23,31],[19,15,19,16],[24,15,24,16],[25,15,25,16],[25,19,26,31],[30,0,30,4],[30,15,30,16],[26,0,26,4],[26,15,26,16],[27,0,27,4],[27,15,27,16],[28,15,28,16],[29,0,29,4],[29,15,29,16]]}
["SINAPS BELFORT",null,null,null,null,null,null,null,null,null,null,null,null,null,null,"Saison 2024-2025                                                                      Points en jeu"]
[null,"Joueur(es) participant à la rencontre",null,null,null,null,null,null,null,"Saisir votre liste complète en MAJUSCULES ",null,null,null,null,null,"Nationale 3",null,null,null,"Sans carte spécifique",null,null,null,null,null,"Si cartes de couleurs"]
[null,null,null,null,null,null,null,null,null,"Joueurs(es) qualifié(es) saison 2024 -2025",null,null,null,null,null,null,null,null,null,"15,5 pts",null,null,null,null,null,"maxi 19 pts"]
[]
["Statuts","Classif.","          Noms      /    Prénoms",null,"Numéros","ET","VALIDE",null,null,"Statuts","Classif.","          Noms      /    Prénoms",null,"Numéros",null,null,null,null,null,"Si >16pts au début du match (+10 pts adversaire)"]
[null,null,null,null,null,{"$f":"IF(A6=\"ET\",1,\"\")","v":""},{"$f":"IF(B6=5,1,\"\")","v":""},null,null,null,1,"DJENEDI","R",1,null,"Avec une date de validité"]
[null,null,null,null,null,{"$f":"IF(A7=\"ET\",1,\"\")","v":""},{"$f":"IF(B7=5,1,\"\")","v":""},null,null,"F",3.5,"DOOKUN  LEBER","L",3]
[null,null,null,null,null,{"$f":"IF(A8=\"ET\",1,\"\")","v":""},{"$f":"IF(B8=5,1,\"\")","v":""},null,null,null,5,"ACKERMANN","R",6,null,"Carte Verte",null,"Carte Jaune",null,"Carte Rose",null,"Carte      Bleue",null,"Carte      Orange",null,"Joueurs(es) valides (5pts)",null,null,"Non Sélectionnables en EDF (hors FIDET)"]
[null,null,null,null,null,"","",null,null,null,2.5,"JEANNIN","M",8]
[null,null,null,null,null,"","",null,null,null,5,"CARNET","O",9,null,"+  1,5",null,"+  2,5",null,"+  1,5",null,"+  0,5",null,"+  0,5",null,"2 sur la feuille ",null,null,"5 sur la feuille"]
[null,null,null,null,null,"","",null,null,null,5,"DJENEDI","A",10,null,null,null,null,null,null,null,null,null,null,null,"2 sur le terrain ",null,null,"4 sur le terrain "]
[null,null,null,null,null,"","",null,null,null,null,null,null,null,null,"Pour le calcul des points"]
[null,null,null,null,null,"","",null,null,null,null,null,null,null,null,"Inscrire dans la colonne de gauche le \"Statut\" des joueurs ou joueuses "]
[null,null,null,null,null,"","",null,null,null,null,null,null,null,null,"J",null,null,null,"Jeune joueur débutant (Bonus1,5pt)"]
[null,null,null,null,null,"","",null,null,null,null,null,null,null,null,"JF",null,null,null,"Jeune joueuse débutante (Bonus 2,5pt)"]
[null,null,null,null,null,"","",null,null,null,null,null,null,null,null,"F ou FET",null,null,null,"Femme française ou étrangère < 5pts (Bonus 1,5pt)"]
[null,null,null,null,null,"","","",null,null,null,null,null,null,null,"FV",null,null,null,"Femme française ou étrangère = 5pts (Bonus de 0,5pt)"]
[null,null,null,null,null,"","","",null,null,null,null,null,null,null,"Autres possibilités sans Bonus"]
[null,null,null,null,null,"","","",null,null,null,null,null,null,null,"FID",null,"Pour un joueur à un groupement sportif"]
[null,null,null,null,null,"","",null,null,null,null,null,null,null,null,"ET",null,"Pour un joueur étranger "]
[null,null,null,null,null,"","","",null,null,null,null,null,null,null,"VAL",null,"Masculin français (=5 pts) sans bonus"]
[null,null,null,null,null,"","",null,null,null,null,null,null,null,null,"R",null,"Tous joueurs révisables en classification (sauf valide)"]
[null,null,null,null,null,"","",null,null,null,null,null,null,null,null,null,null,"Pour tous joueurs sans symbole sur la carte de classification"]
[null,null,null,null,null,"","",null,null,null,null,null,null,null,null,"Spécificités Nat 2 et 3 (plus de 55 ans)"]
[null,null,null,null,null,"","",null,null,null,null,null,null,null,null,"S",null,null,null,"Français < 5pts (Bonus de 0,5pt)"]
[null,null,null,null,null,null,null,null,null,null,null,null,null,null,null,"SFID",null,null,null,"Joueurs (FIDET) ou étanger < 5pts (Bonus de 0,5pt)"]
[{"$f":"IF(F32<1,\"\",\"Joueurs ou joueuses étrangers\")","v":""},null,null,null,null,null,null,null,null,null,null,null,null,null,null,"SET"]
[{"$f":"IF(F32=0,\"\",IF(F32>5,\"Trop de joueurs étangers-max 5)\",\"OK\"))","v":""},null,null,null,null,null,null,null,null,null,null,null,null,null,null,"SF",null,null,null,"Femme française  < 5pts (Bonus de 2pts): 1,5pts+0,5pt"]
[null,null,null,null,null,null,null,null,null,null,null,null,null,null,null,"SFET",null,null,null,"Femme étrangère  < 5pts (Bonus de 2pts): 1,5pts+0,5pt"]
[{"$f":"IF(G32<1,\"\",\"Joueurs ou joueuses valides de l'équipe\")","v":""},null,null,null,null,null,null,null,null,null,null,null,null,null,null,"JS",null,null,null,"Jeune français <5pts (Bonus 2pts)"]
[{"$f":"IF(G32=0,\"\",IF(G32>2,\"Trop de valides inscrit sur la feuille-max 1)\",\"OK\"))","v":""},null,null,null,null,null,null,null,null,null,null,null,null,null,null,"JFS",null,null,null,"Jeune française <5pts (Bonus 3pts)"]
[null,null,null,null,null,{"$f":"SUM(F6:F29)","v":0},{"$f":"SUM(G6:G31)","v":0}]

{"sheet":"ENT CHALON DIJON 3","index":57,"n_rows":32,"n_cols":29,"rows_kept":32,"cut":false,"hidden":false,"merged":[[23,15,23,31],[25,19,26,31],[1,0,2,0],[1,1,2,3],[1,9,1,13],[26,0,26,4],[17,15,17,31],[21,15,21,16],[13,15,13,16],[14,15,14,16],[9,19,10,20],[9,21,10,22],[9,23,10,24],[12,15,12,31],[9,25,9,27],[9,28,9,31],[27,0,27,4],[2,9,2,13],[30,0,30,4],[15,15,15,16],[18,15,18,16],[19,15,19,16],[20,15,20,16],[24,15,24,16],[25,15,25,16],[26,15,26,16],[27,15,27,16],[28,15,28,16],[29,15,29,16],[29,0,29,4],[30,15,30,16],[16,15,16,16],[10,25,10,27],[10,28,10,31],[11,15,11,31],[9,15,10,16],[9,17,10,18],[0,15,0,31],[1,25,1,31],[2,25,3,31],[5,15,6,31],[7,28,8,31],[7,25,8,27],[1,15,4,18],[1,19,1,24],[2,19,3,24],[7,15,8,16],[7,17,8,18],[7,19,8,20],[7,21,8,22],[7,23,8,24]]}
["ENT CHALON/DIJON 3",null,null,null,null,null,null,null,null,null,null,null,null,null,null,"Saison 2024-2025                                                                      Points en jeu"]
[null,"Joueur(es) participant à la rencontre",null,null,null,null,null,null,null,"Saisir votre liste complète en MAJUSCULES ",null,null,null,null,null,"Nationale 3",null,null,null,"Sans carte spécifique",null,null,null,null,null,"Si cartes de couleurs"]
[null,null,null,null,null,null,null,null,null,"Joueurs(es) qualifié(es) saison 2024 -2025",null,null,null,null,null,null,null,null,null,"15,5 pts",null,null,null,null,null,"maxi 19 pts"]
[]
["Statuts","Classif.","          Noms      /    Prénoms",null,"Numéros","ET","VALIDE",null,null,"Statuts","Classif.","          Noms      /    Prénoms",null,"Numéros",null,null,null,null,null,"Si >16pts au début du match (+10 pts adversaire)"]
[null,null,null,null,null,{"$f":"IF(A6=\"ET\",1,\"\")","v":""},{"$f":"IF(B6=5,1,\"\")","v":""},null,null,"JF",3,"ERNEST AUGUSTIN","M",4,null,"Avec une date de validité"]
[null,null,null,null,null,{"$f":"IF(A7=\"ET\",1,\"\")","v":""},{"$f":"IF(B7=5,1,\"\")","v":""},null,null,"J",4,"LEFEVRE NIEDERER","S",5]
[null,null,null,null,null,{"$f":"IF(A8=\"ET\",1,\"\")","v":""},{"$f":"IF(B8=5,1,\"\")","v":""},null,null,"J",1.5,"BOUDIER","V",6,null,"Carte Verte",null,"Carte Jaune",null,"Carte Rose",null,"Carte      Bleue",null,"Carte      Orange",null,"Joueurs(es) valides (5pts)",null,null,"Non Sélectionnables en EDF (hors FIDET)"]
[null,null,null,null,null,"","",null,null,"J",4.5,"VOIRIN","N",7]
[null,null,null,null,null,"","",null,null,null,4,"NIEDERER","S",8,null,"+  1,5",null,"+  2,5",null,"+  1,5",null,"+  0,5",null,"+  0,5",null,"2 sur la feuille ",null,null,"5 sur la feuille"]
[null,null,null,null,null,"","",null,null,null,5,"LORDEL","B",9,null,null,null,null,null,null,null,null,null,null,null,"2 sur le terrain ",null,null,"4 sur le terrain "]
[null,null,null,null,null,"","",null,null,null,5,"BEAUDROT","L",10,null,"Pour le calcul des points"]
[null,null,null,null,null,"","",null,null,null,1,"BAUER","A",11,null,"Inscrire dans la colonne de gauche le \"Statut\" des joueurs ou joueuses "]
[null,null,null,null,null,"","",null,null,"JF",1,"ROSYER","C",12,null,"J",null,null,null,"Jeune joueur débutant (Bonus1,5pt)"]
[null,null,null,null,null,"","",null,null,"J",2,"BERRAD","A",13,null,"JF",null,null,null,"Jeune joueuse débutante (Bonus 2,5pt)"]
[null,null,null,null,null,"","",null,null,null,null,null,null,14,null,"F ou FET",null,null,null,"Femme française ou étrangère < 5pts (Bonus 1,5pt)"]
[null,null,null,null,null,"","","",null,null,4.5,"DELEMME","M",15,null,"FV",null,null,null,"Femme française ou étrangère = 5pts (Bonus de 0,5pt)"]
[null,null,null,null,null,"","","",null,null,null,null,null,16,null,"Autres possibilités sans Bonus"]
[null,null,null,null,null,"","","",null,null,null,null,null,17,null,"FID",null,"Pour un joueur à un groupement sportif"]
[null,null,null,null,null,"","",null,null,null,null,null,null,18,null,"ET",null,"Pour un joueur étranger "]
[null,null,null,null,null,"","","",null,"F",1.5,"HILT","I",19,null,"VAL",null,"Masculin français (=5 pts) sans bonus"]
[null,null,null,null,null,"","",null,null,null,null,null,null,20,null,"R",null,"Tous joueurs révisables en classification (sauf valide)"]
[null,null,null,null,null,"","",null,null,"F",2,"NOLET","L",28,null,null,null,"Pour tous joueurs sans symbole sur la carte de classification"]
[null,null,null,null,null,"","",null,null,null,null,null,null,null,null,"Spécificités Nat 2 et 3 (plus de 55 ans)"]
[null,null,null,null,null,"","",null,null,null,null,null,null,null,null,"S",null,null,null,"Français < 5pts (Bonus de 0,5pt)"]
[null,null,null,null,null,null,null,null,null,null,null,null,null,null,null,"SFID",null,null,null,"Joueurs (FIDET) ou étanger < 5pts (Bonus de 0,5pt)"]
[{"$f":"IF(F32<1,\"\",\"Joueurs ou joueuses étrangers\")","v":""},null,null,null,null,null,null,null,null,null,null,null,null,null,null,"SET"]
[{"$f":"IF(F32=0,\"\",IF(F32>5,\"Trop de joueurs étangers-max 5)\",\"OK\"))","v":""},null,null,null,null,null,null,null,null,null,null,null,null,null,null,"SF",null,null,null,"Femme française  < 5pts (Bonus de 2pts): 1,5pts+0,5pt"]
[null,null,null,null,null,null,null,null,null,null,null,null,null,null,null,"SFET",null,null,null,"Femme étrangère  < 5pts (Bonus de 2pts): 1,5pts+0,5pt"]
[{"$f":"IF(G32<1,\"\",\"Joueurs ou joueuses valides de l'équipe\")","v":""},null,null,null,null,null,null,null,null,null,null,null,null,null,null,"JS",null,null,null,"Jeune français <5pts (Bonus 2pts)"]
[{"$f":"IF(G32=0,\"\",IF(G32>2,\"Trop de valides inscrit sur la feuille-max 1)\",\"OK\"))","v":""},null,null,null,null,null,null,null,null,null,null,null,null,null,null,"JFS",null,null,null,"Jeune française <5pts (Bonus 3pts)"]
[null,null,null,null,null,{"$f":"SUM(F6:F29)","v":0},{"$f":"SUM(G6:G31)","v":0}]

{"sheet":"JARNY ","index":58,"n_rows":32,"n_cols":29,"rows_kept":32,"cut":false,"hidden":false,"merged":[[0,15,0,30],[1,0,2,0],[1,1,2,3],[1,9,1,13],[1,15,4,18],[1,19,1,24],[1,25,1,30],[2,9,2,13],[2,19,3,24],[2,25,3,30],[16,15,16,30],[17,15,17,16],[18,15,18,16],[5,15,6,30],[7,15,8,16],[7,17,8,18],[7,19,8,20],[7,21,8,22],[7,23,8,24],[7,25,8,27],[7,28,8,30],[15,15,15,16],[9,15,10,16],[9,17,10,18],[9,19,10,20],[9,21,10,22],[9,28,10,30],[11,15,11,30],[12,15,12,30],[13,15,13,16],[14,15,14,16],[9,23,10,24],[9,25,10,27],[19,15,19,16],[20,15,20,16],[30,0,30,4],[30,15,30,16],[23,15,23,16],[24,15,24,16],[28,15,28,16],[29,0,29,4],[29,15,29,16],[22,15,22,30],[24,19,25,30],[25,15,25,16],[26,0,26,4],[26,15,26,16],[27,0,27,4],[27,15,27,16]]}
["PHOENIX  JARNY",null,null,null,null,null,null,null,null,null,null,null,null,null,null,"Saison 2024-2025                                                                      Points en jeu"]
[null,"Joueur(es) participant à la rencontre",null,null,null,null,null,null,null,"Saisir votre liste complète en MAJUSCULES ",null,null,null,null,null,"Nationale 3",null,null,null,"Sans carte spécifique",null,null,null,null,null,"Si cartes de couleurs"]
[null,null,null,null,null,null,null,null,null,"Joueurs(es) qualifié(es) saison 2024 -2025",null,null,null,null,null,null,null,null,null,"15,5 pts",null,null,null,null,null,"maxi 19 pts"]
[]
["Statuts","Classif.","          Noms      /    Prénoms",null,"Numéros","ET","VALIDE",null,null,"Statuts","Classif.","          Noms      /    Prénoms",null,"Numéros",null,null,null,null,null,"Si >16pts au début du match (+10 pts adversaire)"]
[null,null,null,null,null,{"$f":"IF(A6=\"ET\",1,\"\")","v":""},{"$f":"IF(B6=5,1,\"\")","v":""},null,null,"J",4,"MULLER","M",4,null,"Avec une date de validité"]
[null,null,null,null,null,{"$f":"IF(A7=\"ET\",1,\"\")","v":""},{"$f":"IF(B7=5,1,\"\")","v":""},null,null,null,null,null,null,5]
[null,null,null,null,null,{"$f":"IF(A8=\"ET\",1,\"\")","v":""},{"$f":"IF(B8=5,1,\"\")","v":""},null,null,"N",5,"ALBERTINI","J",6,null,"Carte Verte",null,"Carte Jaune",null,"Carte Rose",null,"Carte      Bleue",null,"Carte      Orange",null,"Joueurs(es) valides (5pts)",null,null,"Non Sélectionnables en EDF (hors FIDET)"]
[null,null,null,null,null,"","",null,null,null,null,null,null,7]
[null,null,null,null,null,"","",null,null,"N",1,"BALDIN","L",8,null,"+  1,5",null,"+  2,5",null,"+  1,5",null,"+  0,5",null,"+  0,5",null,"2 sur la feuille  2 sur le terrain",null,null,"5 sur la feuille  4 sur le terrain"]
[null,null,null,null,null,"","",null,null,null,2.5,"MAACHE","K",9]
[null,null,null,null,null,"","",null,null,"S",2.5,"LOUIS","R",10,null,"Pour le calcul des points"]
[null,null,null,null,null,"","",null,null,null,null,null,null,11,null,"Inscrire dans la colonne de gauche le \"Statut\" des joueurs ou joueuses "]
[null,null,null,null,null,"","",null,null,"N",1,"FERRI","G",12,null,"J",null,null,null,"Jeune joueur débutant (Bonus1,5pt)"]
[null,null,null,null,null,"","",null,null,"N",5,"LOUIS","J",13,null,"JF",null,null,null,"Jeune joueuse débutante (Bonus 2,5pt)"]
[null,null,null,null,null,"","",null,null,null,null,null,null,14,null,"F ou FET",null,null,null,"Pour une femme Française ou étangère <5pts (Bonus 1,5pt)"]
[null,null,null,null,null,"","","",null,null,null,null,null,15,null,"Autres possibilités sans Bonus"]
[null,null,null,null,null,"","","",null,null,null,null,null,16,null,"FID",null,"Pour un joueur à un groupement sportif"]
[null,null,null,null,null,"","","",null,null,null,null,null,17,null,"ET",null,"Pour un joueur étranger <55ans"]
[null,null,null,null,null,"","",null,null,null,null,null,null,18,null,"VAL",null,"Masculin français sans bonus"]
[null,null,null,null,null,"","","",null,null,null,null,null,19,null,"R",null,"Tous joueurs révisables en classification (sauf valide)"]
[null,null,null,null,null,"","",null,null,null,null,null,null,20,null,null,null,"Pour tous joueurs sans symbole sur la carte de classification"]
[null,null,null,null,null,"","",null,null,null,null,null,null,28,null,"Spécificités Nat 2 et 3 (plus de 55 ans)"]
[null,null,null,null,null,"","",null,null,null,null,null,null,null,null,"S",null,null,null,"Français < 5pts (Bonus de 0,5pt)"]
[null,null,null,null,null,"","",null,null,null,null,null,null,null,null,"SFID",null,null,null,"Joueurs (FIDET) ou étanger < 5pts (Bonus de 0,5pt)"]
[null,null,null,null,null,null,null,null,null,null,null,null,null,null,null,"SET"]
[{"$f":"IF(F32<1,\"\",\"Joueurs ou joueuses étrangers\")","v":""},null,null,null,null,null,null,null,null,null,null,null,null,null,null,"SF",null,null,null,"Femme française  < 5pts (Bonus de 2pts): 1,5pts+0,5pt"]
[{"$f":"IF(F32=0,\"\",IF(F32>5,\"Trop de joueurs étangers-max 5)\",\"OK\"))","v":""},null,null,null,null,null,null,null,null,null,null,null,null,null,null,"SFET",null,null,null,"Femme étrangère  < 5pts (Bonus de 2pts): 1,5pts+0,5pt"]
[null,null,null,null,null,null,null,null,null,null,null,null,null,null,null,"FSV",null,null,null,"Femme française  < 5pts (Bonus de 0,5pt)"]
[{"$f":"IF(G32<1,\"\",\"Joueurs ou joueuses valides de l'équipe\")","v":""},null,null,null,null,null,null,null,null,null,null,null,null,null,null,"JS",null,null,null,"Jeune français <5pts (Bonus 2pts)"]
[{"$f":"IF(G32=0,\"\",IF(G32>2,\"Trop de valides inscrit sur la feuille-max 1)\",\"OK\"))","v":""},null,null,null,null,null,null,null,null,null,null,null,null,null,null,"JFS",null,null,null,"Jeune française <5pts (Bonus 3pts)"]
[null,null,null,null,null,{"$f":"SUM(F6:F29)","v":0},{"$f":"SUM(G6:G31)","v":0}]

{"sheet":"HAGUENAU","index":59,"n_rows":32,"n_cols":29,"rows_kept":32,"cut":false,"hidden":false,"merged":[[21,15,21,16],[23,15,23,31],[25,19,26,31],[0,15,0,31],[1,25,1,31],[2,25,3,31],[16,15,16,16],[17,15,17,31],[7,21,8,22],[7,23,8,24],[7,25,8,27],[15,15,15,16],[9,15,10,16],[9,17,10,18],[9,19,10,20],[9,21,10,22],[1,0,2,0],[1,1,2,3],[1,9,1,13],[1,15,4,18],[1,19,1,24],[2,9,2,13],[2,19,3,24],[30,0,30,4],[30,15,30,16],[24,15,24,16],[28,15,28,16],[29,0,29,4],[29,15,29,16],[25,15,25,16],[26,0,26,4],[26,15,26,16],[27,0,27,4],[27,15,27,16],[5,15,6,31],[7,28,8,31],[9,25,9,27],[9,28,9,31],[10,25,10,27],[10,28,10,31],[7,15,8,16],[7,17,8,18],[7,19,8,20],[20,15,20,16],[13,15,13,16],[14,15,14,16],[9,23,10,24],[11,15,11,31],[12,15,12,31],[18,15,18,16],[19,15,19,16]]}
["BC NORD ALSACE HAGUENAU",null,null,null,null,null,null,null,null,null,null,null,null,null,null,"Saison 2024-2025                                                                      Points en jeu"]
[null,"Joueur(es) participant à la rencontre",null,null,null,null,null,null,null,"Saisir votre liste complète en MAJUSCULES ",null,null,null,null,null,"Nationale 3",null,null,null,"Sans carte spécifique",null,null,null,null,null,"Si cartes de couleurs"]
[null,null,null,null,null,null,null,null,null,"Joueurs(es) qualifié(es) saison 2024 -2025",null,null,null,null,null,null,null,null,null,"15,5 pts",null,null,null,null,null,"maxi 19 pts"]
[]
["Statuts","Classif.","          Noms      /    Prénoms",null,"Numéros","ET","VALIDE",null,null,"Statuts","Classif.","          Noms      /    Prénoms",null,"Numéros",null,null,null,null,null,"Si >16pts au début du match (+10 pts adversaire)"]
[null,null,null,null,null,{"$f":"IF(A6=\"ET\",1,\"\")","v":""},{"$f":"IF(B6=5,1,\"\")","v":""},null,null,"F",1,"GOERLINGER","I",4,null,"Avec une date de validité"]
[null,null,null,null,null,{"$f":"IF(A7=\"ET\",1,\"\")","v":""},{"$f":"IF(B7=5,1,\"\")","v":""},null,null,"F",4,"ZIMMER","K",5]
[null,null,null,null,null,{"$f":"IF(A8=\"ET\",1,\"\")","v":""},{"$f":"IF(B8=5,1,\"\")","v":""},null,null,null,2,"JACOB","J",7,null,"Carte Verte",null,"Carte Jaune",null,"Carte Rose",null,"Carte      Bleue",null,"Carte      Orange",null,"Joueurs(es) valides (5pts)",null,null,"Non Sélectionnables en EDF (hors FIDET)"]
[null,null,null,null,null,"","",null,null,"S",4.5,"KRAFT","R",8]
[null,null,null,null,null,"","",null,null,null,2.5,"DA SILVA","F",9,null,"+  1,5",null,"+  2,5",null,"+  1,5",null,"+  0,5",null,"+  0,5",null,"2 sur la feuille ",null,null,"5 sur la feuille"]
[null,null,null,null,null,"","",null,null,"F",3,"MAURER","J",10,null,null,null,null,null,null,null,null,null,null,null,"2 sur le terrain ",null,null,"4 sur le terrain "]
[null,null,null,null,null,"","",null,null,null,4,"ZIMMER ","B",11,null,"Pour le calcul des points"]
[null,null,null,null,null,"","",null,null,null,2.5,"FREUND","C",12,null,"Inscrire dans la colonne de gauche le \"Statut\" des joueurs ou joueuses "]
[null,null,null,null,null,"","",null,null,null,2,"VERDENNE","B",13,null,"J",null,null,null,"Jeune joueur débutant (Bonus1,5pt)"]
[null,null,null,null,null,"","",null,null,null,1.5,"NOVAS","M",14,null,"JF",null,null,null,"Jeune joueuse débutante (Bonus 2,5pt)"]
[null,null,null,null,null,"","",null,null,"JS",4,"BAUSER","D",15,null,"F ou FET",null,null,null,"Femme française ou étrangère < 5pts (Bonus 1,5pt)"]
[null,null,null,null,null,"","","",null,null,null,null,null,null,null,"FV",null,null,null,"Femme française ou étrangère = 5pts (Bonus de 0,5pt)"]
[null,null,null,null,null,"","","",null,null,null,null,null,null,null,"Autres possibilités sans Bonus"]
[null,null,null,null,null,"","","",null,null,null,null,null,null,null,"FID",null,"Pour un joueur à un groupement sportif"]
[null,null,null,null,null,"","",null,null,null,null,null,null,null,null,"ET",null,"Pour un joueur étranger "]
[null,null,null,null,null,"","","",null,null,null,null,null,null,null,"VAL",null,"Masculin français (=5 pts) sans bonus"]
[null,null,null,null,null,"","",null,null,null,null,null,null,null,null,"R",null,"Tous joueurs révisables en classification (sauf valide)"]
[null,null,null,null,null,"","",null,null,null,null,null,null,null,null,null,null,"Pour tous joueurs sans symbole sur la carte de classification"]
[null,null,null,null,null,"","",null,null,null,null,null,null,null,null,"Spécificités Nat 2 et 3 (plus de 55 ans)"]
[null,null,null,null,null,"","",null,null,null,null,null,null,null,null,"S",null,null,null,"Français < 5pts (Bonus de 0,5pt)"]
[null,null,null,null,null,null,null,null,null,null,null,null,null,null,null,"SFID",null,null,null,"Joueurs (FIDET) ou étanger < 5pts (Bonus de 0,5pt)"]
[{"$f":"IF(F32<1,\"\",\"Joueurs ou joueuses étrangers\")","v":""},null,null,null,null,null,null,null,null,null,null,null,null,null,null,"SET"]
[{"$f":"IF(F32=0,\"\",IF(F32>5,\"Trop de joueurs étangers-max 5)\",\"OK\"))","v":""},null,null,null,null,null,null,null,null,null,null,null,null,null,null,"SF",null,null,null,"Femme française  < 5pts (Bonus de 2pts): 1,5pts+0,5pt"]
[null,null,null,null,null,null,null,null,null,null,null,null,null,null,null,"SFET",null,null,null,"Femme étrangère  < 5pts (Bonus de 2pts): 1,5pts+0,5pt"]
[{"$f":"IF(G32<1,\"\",\"Joueurs ou joueuses valides de l'équipe\")","v":""},null,null,null,null,null,null,null,null,null,null,null,null,null,null,"JS",null,null,null,"Jeune français <5pts (Bonus 2pts)"]
[{"$f":"IF(G32=0,\"\",IF(G32>2,\"Trop de valides inscrit sur la feuille-max 1)\",\"OK\"))","v":""},null,null,null,null,null,null,null,null,null,null,null,null,null,null,"JFS",null,null,null,"Jeune française <5pts (Bonus 3pts)"]
[null,null,null,null,null,{"$f":"SUM(F6:F29)","v":0},{"$f":"SUM(G6:G31)","v":0}]

{"sheet":"MULHOUSE","index":60,"n_rows":32,"n_cols":29,"rows_kept":32,"cut":false,"hidden":false,"merged":[[21,15,21,16],[23,15,23,31],[25,19,26,31],[0,15,0,31],[1,25,1,31],[2,25,3,31],[16,15,16,16],[17,15,17,31],[7,21,8,22],[7,23,8,24],[7,25,8,27],[15,15,15,16],[9,15,10,16],[9,17,10,18],[9,19,10,20],[9,21,10,22],[1,0,2,0],[1,1,2,3],[1,9,1,13],[1,15,4,18],[1,19,1,24],[2,9,2,13],[2,19,3,24],[30,0,30,4],[30,15,30,16],[24,15,24,16],[28,15,28,16],[29,0,29,4],[29,15,29,16],[25,15,25,16],[26,0,26,4],[26,15,26,16],[27,0,27,4],[27,15,27,16],[5,15,6,31],[7,28,8,31],[9,25,9,27],[9,28,9,31],[10,25,10,27],[10,28,10,31],[7,15,8,16],[7,17,8,18],[7,19,8,20],[20,15,20,16],[13,15,13,16],[14,15,14,16],[9,23,10,24],[11,15,11,31],[12,15,12,31],[18,15,18,16],[19,15,19,16]]}
["ASCO MULHOUSE",null,null,null,null,null,null,null,null,null,null,null,null,null,null,"Saison 2024-2025                                                                      Points en jeu"]
[null,"Joueur(es) participant à la rencontre",null,null,null,null,null,null,null,"Saisir votre liste complète en MAJUSCULES ",null,null,null,null,null,"Nationale 3",null,null,null,"Sans carte spécifique",null,null,null,null,null,"Si cartes de couleurs"]
[null,null,null,null,null,null,null,null,null,"Joueurs(es) qualifié(es) saison 2024 -2025",null,null,null,null,null,null,null,null,null,"15,5 pts",null,null,null,null,null,"maxi 19 pts"]
[]
["Statuts","Classif.","          Noms      /    Prénoms",null,"Numéros","ET","VALIDE",null,null,"Statuts","Classif.","          Noms      /    Prénoms",null,"Numéros",null,null,null,null,null,"Si >16pts au début du match (+10 pts adversaire)"]
[null,null,null,null,null,{"$f":"IF(A6=\"ET\",1,\"\")","v":""},{"$f":"IF(B6=5,1,\"\")","v":""},null,null,"FV",5,"PICHON","C",3,null,"Avec une date de validité"]
[null,null,null,null,null,{"$f":"IF(A7=\"ET\",1,\"\")","v":""},{"$f":"IF(B7=5,1,\"\")","v":""},null,null,"J",2.5,"NANA","M",5]
[null,null,null,null,null,{"$f":"IF(A8=\"ET\",1,\"\")","v":""},{"$f":"IF(B8=5,1,\"\")","v":""},null,null,null,2,"LAKEL","M",5,null,"Carte Verte",null,"Carte Jaune",null,"Carte Rose",null,"Carte      Bleue",null,"Carte      Orange",null,"Joueurs(es) valides (5pts)",null,null,"Non Sélectionnables en EDF (hors FIDET)"]
[null,null,null,null,null,"","",null,null,null,null,null,null,6]
[null,null,null,null,null,"","",null,null,"S",1.5,"MEYER","A",7,null,"+  1,5",null,"+  2,5",null,"+  1,5",null,"+  0,5",null,"+  0,5",null,"2 sur la feuille ",null,null,"5 sur la feuille"]
[null,null,null,null,null,"","",null,null,null,null,null,null,8,null,null,null,null,null,null,null,null,null,null,null,"2 sur le terrain ",null,null,"4 sur le terrain "]
[null,null,null,null,null,"","",null,null,null,5,"DELPIERRE","V",9,null,"Pour le calcul des points"]
[null,null,null,null,null,"","",null,null,null,null,null,null,10,null,"Inscrire dans la colonne de gauche le \"Statut\" des joueurs ou joueuses "]
[null,null,null,null,null,"","",null,null,null,null,null,null,11,null,"J",null,null,null,"Jeune joueur débutant (Bonus1,5pt)"]
[null,null,null,null,null,"","",null,null,null,null,null,null,12,null,"JF",null,null,null,"Jeune joueuse débutante (Bonus 2,5pt)"]
[null,null,null,null,null,"","",null,null,null,4,"DAVID","M",13,null,"F ou FET",null,null,null,"Femme française ou étrangère < 5pts (Bonus 1,5pt)"]
[null,null,null,null,null,"","","",null,null,null,null,null,14,null,"FV",null,null,null,"Femme française ou étrangère = 5pts (Bonus de 0,5pt)"]
[null,null,null,null,null,"","","",null,"S",4,"COULIBALY","M",15,null,"Autres possibilités sans Bonus"]
[null,null,null,null,null,"","","",null,null,null,null,null,16,null,"FID",null,"Pour un joueur à un groupement sportif"]
[null,null,null,null,null,"","",null,null,null,null,null,null,17,null,"ET",null,"Pour un joueur étranger "]
[null,null,null,null,null,"","","",null,null,null,null,null,18,null,"VAL",null,"Masculin français (=5 pts) sans bonus"]
[null,null,null,null,null,"","",null,null,null,null,null,null,19,null,"R",null,"Tous joueurs révisables en classification (sauf valide)"]
[null,null,null,null,null,"","",null,null,"S",4.5,"IMBROGIANO","V",20,null,null,null,"Pour tous joueurs sans symbole sur la carte de classification"]
[null,null,null,null,null,"","",null,null,null,null,null,null,null,null,"Spécificités Nat 2 et 3 (plus de 55 ans)"]
[null,null,null,null,null,"","",null,null,null,null,null,null,null,null,"S",null,null,null,"Français < 5pts (Bonus de 0,5pt)"]
[null,null,null,null,null,null,null,null,null,null,null,null,null,null,null,"SFID",null,null,null,"Joueurs (FIDET) ou étanger < 5pts (Bonus de 0,5pt)"]
[{"$f":"IF(F32<1,\"\",\"Joueurs ou joueuses étrangers\")","v":""},null,null,null,null,null,null,null,null,null,null,null,null,null,null,"SET"]
[{"$f":"IF(F32=0,\"\",IF(F32>5,\"Trop de joueurs étangers-max 5)\",\"OK\"))","v":""},null,null,null,null,null,null,null,null,null,null,null,null,null,null,"SF",null,null,null,"Femme française  < 5pts (Bonus de 2pts): 1,5pts+0,5pt"]
[null,null,null,null,null,null,null,null,null,null,null,null,null,null,null,"SFET",null,null,null,"Femme étrangère  < 5pts (Bonus de 2pts): 1,5pts+0,5pt"]
[{"$f":"IF(G32<1,\"\",\"Joueurs ou joueuses valides de l'équipe\")","v":""},null,null,null,null,null,null,null,null,null,null,null,null,null,null,"JS",null,null,null,"Jeune français <5pts (Bonus 2pts)"]
[{"$f":"IF(G32=0,\"\",IF(G32>2,\"Trop de valides inscrit sur la feuille-max 1)\",\"OK\"))","v":""},null,null,null,null,null,null,null,null,null,null,null,null,null,null,"JFS",null,null,null,"Jeune française <5pts (Bonus 3pts)"]
[null,null,null,null,null,{"$f":"SUM(F6:F29)","v":0},{"$f":"SUM(G6:G31)","v":0}]

{"sheet":"THIONVILLE","index":61,"n_rows":32,"n_cols":29,"rows_kept":32,"cut":false,"hidden":false,"merged":[[21,15,21,16],[23,15,23,31],[25,19,26,31],[0,15,0,31],[1,25,1,31],[2,25,3,31],[16,15,16,16],[17,15,17,31],[7,21,8,22],[7,23,8,24],[7,25,8,27],[15,15,15,16],[9,15,10,16],[9,17,10,18],[9,19,10,20],[9,21,10,22],[1,9,1,13],[1,15,4,18],[1,19,1,24],[2,9,2,13],[2,19,3,24],[30,0,30,4],[29,0,29,4],[26,0,26,4],[27,0,27,4],[1,0,2,0],[1,1,2,3],[5,15,6,31],[7,28,8,31],[9,25,9,27],[9,28,9,31],[10,25,10,27],[10,28,10,31],[7,15,8,16],[7,17,8,18],[7,19,8,20],[20,15,20,16],[13,15,13,16],[14,15,14,16],[9,23,10,24],[11,15,11,31],[12,15,12,31],[18,15,18,16],[19,15,19,16],[24,15,24,16],[30,15,30,16],[27,15,27,16],[26,15,26,16],[25,15,25,16],[29,15,29,16],[28,15,28,16]]}
["AS  THIONVILLE",null,null,null,null,null,null,null,null,null,null,null,null,null,null,"Saison 2024-2025                                                                      Points en jeu"]
[null,"Joueur(es) participant à la rencontre",null,null,null,null,null,null,null,"Saisir votre liste complète en MAJUSCULES ",null,null,null,null,null,"Nationale 3",null,null,null,"Sans carte spécifique",null,null,null,null,null,"Si cartes de couleurs"]
[null,null,null,null,null,null,null,null,null,"Joueurs(es) qualifié(es) saison 2024 -2025",null,null,null,null,null,null,null,null,null,"15,5 pts",null,null,null,null,null,"maxi 19 pts"]
[]
["Statuts","Classif.","          Noms      /    Prénoms",null,"Numéros","ET","VALIDE",null,null,"Statuts","Classif.","          Noms      /    Prénoms",null,"Numéros",null,null,null,null,null,"Si >16pts au début du match (+10 pts adversaire)"]
[null,null,null,null,null,{"$f":"IF(A6=\"ET\",1,\"\")","v":""},{"$f":"IF(B6=5,1,\"\")","v":""},null,null,null,4.5,"BORTOLLON","A",0,null,"Avec une date de validité"]
[null,null,null,null,null,{"$f":"IF(A7=\"ET\",1,\"\")","v":""},{"$f":"IF(B7=5,1,\"\")","v":""},null,null,null,1.5,"BORTOLLON","M",4]
[null,null,null,null,null,{"$f":"IF(A8=\"ET\",1,\"\")","v":""},{"$f":"IF(B8=5,1,\"\")","v":""},null,null,"ET",2.5,"WAGENER",null,6,null,"Carte Verte",null,"Carte Jaune",null,"Carte Rose",null,"Carte      Bleue",null,"Carte      Orange",null,"Joueurs(es) valides (5pts)",null,null,"Non Sélectionnables en EDF (hors FIDET)"]
[null,null,null,null,null,"","",null,null,null,5,"PEREIRA","M",7]
[null,null,null,null,null,"","",null,null,null,null,null,null,8,null,"+  1,5",null,"+  2,5",null,"+  1,5",null,"+  0,5",null,"+  0,5",null,"2 sur la feuille ",null,null,"5 sur la feuille"]
[null,null,null,null,null,"","",null,null,"S",3,"BAUDOUIN","E",9,null,null,null,null,null,null,null,null,null,null,null,"2 sur le terrain ",null,null,"4 sur le terrain "]
[null,null,null,null,null,"","",null,null,null,null,null,null,10,null,"Pour le calcul des points"]
[null,null,null,null,null,"","",null,null,"F",5,"BURGUN","L",11,null,"Inscrire dans la colonne de gauche le \"Statut\" des joueurs ou joueuses "]
[null,null,null,null,null,"","",null,null,null,2.5,"JAECKEL","B",12,null,"J",null,null,null,"Jeune joueur débutant (Bonus1,5pt)"]
[null,null,null,null,null,"","",null,null,null,1,"GHOUNIME","Y",13,null,"JF",null,null,null,"Jeune joueuse débutante (Bonus 2,5pt)"]
[null,null,null,null,null,"","",null,null,null,null,null,null,14,null,"F ou FET",null,null,null,"Femme française ou étrangère < 5pts (Bonus 1,5pt)"]
[null,null,null,null,null,"","","",null,null,null,null,null,15,null,"FV",null,null,null,"Femme française ou étrangère = 5pts (Bonus de 0,5pt)"]
[null,null,null,null,null,"","","",null,null,null,null,null,16,null,"Autres possibilités sans Bonus"]
[null,null,null,null,null,"","","",null,null,5,"LEFAY","G",23,null,"FID",null,"Pour un joueur à un groupement sportif"]
[null,null,null,null,null,"","",null,null,null,null,null,null,18,null,"ET",null,"Pour un joueur étranger "]
[null,null,null,null,null,"","","",null,null,null,null,null,19,null,"VAL",null,"Masculin français (=5 pts) sans bonus"]
[null,null,null,null,null,"","",null,null,null,null,null,null,20,null,"R",null,"Tous joueurs révisables en classification (sauf valide)"]
[null,null,null,null,null,"","",null,null,null,null,null,null,28,null,null,null,"Pour tous joueurs sans symbole sur la carte de classification"]
[null,null,null,null,null,"","",null,null,null,null,null,null,null,null,"Spécificités Nat 2 et 3 (plus de 55 ans)"]
[null,null,null,null,null,"","",null,null,null,null,null,null,null,null,"S",null,null,null,"Français < 5pts (Bonus de 0,5pt)"]
[null,null,null,null,null,null,null,null,null,null,null,null,null,null,null,"SFID",null,null,null,"Joueurs (FIDET) ou étanger < 5pts (Bonus de 0,5pt)"]
[{"$f":"IF(F32<1,\"\",\"Joueurs ou joueuses étrangers\")","v":""},null,null,null,null,null,null,null,null,null,null,null,null,null,null,"SET"]
[{"$f":"IF(F32=0,\"\",IF(F32>5,\"Trop de joueurs étangers-max 5)\",\"OK\"))","v":""},null,null,null,null,null,null,null,null,null,null,null,null,null,null,"SF",null,null,null,"Femme française  < 5pts (Bonus de 2pts): 1,5pts+0,5pt"]
[null,null,null,null,null,null,null,null,null,null,null,null,null,null,null,"SFET",null,null,null,"Femme étrangère  < 5pts (Bonus de 2pts): 1,5pts+0,5pt"]
[{"$f":"IF(G32<1,\"\",\"Joueurs ou joueuses valides de l'équipe\")","v":""},null,null,null,null,null,null,null,null,null,null,null,null,null,null,"JS",null,null,null,"Jeune français <5pts (Bonus 2pts)"]
[{"$f":"IF(G32=0,\"\",IF(G32>2,\"Trop de valides inscrit sur la feuille-max 1)\",\"OK\"))","v":""},null,null,null,null,null,null,null,null,null,null,null,null,null,null,"JFS",null,null,null,"Jeune française <5pts (Bonus 3pts)"]
[null,null,null,null,null,{"$f":"SUM(F6:F29)","v":0},{"$f":"SUM(G6:G31)","v":0}]

{"sheet":"TROYES","index":62,"n_rows":32,"n_cols":29,"rows_kept":32,"cut":false,"hidden":false,"merged":[[21,15,21,16],[23,15,23,31],[25,19,26,31],[0,15,0,31],[1,25,1,31],[2,25,3,31],[16,15,16,16],[17,15,17,31],[7,21,8,22],[7,23,8,24],[7,25,8,27],[15,15,15,16],[9,15,10,16],[9,17,10,18],[9,19,10,20],[9,21,10,22],[1,0,2,0],[1,1,2,3],[1,9,1,13],[1,15,4,18],[1,19,1,24],[2,9,2,13],[2,19,3,24],[30,0,30,4],[30,15,30,16],[24,15,24,16],[28,15,28,16],[29,0,29,4],[29,15,29,16],[25,15,25,16],[26,0,26,4],[26,15,26,16],[27,0,27,4],[27,15,27,16],[5,15,6,31],[7,28,8,31],[9,25,9,27],[9,28,9,31],[10,25,10,27],[10,28,10,31],[7,15,8,16],[7,17,8,18],[7,19,8,20],[20,15,20,16],[13,15,13,16],[14,15,14,16],[9,23,10,24],[11,15,11,31],[12,15,12,31],[18,15,18,16],[19,15,19,16]]}
["CH TROYES",null,null,null,null,null,null,null,null,null,null,null,null,null,null,"Saison 2024-2025                                                                      Points en jeu"]
[null,"Joueur(es) participant à la rencontre",null,null,null,null,null,null,null,"Saisir votre liste complète en MAJUSCULES ",null,null,null,null,null,"Nationale 3",null,null,null,"Sans carte spécifique",null,null,null,null,null,"Si cartes de couleurs"]
[null,null,null,null,null,null,null,null,null,"Joueurs(es) qualifié(es) saison 2024 -2025",null,null,null,null,null,null,null,null,null,"15,5 pts",null,null,null,null,null,"maxi 19 pts"]
[]
["Statuts","Classif.","          Noms      /    Prénoms",null,"Numéros","ET","VALIDE",null,null,"Statuts","Classif.","          Noms      /    Prénoms",null,"Numéros",null,null,null,null,null,"Si >16pts au début du match (+10 pts adversaire)"]
[null,null,null,null,null,{"$f":"IF(A6=\"ET\",1,\"\")","v":""},{"$f":"IF(B6=5,1,\"\")","v":""},null,null,null,null,null,null,4,null,"Avec une date de validité"]
[null,null,null,null,null,{"$f":"IF(A7=\"ET\",1,\"\")","v":""},{"$f":"IF(B7=5,1,\"\")","v":""},null,null,null,null,null,null,5]
[null,null,null,null,null,{"$f":"IF(A8=\"ET\",1,\"\")","v":""},{"$f":"IF(B8=5,1,\"\")","v":""},null,null,null,3,"CRISTELO","M",6,null,"Carte Verte",null,"Carte Jaune",null,"Carte Rose",null,"Carte      Bleue",null,"Carte      Orange",null,"Joueurs(es) valides (5pts)",null,null,"Non Sélectionnables en EDF (hors FIDET)"]
[null,null,null,null,null,"","",null,null,null,null,null,null,7]
[null,null,null,null,null,"","",null,null,null,null,null,null,8,null,"+  1,5",null,"+  2,5",null,"+  1,5",null,"+  0,5",null,"+  0,5",null,"2 sur la feuille ",null,null,"5 sur la feuille"]
[null,null,null,null,null,"","",null,null,"S",4.5,"BENAULT","E",9,null,null,null,null,null,null,null,null,null,null,null,"2 sur le terrain ",null,null,"4 sur le terrain "]
[null,null,null,null,null,"","",null,null,null,null,null,null,10,null,"Pour le calcul des points"]
[null,null,null,null,null,"","",null,null,"J",4.5,"DEVANLAY","H",11,null,"Inscrire dans la colonne de gauche le \"Statut\" des joueurs ou joueuses "]
[null,null,null,null,null,"","",null,null,"S",4.5,"SOYER","P",12,null,"J",null,null,null,"Jeune joueur débutant (Bonus1,5pt)"]
[null,null,null,null,null,"","",null,null,null,null,null,null,13,null,"JF",null,null,null,"Jeune joueuse débutante (Bonus 2,5pt)"]
[null,null,null,null,null,"","",null,null,"S",4.5,"CHEBSON","F",14,null,"F ou FET",null,null,null,"Femme française ou étrangère < 5pts (Bonus 1,5pt)"]
[null,null,null,null,null,"","","",null,null,null,null,null,15,null,"FV",null,null,null,"Femme française ou étrangère = 5pts (Bonus de 0,5pt)"]
[null,null,null,null,null,"","","",null,null,2.5,"SANZ","L",16,null,"Autres possibilités sans Bonus"]
[null,null,null,null,null,"","","",null,null,null,null,null,17,null,"FID",null,"Pour un joueur à un groupement sportif"]
[null,null,null,null,null,"","",null,null,null,null,null,null,19,null,"ET",null,"Pour un joueur étranger "]
[null,null,null,null,null,"","","",null,null,4.5,"DERRE","E",20,null,"VAL",null,"Masculin français (=5 pts) sans bonus"]
[null,null,null,null,null,"","",null,null,"J",3,"PARIS","A",22,null,"R",null,"Tous joueurs révisables en classification (sauf valide)"]
[null,null,null,null,null,"","",null,null,null,5,"LEBOEUF","A",88,null,null,null,"Pour tous joueurs sans symbole sur la carte de classification"]
[null,null,null,null,null,"","",null,null,null,null,null,null,null,null,"Spécificités Nat 2 et 3 (plus de 55 ans)"]
[null,null,null,null,null,"","",null,null,"SF",1.5,"SOYER","E",null,null,"S",null,null,null,"Français < 5pts (Bonus de 0,5pt)"]
[null,null,null,null,null,null,null,null,null,null,null,null,null,null,null,"SFID",null,null,null,"Joueurs (FIDET) ou étanger < 5pts (Bonus de 0,5pt)"]
[{"$f":"IF(F32<1,\"\",\"Joueurs ou joueuses étrangers\")","v":""},null,null,null,null,null,null,null,null,null,null,null,null,null,null,"SET"]
[{"$f":"IF(F32=0,\"\",IF(F32>5,\"Trop de joueurs étangers-max 5)\",\"OK\"))","v":""},null,null,null,null,null,null,null,null,null,null,null,null,null,null,"SF",null,null,null,"Femme française  < 5pts (Bonus de 2pts): 1,5pts+0,5pt"]
[null,null,null,null,null,null,null,null,null,null,null,null,null,null,null,"SFET",null,null,null,"Femme étrangère  < 5pts (Bonus de 2pts): 1,5pts+0,5pt"]
[{"$f":"IF(G32<1,\"\",\"Joueurs ou joueuses valides de l'équipe\")","v":""},null,null,null,null,null,null,null,null,null,null,null,null,null,null,"JS",null,null,null,"Jeune français <5pts (Bonus 2pts)"]
[{"$f":"IF(G32=0,\"\",IF(G32>2,\"Trop de valides inscrit sur la feuille-max 1)\",\"OK\"))","v":""},null,null,null,null,null,null,null,null,null,null,null,null,null,null,"JFS",null,null,null,"Jeune française <5pts (Bonus 3pts)"]
[null,null,null,null,null,{"$f":"SUM(F6:F29)","v":0},{"$f":"SUM(G6:G31)","v":0}]

{"sheet":"VANDOEUVRE 2","index":63,"n_rows":32,"n_cols":29,"rows_kept":32,"cut":false,"hidden":false,"merged":[[21,15,21,16],[23,15,23,31],[25,19,26,31],[0,15,0,31],[1,25,1,31],[2,25,3,31],[16,15,16,16],[17,15,17,31],[7,21,8,22],[7,23,8,24],[7,25,8,27],[15,15,15,16],[9,15,10,16],[9,17,10,18],[9,19,10,20],[9,21,10,22],[1,0,2,0],[1,1,2,3],[1,9,1,13],[1,15,4,18],[1,19,1,24],[2,9,2,13],[2,19,3,24],[30,0,30,4],[30,15,30,16],[24,15,24,16],[28,15,28,16],[29,0,29,4],[29,15,29,16],[25,15,25,16],[26,0,26,4],[26,15,26,16],[27,0,27,4],[27,15,27,16],[5,15,6,31],[7,28,8,31],[9,25,9,27],[9,28,9,31],[10,25,10,27],[10,28,10,31],[7,15,8,16],[7,17,8,18],[7,19,8,20],[20,15,20,16],[13,15,13,16],[14,15,14,16],[9,23,10,24],[11,15,11,31],[12,15,12,31],[18,15,18,16],[19,15,19,16]]}
["USVH VANDOEUVRE 2",null,null,null,null,null,null,null,null,null,null,null,null,null,null,"Saison 2024-2025                                                                      Points en jeu"]
[null,"Joueur(es) participant à la rencontre",null,null,null,null,null,null,null,"Saisir votre liste complète en MAJUSCULES ",null,null,null,null,null,"Nationale 3",null,null,null,"Sans carte spécifique",null,null,null,null,null,"Si cartes de couleurs"]
[null,null,null,null,null,null,null,null,null,"Joueurs(es) qualifié(es) saison 2024 -2025",null,null,null,null,null,null,null,null,null,"15,5 pts",null,null,null,null,null,"maxi 19 pts"]
[]
["Statuts","Classif.","          Noms      /    Prénoms",null,"Numéros","ET","VALIDE",null,null,"Statuts","Classif.","          Noms      /    Prénoms",null,"Numéros",null,null,null,null,null,"Si >16pts au début du match (+10 pts adversaire)"]
[null,null,null,null,null,{"$f":"IF(A6=\"ET\",1,\"\")","v":""},{"$f":"IF(B6=5,1,\"\")","v":""},null,null,"ET",2.5,"HAMMANA SAROUI","A",1,null,"Avec une date de validité"]
[null,null,null,null,null,{"$f":"IF(A7=\"ET\",1,\"\")","v":""},{"$f":"IF(B7=5,1,\"\")","v":""},null,null,"SF",4,"MONNIER","V",5]
[null,null,null,null,null,{"$f":"IF(A8=\"ET\",1,\"\")","v":""},{"$f":"IF(B8=5,1,\"\")","v":""},null,null,"ET",2.5,"KHAN","A",6,null,"Carte Verte",null,"Carte Jaune",null,"Carte Rose",null,"Carte      Bleue",null,"Carte      Orange",null,"Joueurs(es) valides (5pts)",null,null,"Non Sélectionnables en EDF (hors FIDET)"]
[null,null,null,null,null,"","",null,null,null,1,"SANDERS","K",7]
[null,null,null,null,null,"","",null,null,null,5,"CHARRIER-GROSJEAN","R",8,null,"+  1,5",null,"+  2,5",null,"+  1,5",null,"+  0,5",null,"+  0,5",null,"2 sur la feuille ",null,null,"5 sur la feuille"]
[null,null,null,null,null,"","",null,null,"ET",2,"ZAKI","Y",9,null,null,null,null,null,null,null,null,null,null,null,"2 sur le terrain ",null,null,"4 sur le terrain "]
[null,null,null,null,null,"","",null,null,null,4,"ROBIN","P",10,null,"Pour le calcul des points"]
[null,null,null,null,null,"","",null,null,null,2,"JACQUEMIN","T",11,null,"Inscrire dans la colonne de gauche le \"Statut\" des joueurs ou joueuses "]
[null,null,null,null,null,"","",null,null,null,4.5,"DEMANGEOT","F",12,null,"J",null,null,null,"Jeune joueur débutant (Bonus1,5pt)"]
[null,null,null,null,null,"","",null,null,"ET",2.5,"KHAN","A",13,null,"JF",null,null,null,"Jeune joueuse débutante (Bonus 2,5pt)"]
[null,null,null,null,null,"","",null,null,null,null,null,null,14,null,"F ou FET",null,null,null,"Femme française ou étrangère < 5pts (Bonus 1,5pt)"]
[null,null,null,null,null,"","","",null,null,null,null,null,15,null,"FV",null,null,null,"Femme française ou étrangère = 5pts (Bonus de 0,5pt)"]
[null,null,null,null,null,"","","",null,null,null,null,null,16,null,"Autres possibilités sans Bonus"]
[null,null,null,null,null,"","","",null,"SF",4.5,"CLAUSSE","C",17,null,"FID",null,"Pour un joueur à un groupement sportif"]
[null,null,null,null,null,"","",null,null,null,null,null,null,18,null,"ET",null,"Pour un joueur étranger "]
[null,null,null,null,null,"","","",null,null,1,"ELOMBO LOBE","M",26,null,"VAL",null,"Masculin français (=5 pts) sans bonus"]
[null,null,null,null,null,"","",null,null,null,null,null,null,20,null,"R",null,"Tous joueurs révisables en classification (sauf valide)"]
[null,null,null,null,null,"","",null,null,null,5,"BAYARD","A",71,null,null,null,"Pour tous joueurs sans symbole sur la carte de classification"]
[null,null,null,null,null,"","",null,null,null,null,null,null,null,null,"Spécificités Nat 2 et 3 (plus de 55 ans)"]
[null,null,null,null,null,"","",null,null,null,null,null,null,null,null,"S",null,null,null,"Français < 5pts (Bonus de 0,5pt)"]
[null,null,null,null,null,null,null,null,null,null,null,null,null,null,null,"SFID",null,null,null,"Joueurs (FIDET) ou étanger < 5pts (Bonus de 0,5pt)"]
[{"$f":"IF(F32<1,\"\",\"Joueurs ou joueuses étrangers\")","v":""},null,null,null,null,null,null,null,null,null,null,null,null,null,null,"SET"]
[{"$f":"IF(F32=0,\"\",IF(F32>5,\"Trop de joueurs étangers-max 5)\",\"OK\"))","v":""},null,null,null,null,null,null,null,null,null,null,null,null,null,null,"SF",null,null,null,"Femme française  < 5pts (Bonus de 2pts): 1,5pts+0,5pt"]
[null,null,null,null,null,null,null,null,null,null,null,null,null,null,null,"SFET",null,null,null,"Femme étrangère  < 5pts (Bonus de 2pts): 1,5pts+0,5pt"]
[{"$f":"IF(G32<1,\"\",\"Joueurs ou joueuses valides de l'équipe\")","v":""},null,null,null,null,null,null,null,null,null,null,null,null,null,null,"JS",null,null,null,"Jeune français <5pts (Bonus 2pts)"]
[{"$f":"IF(G32=0,\"\",IF(G32>2,\"Trop de valides inscrit sur la feuille-max 1)\",\"OK\"))","v":""},null,null,null,null,null,null,null,null,null,null,null,null,null,null,"JFS",null,null,null,"Jeune française <5pts (Bonus 3pts)"]
[null,null,null,null,null,{"$f":"SUM(F6:F29)","v":0},{"$f":"SUM(G6:G31)","v":0}]

{"sheet":"ANGERS","index":64,"n_rows":32,"n_cols":29,"rows_kept":32,"cut":false,"hidden":false,"merged":[[14,15,14,16],[9,23,10,24],[11,15,11,31],[12,15,12,31],[19,15,19,16],[16,15,16,16],[17,15,17,31],[5,15,6,31],[7,28,8,31],[9,25,9,27],[9,28,9,31],[10,25,10,27],[10,28,10,31],[1,0,2,0],[1,1,2,3],[1,9,1,13],[1,15,4,18],[1,19,1,24],[2,9,2,13],[2,19,3,24],[0,15,0,31],[1,25,1,31],[2,25,3,31],[18,15,18,16],[7,15,8,16],[7,17,8,18],[7,19,8,20],[7,21,8,22],[7,23,8,24],[7,25,8,27],[15,15,15,16],[9,15,10,16],[9,17,10,18],[9,19,10,20],[9,21,10,22],[13,15,13,16],[21,15,21,16],[23,15,23,31],[25,19,26,31],[20,15,20,16],[30,0,30,4],[30,15,30,16],[24,15,24,16],[28,15,28,16],[29,0,29,4],[29,15,29,16],[25,15,25,16],[26,0,26,4],[26,15,26,16],[27,0,27,4],[27,15,27,16]]}
["H ANGERS",null,null,null,null,null,null,null,null,null,null,null,null,null,null,"Saison 2024-2025                                                                      Points en jeu"]
[null,"Joueur(es) participant à la rencontre",null,null,null,null,null,null,null,"Saisir votre liste complète en MAJUSCULES ",null,null,null,null,null,"Nationale 3",null,null,null,"Sans carte spécifique",null,null,null,null,null,"Si cartes de couleurs"]
[null,null,null,null,null,null,null,null,null,"Joueurs(es) qualifié(es) saison 2024 -2025",null,null,null,null,null,null,null,null,null,"15,5 pts",null,null,null,null,null,"maxi 19 pts"]
[]
["Statuts","Classif.","          Noms      /    Prénoms",null,"Numéros","ET","VALIDE",null,null,"Statuts","Classif.","          Noms      /    Prénoms",null,"Numéros",null,null,null,null,null,"Si >16pts au début du match (+10 pts adversaire)"]
[null,null,null,null,null,{"$f":"IF(A6=\"ET\",1,\"\")","v":""},{"$f":"IF(B6=5,1,\"\")","v":""},null,null,"F",4.5,"BYROTHEAU","L",4,null,"Avec une date de validité"]
[null,null,null,null,null,{"$f":"IF(A7=\"ET\",1,\"\")","v":""},{"$f":"IF(B7=5,1,\"\")","v":""},null,null,"F",1.5,"JAHAN","V",5]
[null,null,null,null,null,{"$f":"IF(A8=\"ET\",1,\"\")","v":""},{"$f":"IF(B8=5,1,\"\")","v":""},null,null,"S",2.5,"GAUTHIER","JP",6,null,"Carte Verte",null,"Carte Jaune",null,"Carte Rose",null,"Carte      Bleue",null,"Carte      Orange",null,"Joueurs(es) valides (5pts)",null,null,"Non Sélectionnables en EDF (hors FIDET)"]
[null,null,null,null,null,"","",null,null,null,1,"MOISAN","L",7]
[null,null,null,null,null,"","",null,null,null,null,null,null,8,null,"+  1,5",null,"+  2,5",null,"+  1,5",null,"+  0,5",null,"+  0,5",null,"2 sur la feuille ",null,null,"5 sur la feuille"]
[null,null,null,null,null,"","",null,null,null,5,"POUTREL","E",9,null,null,null,null,null,null,null,null,null,null,null,"2 sur le terrain ",null,null,"4 sur le terrain "]
[null,null,null,null,null,"","",null,null,"F",null,"MERIAU","D",10,null,"Pour le calcul des points"]
[null,null,null,null,null,"","",null,null,null,3,"HACINI","CE",11,null,"Inscrire dans la colonne de gauche le \"Statut\" des joueurs ou joueuses "]
[null,null,null,null,null,"","",null,null,null,1,"MOISAN","F",12,null,"J",null,null,null,"Jeune joueur débutant (Bonus1,5pt)"]
[null,null,null,null,null,"","",null,null,null,5,"DENIS","G",13,null,"JF",null,null,null,"Jeune joueuse débutante (Bonus 2,5pt)"]
[null,null,null,null,null,"","",null,null,"S",4,"LESCEAU","D",14,null,"F ou FET",null,null,null,"Femme française ou étrangère < 5pts (Bonus 1,5pt)"]
[null,null,null,null,null,"","","",null,null,5,"ROTHUREAU","M",15,null,"FV",null,null,null,"Femme française ou étrangère = 5pts (Bonus de 0,5pt)"]
[null,null,null,null,null,"","","",null,null,null,null,null,16,null,"Autres possibilités sans Bonus"]
[null,null,null,null,null,"","","",null,null,null,null,null,17,null,"FID",null,"Pour un joueur à un groupement sportif"]
[null,null,null,null,null,"","",null,null,null,null,null,null,18,null,"ET",null,"Pour un joueur étranger "]
[null,null,null,null,null,"","","",null,null,null,null,null,19,null,"VAL",null,"Masculin français (=5 pts) sans bonus"]
[null,null,null,null,null,"","",null,null,null,null,null,null,20,null,"R",null,"Tous joueurs révisables en classification (sauf valide)"]
[null,null,null,null,null,"","",null,null,null,null,null,null,28,null,null,null,"Pour tous joueurs sans symbole sur la carte de classification"]
[null,null,null,null,null,"","",null,null,null,null,null,null,null,null,"Spécificités Nat 2 et 3 (plus de 55 ans)"]
[null,null,null,null,null,"","",null,null,null,null,null,null,null,null,"S",null,null,null,"Français < 5pts (Bonus de 0,5pt)"]
[null,null,null,null,null,null,null,null,null,null,null,null,null,null,null,"SFID",null,null,null,"Joueurs (FIDET) ou étanger < 5pts (Bonus de 0,5pt)"]
[{"$f":"IF(F32<1,\"\",\"Joueurs ou joueuses étrangers\")","v":""},null,null,null,null,null,null,null,null,null,null,null,null,null,null,"SET"]
[{"$f":"IF(F32=0,\"\",IF(F32>5,\"Trop de joueurs étangers-max 5)\",\"OK\"))","v":""},null,null,null,null,null,null,null,null,null,null,null,null,null,null,"SF",null,null,null,"Femme française  < 5pts (Bonus de 2pts): 1,5pts+0,5pt"]
[null,null,null,null,null,null,null,null,null,null,null,null,null,null,null,"SFET",null,null,null,"Femme étrangère  < 5pts (Bonus de 2pts): 1,5pts+0,5pt"]
[{"$f":"IF(G32<1,\"\",\"Joueurs ou joueuses valides de l'équipe\")","v":""},null,null,null,null,null,null,null,null,null,null,null,null,null,null,"JS",null,null,null,"Jeune français <5pts (Bonus 2pts)"]
[{"$f":"IF(G32=0,\"\",IF(G32>2,\"Trop de valides inscrit sur la feuille-max 1)\",\"OK\"))","v":""},null,null,null,null,null,null,null,null,null,null,null,null,null,null,"JFS",null,null,null,"Jeune française <5pts (Bonus 3pts)"]
[null,null,null,null,null,{"$f":"SUM(F6:F29)","v":0},{"$f":"SUM(G6:G31)","v":0}]

{"sheet":"CHAMBRAY","index":65,"n_rows":32,"n_cols":29,"rows_kept":32,"cut":false,"hidden":false,"merged":[[14,15,14,16],[9,23,10,24],[11,15,11,31],[12,15,12,31],[19,15,19,16],[16,15,16,16],[17,15,17,31],[5,15,6,31],[7,28,8,31],[9,25,9,27],[9,28,9,31],[10,25,10,27],[10,28,10,31],[1,0,2,0],[1,1,2,3],[1,9,1,13],[1,15,4,18],[1,19,1,24],[2,9,2,13],[2,19,3,24],[0,15,0,31],[1,25,1,31],[2,25,3,31],[18,15,18,16],[7,15,8,16],[7,17,8,18],[7,19,8,20],[7,21,8,22],[7,23,8,24],[7,25,8,27],[15,15,15,16],[9,15,10,16],[9,17,10,18],[9,19,10,20],[9,21,10,22],[13,15,13,16],[21,15,21,16],[23,15,23,31],[25,19,26,31],[20,15,20,16],[30,0,30,4],[30,15,30,16],[24,15,24,16],[28,15,28,16],[29,0,29,4],[29,15,29,16],[25,15,25,16],[26,0,26,4],[26,15,26,16],[27,0,27,4],[27,15,27,16]]}
["US  CHAMBRAY",null,null,null,null,null,null,null,null,null,null,null,null,null,null,"Saison 2024-2025                                                                      Points en jeu"]
[null,"Joueur(es) participant à la rencontre",null,null,null,null,null,null,null,"Saisir votre liste complète en MAJUSCULES ",null,null,null,null,null,"Nationale 3",null,null,null,"Sans carte spécifique",null,null,null,null,null,"Si cartes de couleurs"]
[null,null,null,null,null,null,null,null,null,"Joueurs(es) qualifié(es) saison 2024 -2025",null,null,null,null,null,null,null,null,null,"15,5 pts",null,null,null,null,null,"maxi 19 pts"]
[]
["Statuts","Classif.","          Noms      /    Prénoms",null,"Numéros","ET","VALIDE",null,null,"Statuts","Classif.","          Noms      /    Prénoms",null,"Numéros",null,null,null,null,null,"Si >16pts au début du match (+10 pts adversaire)"]
[null,null,null,null,null,{"$f":"IF(A6=\"ET\",1,\"\")","v":""},{"$f":"IF(B6=5,1,\"\")","v":""},null,null,"FID",2.5,"NIAMBA","G",4,null,"Avec une date de validité"]
[null,null,null,null,null,{"$f":"IF(A7=\"ET\",1,\"\")","v":""},{"$f":"IF(B7=5,1,\"\")","v":""},null,null,"FID",3,"CASSEAULT","A",5]
[null,null,null,null,null,{"$f":"IF(A8=\"ET\",1,\"\")","v":""},{"$f":"IF(B8=5,1,\"\")","v":""},null,null,null,null,null,null,6,null,"Carte Verte",null,"Carte Jaune",null,"Carte Rose",null,"Carte      Bleue",null,"Carte      Orange",null,"Joueurs(es) valides (5pts)",null,null,"Non Sélectionnables en EDF (hors FIDET)"]
[null,null,null,null,null,"","",null,null,null,null,null,null,7]
[null,null,null,null,null,"","",null,null,null,1,"FRESNEAU","J",8,null,"+  1,5",null,"+  2,5",null,"+  1,5",null,"+  0,5",null,"+  0,5",null,"2 sur la feuille ",null,null,"5 sur la feuille"]
[null,null,null,null,null,"","",null,null,null,null,null,null,9,null,null,null,null,null,null,null,null,null,null,null,"2 sur le terrain ",null,null,"4 sur le terrain "]
[null,null,null,null,null,"","",null,null,null,1,"CHEYEP","V",10,null,"Pour le calcul des points"]
[null,null,null,null,null,"","",null,null,null,4.5,"LACOUT","B",11,null,"Inscrire dans la colonne de gauche le \"Statut\" des joueurs ou joueuses "]
[null,null,null,null,null,"","",null,null,null,4,"SAGLIO","B",12,null,"J",null,null,null,"Jeune joueur débutant (Bonus1,5pt)"]
[null,null,null,null,null,"","",null,null,null,2.5,"HEULOT","R",13,null,"JF",null,null,null,"Jeune joueuse débutante (Bonus 2,5pt)"]
[null,null,null,null,null,"","",null,null,null,1.5,"ALLART","C",14,null,"F ou FET",null,null,null,"Femme française ou étrangère < 5pts (Bonus 1,5pt)"]
[null,null,null,null,null,"","","",null,null,5,"COULON","A",15,null,"FV",null,null,null,"Femme française ou étrangère = 5pts (Bonus de 0,5pt)"]
[null,null,null,null,null,"","","",null,null,null,null,null,16,null,"Autres possibilités sans Bonus"]
[null,null,null,null,null,"","","",null,null,null,null,null,17,null,"FID",null,"Pour un joueur à un groupement sportif"]
[null,null,null,null,null,"","",null,null,null,null,null,null,18,null,"ET",null,"Pour un joueur étranger "]
[null,null,null,null,null,"","","",null,null,null,null,null,19,null,"VAL",null,"Masculin français (=5 pts) sans bonus"]
[null,null,null,null,null,"","",null,null,null,null,null,null,20,null,"R",null,"Tous joueurs révisables en classification (sauf valide)"]
[null,null,null,null,null,"","",null,null,null,null,null,null,28,null,null,null,"Pour tous joueurs sans symbole sur la carte de classification"]
[null,null,null,null,null,"","",null,null,null,null,null,null,null,null,"Spécificités Nat 2 et 3 (plus de 55 ans)"]
[null,null,null,null,null,"","",null,null,null,null,null,null,null,null,"S",null,null,null,"Français < 5pts (Bonus de 0,5pt)"]
[null,null,null,null,null,null,null,null,null,null,null,null,null,null,null,"SFID",null,null,null,"Joueurs (FIDET) ou étanger < 5pts (Bonus de 0,5pt)"]
[{"$f":"IF(F32<1,\"\",\"Joueurs ou joueuses étrangers\")","v":""},null,null,null,null,null,null,null,null,null,null,null,null,null,null,"SET"]
[{"$f":"IF(F32=0,\"\",IF(F32>5,\"Trop de joueurs étangers-max 5)\",\"OK\"))","v":""},null,null,null,null,null,null,null,null,null,null,null,null,null,null,"SF",null,null,null,"Femme française  < 5pts (Bonus de 2pts): 1,5pts+0,5pt"]
[null,null,null,null,null,null,null,null,null,null,null,null,null,null,null,"SFET",null,null,null,"Femme étrangère  < 5pts (Bonus de 2pts): 1,5pts+0,5pt"]
[{"$f":"IF(G32<1,\"\",\"Joueurs ou joueuses valides de l'équipe\")","v":""},null,null,null,null,null,null,null,null,null,null,null,null,null,null,"JS",null,null,null,"Jeune français <5pts (Bonus 2pts)"]
[{"$f":"IF(G32=0,\"\",IF(G32>2,\"Trop de valides inscrit sur la feuille-max 1)\",\"OK\"))","v":""},null,null,null,null,null,null,null,null,null,null,null,null,null,null,"JFS",null,null,null,"Jeune française <5pts (Bonus 3pts)"]
[null,null,null,null,null,{"$f":"SUM(F6:F29)","v":0},{"$f":"SUM(G6:G31)","v":0}]

{"sheet":"EQUEURDREVILLE","index":66,"n_rows":32,"n_cols":29,"rows_kept":32,"cut":false,"hidden":false,"merged":[[14,15,14,16],[9,23,10,24],[11,15,11,31],[12,15,12,31],[19,15,19,16],[16,15,16,16],[17,15,17,31],[5,15,6,31],[7,28,8,31],[9,25,9,27],[9,28,9,31],[10,25,10,27],[10,28,10,31],[1,0,2,0],[1,1,2,3],[1,9,1,13],[1,15,4,18],[1,19,1,24],[2,9,2,13],[2,19,3,24],[0,15,0,31],[1,25,1,31],[2,25,3,31],[18,15,18,16],[7,15,8,16],[7,17,8,18],[7,19,8,20],[7,21,8,22],[7,23,8,24],[7,25,8,27],[15,15,15,16],[9,15,10,16],[9,17,10,18],[9,19,10,20],[9,21,10,22],[13,15,13,16],[21,15,21,16],[23,15,23,31],[25,19,26,31],[20,15,20,16],[30,0,30,4],[30,15,30,16],[24,15,24,16],[28,15,28,16],[29,0,29,4],[29,15,29,16],[25,15,25,16],[26,0,26,4],[26,15,26,16],[27,0,27,4],[27,15,27,16]]}
["UST EQUEURDREVILLE",null,null,null,null,null,null,null,null,null,null,null,null,null,null,"Saison 2024-2025                                                                      Points en jeu"]
[null,"Joueur(es) participant à la rencontre",null,null,null,null,null,null,null,"Saisir votre liste complète en MAJUSCULES ",null,null,null,null,null,"Nationale 3",null,null,null,"Sans carte spécifique",null,null,null,null,null,"Si cartes de couleurs"]
[null,null,null,null,null,null,null,null,null,"Joueurs(es) qualifié(es) saison 2024 -2025",null,null,null,null,null,null,null,null,null,"15,5 pts",null,null,null,null,null,"maxi 19 pts"]
[]
["Statuts","Classif.","          Noms      /    Prénoms",null,"Numéros","ET","VALIDE",null,null,"Statuts","Classif.","          Noms      /    Prénoms",null,"Numéros",null,null,null,null,null,"Si >16pts au début du match (+10 pts adversaire)"]
[null,null,null,null,null,{"$f":"IF(A6=\"ET\",1,\"\")","v":""},{"$f":"IF(B6=5,1,\"\")","v":""},null,null,null,2,"TOLLET","CH",4,null,"Avec une date de validité"]
[null,null,null,null,null,{"$f":"IF(A7=\"ET\",1,\"\")","v":""},{"$f":"IF(B7=5,1,\"\")","v":""},null,null,null,5,"LEBRUN","F",5]
[null,null,null,null,null,{"$f":"IF(A8=\"ET\",1,\"\")","v":""},{"$f":"IF(B8=5,1,\"\")","v":""},null,null,null,2,"CHERIFI","CH",6,null,"Carte Verte",null,"Carte Jaune",null,"Carte Rose",null,"Carte      Bleue",null,"Carte      Orange",null,"Joueurs(es) valides (5pts)",null,null,"Non Sélectionnables en EDF (hors FIDET)"]
[null,null,null,null,null,"","",null,null,null,2.5,"ALLAIN","B",7]
[null,null,null,null,null,"","",null,null,null,null,null,null,8,null,"+  1,5",null,"+  2,5",null,"+  1,5",null,"+  0,5",null,"+  0,5",null,"2 sur la feuille ",null,null,"5 sur la feuille"]
[null,null,null,null,null,"","",null,null,null,2.5,"MARTIN","Q",9,null,null,null,null,null,null,null,null,null,null,null,"2 sur le terrain ",null,null,"4 sur le terrain "]
[null,null,null,null,null,"","",null,null,null,4,"JOUANNE","J",10,null,"Pour le calcul des points"]
[null,null,null,null,null,"","",null,null,null,null,null,null,11,null,"Inscrire dans la colonne de gauche le \"Statut\" des joueurs ou joueuses "]
[null,null,null,null,null,"","",null,null,"ET",3,"NSIMBA","M",12,null,"J",null,null,null,"Jeune joueur débutant (Bonus1,5pt)"]
[null,null,null,null,null,"","",null,null,null,null,null,null,13,null,"JF",null,null,null,"Jeune joueuse débutante (Bonus 2,5pt)"]
[null,null,null,null,null,"","",null,null,null,null,null,null,14,null,"F ou FET",null,null,null,"Femme française ou étrangère < 5pts (Bonus 1,5pt)"]
[null,null,null,null,null,"","","",null,null,null,null,null,15,null,"FV",null,null,null,"Femme française ou étrangère = 5pts (Bonus de 0,5pt)"]
[null,null,null,null,null,"","","",null,null,null,null,null,16,null,"Autres possibilités sans Bonus"]
[null,null,null,null,null,"","","",null,null,null,null,null,17,null,"FID",null,"Pour un joueur à un groupement sportif"]
[null,null,null,null,null,"","",null,null,null,null,null,null,18,null,"ET",null,"Pour un joueur étranger "]
[null,null,null,null,null,"","","",null,null,null,null,null,19,null,"VAL",null,"Masculin français (=5 pts) sans bonus"]
[null,null,null,null,null,"","",null,null,null,null,null,null,20,null,"R",null,"Tous joueurs révisables en classification (sauf valide)"]
[null,null,null,null,null,"","",null,null,null,null,null,null,28,null,null,null,"Pour tous joueurs sans symbole sur la carte de classification"]
[null,null,null,null,null,"","",null,null,null,null,null,null,null,null,"Spécificités Nat 2 et 3 (plus de 55 ans)"]
[null,null,null,null,null,"","",null,null,null,null,null,null,null,null,"S",null,null,null,"Français < 5pts (Bonus de 0,5pt)"]
[null,null,null,null,null,null,null,null,null,null,null,null,null,null,null,"SFID",null,null,null,"Joueurs (FIDET) ou étanger < 5pts (Bonus de 0,5pt)"]
[{"$f":"IF(F32<1,\"\",\"Joueurs ou joueuses étrangers\")","v":""},null,null,null,null,null,null,null,null,null,null,null,null,null,null,"SET"]
[{"$f":"IF(F32=0,\"\",IF(F32>5,\"Trop de joueurs étangers-max 5)\",\"OK\"))","v":""},null,null,null,null,null,null,null,null,null,null,null,null,null,null,"SF",null,null,null,"Femme française  < 5pts (Bonus de 2pts): 1,5pts+0,5pt"]
[null,null,null,null,null,null,null,null,null,null,null,null,null,null,null,"SFET",null,null,null,"Femme étrangère  < 5pts (Bonus de 2pts): 1,5pts+0,5pt"]
[{"$f":"IF(G32<1,\"\",\"Joueurs ou joueuses valides de l'équipe\")","v":""},null,null,null,null,null,null,null,null,null,null,null,null,null,null,"JS",null,null,null,"Jeune français <5pts (Bonus 2pts)"]
[{"$f":"IF(G32=0,\"\",IF(G32>2,\"Trop de valides inscrit sur la feuille-max 1)\",\"OK\"))","v":""},null,null,null,null,null,null,null,null,null,null,null,null,null,null,"JFS",null,null,null,"Jeune française <5pts (Bonus 3pts)"]
[null,null,null,null,null,{"$f":"SUM(F6:F29)","v":0},{"$f":"SUM(G6:G31)","v":0}]

{"sheet":"ENT LAVAL RENNES","index":67,"n_rows":32,"n_cols":29,"rows_kept":32,"cut":false,"hidden":false,"merged":[[14,15,14,16],[9,23,10,24],[11,15,11,31],[12,15,12,31],[19,15,19,16],[16,15,16,16],[17,15,17,31],[5,15,6,31],[7,28,8,31],[9,25,9,27],[9,28,9,31],[10,25,10,27],[10,28,10,31],[1,0,2,0],[1,1,2,3],[1,9,1,13],[1,15,4,18],[1,19,1,24],[2,9,2,13],[2,19,3,24],[0,15,0,31],[1,25,1,31],[2,25,3,31],[18,15,18,16],[7,15,8,16],[7,17,8,18],[7,19,8,20],[7,21,8,22],[7,23,8,24],[7,25,8,27],[15,15,15,16],[9,15,10,16],[9,17,10,18],[9,19,10,20],[9,21,10,22],[13,15,13,16],[21,15,21,16],[23,15,23,31],[25,19,26,31],[20,15,20,16],[30,0,30,4],[30,15,30,16],[24,15,24,16],[28,15,28,16],[29,0,29,4],[29,15,29,16],[25,15,25,16],[26,0,26,4],[26,15,26,16],[27,0,27,4],[27,15,27,16]]}
["Ent LAVAL RENNES",null,null,null,null,null,null,null,null,null,null,null,null,null,null,"Saison 2024-2025                                                                      Points en jeu"]
[null,"Joueur(es) participant à la rencontre",null,null,null,null,null,null,null,"Saisir votre liste complète en MAJUSCULES ",null,null,null,null,null,"Nationale 3",null,null,null,"Sans carte spécifique",null,null,null,null,null,"Si cartes de couleurs"]
[null,null,null,null,null,null,null,null,null,"Joueurs(es) qualifié(es) saison 2024 -2025",null,null,null,null,null,null,null,null,null,"15,5 pts",null,null,null,null,null,"maxi 19 pts"]
[]
["Statuts","Classif.","          Noms      /    Prénoms",null,"Numéros","ET","VALIDE",null,null,"Statuts","Classif.","          Noms      /    Prénoms",null,"Numéros",null,null,null,null,null,"Si >16pts au début du match (+10 pts adversaire)"]
[null,null,null,null,null,{"$f":"IF(A6=\"ET\",1,\"\")","v":""},{"$f":"IF(B6=5,1,\"\")","v":""},null,null,"F",4,"PEUGNIER","O",4,null,"Avec une date de validité"]
[null,null,null,null,null,{"$f":"IF(A7=\"ET\",1,\"\")","v":""},{"$f":"IF(B7=5,1,\"\")","v":""},null,null,null,1,"BEGOIN","V",5]
[null,null,null,null,null,{"$f":"IF(A8=\"ET\",1,\"\")","v":""},{"$f":"IF(B8=5,1,\"\")","v":""},null,null,null,5,"OULMAS","B",6,null,"Carte Verte",null,"Carte Jaune",null,"Carte Rose",null,"Carte      Bleue",null,"Carte      Orange",null,"Joueurs(es) valides (5pts)",null,null,"Non Sélectionnables en EDF (hors FIDET)"]
[null,null,null,null,null,"","",null,null,null,4.5,"LEBARBE","J",7]
[null,null,null,null,null,"","",null,null,null,3,"DEU","T",8,null,"+  1,5",null,"+  2,5",null,"+  1,5",null,"+  0,5",null,"+  0,5",null,"2 sur la feuille ",null,null,"5 sur la feuille"]
[null,null,null,null,null,"","",null,null,null,null,null,null,9,null,null,null,null,null,null,null,null,null,null,null,"2 sur le terrain ",null,null,"4 sur le terrain "]
[null,null,null,null,null,"","",null,null,null,2,"PIED","L",10,null,"Pour le calcul des points"]
[null,null,null,null,null,"","",null,null,null,2.5,"BASQUIN","P",11,null,"Inscrire dans la colonne de gauche le \"Statut\" des joueurs ou joueuses "]
[null,null,null,null,null,"","",null,null,null,null,null,null,12,null,"J",null,null,null,"Jeune joueur débutant (Bonus1,5pt)"]
[null,null,null,null,null,"","",null,null,"FET",3,"DAHUNDJA","A",13,null,"JF",null,null,null,"Jeune joueuse débutante (Bonus 2,5pt)"]
[null,null,null,null,null,"","",null,null,null,1,"LEGAVE","JM",14,null,"F ou FET",null,null,null,"Femme française ou étrangère < 5pts (Bonus 1,5pt)"]
[null,null,null,null,null,"","","",null,null,null,null,null,15,null,"FV",null,null,null,"Femme française ou étrangère = 5pts (Bonus de 0,5pt)"]
[null,null,null,null,null,"","","",null,null,null,null,null,null,null,"Autres possibilités sans Bonus"]
[null,null,null,null,null,"","","",null,null,null,null,null,17,null,"FID",null,"Pour un joueur à un groupement sportif"]
[null,null,null,null,null,"","",null,null,null,3,"ONDOVA","K",18,null,"ET",null,"Pour un joueur étranger "]
[null,null,null,null,null,"","","",null,null,null,null,null,19,null,"VAL",null,"Masculin français (=5 pts) sans bonus"]
[null,null,null,null,null,"","",null,null,null,null,null,null,20,null,"R",null,"Tous joueurs révisables en classification (sauf valide)"]
[null,null,null,null,null,"","",null,null,null,null,null,null,28,null,null,null,"Pour tous joueurs sans symbole sur la carte de classification"]
[null,null,null,null,null,"","",null,null,null,null,null,null,null,null,"Spécificités Nat 2 et 3 (plus de 55 ans)"]
[null,null,null,null,null,"","",null,null,null,null,null,null,null,null,"S",null,null,null,"Français < 5pts (Bonus de 0,5pt)"]
[null,null,null,null,null,null,null,null,null,null,null,null,null,null,null,"SFID",null,null,null,"Joueurs (FIDET) ou étanger < 5pts (Bonus de 0,5pt)"]
[{"$f":"IF(F32<1,\"\",\"Joueurs ou joueuses étrangers\")","v":""},null,null,null,null,null,null,null,null,null,null,null,null,null,null,"SET"]
[{"$f":"IF(F32=0,\"\",IF(F32>5,\"Trop de joueurs étangers-max 5)\",\"OK\"))","v":""},null,null,null,null,null,null,null,null,null,null,null,null,null,null,"SF",null,null,null,"Femme française  < 5pts (Bonus de 2pts): 1,5pts+0,5pt"]
[null,null,null,null,null,null,null,null,null,null,null,null,null,null,null,"SFET",null,null,null,"Femme étrangère  < 5pts (Bonus de 2pts): 1,5pts+0,5pt"]
[{"$f":"IF(G32<1,\"\",\"Joueurs ou joueuses valides de l'équipe\")","v":""},null,null,null,null,null,null,null,null,null,null,null,null,null,null,"JS",null,null,null,"Jeune français <5pts (Bonus 2pts)"]
[{"$f":"IF(G32=0,\"\",IF(G32>2,\"Trop de valides inscrit sur la feuille-max 1)\",\"OK\"))","v":""},null,null,null,null,null,null,null,null,null,null,null,null,null,null,"JFS",null,null,null,"Jeune française <5pts (Bonus 3pts)"]
[null,null,null,null,null,{"$f":"SUM(F6:F29)","v":0},{"$f":"SUM(G6:G31)","v":0}]

{"sheet":"LANNION 2","index":68,"n_rows":32,"n_cols":29,"rows_kept":32,"cut":false,"hidden":false,"merged":[[14,15,14,16],[9,23,10,24],[11,15,11,31],[12,15,12,31],[19,15,19,16],[16,15,16,16],[17,15,17,31],[5,15,6,31],[7,28,8,31],[9,25,9,27],[9,28,9,31],[10,25,10,27],[10,28,10,31],[1,0,2,0],[1,1,2,3],[1,9,1,13],[1,15,4,18],[1,19,1,24],[2,9,2,13],[2,19,3,24],[0,15,0,31],[1,25,1,31],[2,25,3,31],[18,15,18,16],[7,15,8,16],[7,17,8,18],[7,19,8,20],[7,21,8,22],[7,23,8,24],[7,25,8,27],[15,15,15,16],[9,15,10,16],[9,17,10,18],[9,19,10,20],[9,21,10,22],[13,15,13,16],[21,15,21,16],[23,15,23,31],[25,19,26,31],[20,15,20,16],[30,0,30,4],[30,15,30,16],[24,15,24,16],[28,15,28,16],[29,0,29,4],[29,15,29,16],[25,15,25,16],[26,0,26,4],[26,15,26,16],[27,0,27,4],[27,15,27,16]]}
["CTH LANNION 2",null,null,null,null,null,null,null,null,null,null,null,null,null,null,"Saison 2024-2025                                                                      Points en jeu"]
[null,"Joueur(es) participant à la rencontre",null,null,null,null,null,null,null,"Saisir votre liste complète en MAJUSCULES ",null,null,null,null,null,"Nationale 3",null,null,null,"Sans carte spécifique",null,null,null,null,null,"Si cartes de couleurs"]
[null,null,null,null,null,null,null,null,null,"Joueurs(es) qualifié(es) saison 2024 -2025",null,null,null,null,null,null,null,null,null,"15,5 pts",null,null,null,null,null,"maxi 19 pts"]
[]
["Statuts","Classif.","          Noms      /    Prénoms",null,"Numéros","ET","VALIDE",null,null,"Statuts","Classif.","          Noms      /    Prénoms",null,"Numéros",null,null,null,null,null,"Si >16pts au début du match (+10 pts adversaire)"]
[null,null,null,null,null,{"$f":"IF(A6=\"ET\",1,\"\")","v":""},{"$f":"IF(B6=5,1,\"\")","v":""},null,null,"J",4.5,"PRIGENT","M",4,null,"Avec une date de validité"]
[null,null,null,null,null,{"$f":"IF(A7=\"ET\",1,\"\")","v":""},{"$f":"IF(B7=5,1,\"\")","v":""},null,null,null,2,"CAROFF","C",5]
[null,null,null,null,null,{"$f":"IF(A8=\"ET\",1,\"\")","v":""},{"$f":"IF(B8=5,1,\"\")","v":""},null,null,"F",1,"ETAVARD-GLEMP","A",6,null,"Carte Verte",null,"Carte Jaune",null,"Carte Rose",null,"Carte      Bleue",null,"Carte      Orange",null,"Joueurs(es) valides (5pts)",null,null,"Non Sélectionnables en EDF (hors FIDET)"]
[null,null,null,null,null,"","",null,null,null,null,null,null,7]
[null,null,null,null,null,"","",null,null,null,null,null,null,8,null,"+  1,5",null,"+  2,5",null,"+  1,5",null,"+  0,5",null,"+  0,5",null,"2 sur la feuille ",null,null,"5 sur la feuille"]
[null,null,null,null,null,"","",null,null,null,3,"BOLMONT","Y",9,null,null,null,null,null,null,null,null,null,null,null,"2 sur le terrain ",null,null,"4 sur le terrain "]
[null,null,null,null,null,"","",null,null,"FV",5,"PERRON","P",10,null,"Pour le calcul des points"]
[null,null,null,null,null,"","",null,null,null,1,"LEJEUNE","T",11,null,"Inscrire dans la colonne de gauche le \"Statut\" des joueurs ou joueuses "]
[null,null,null,null,null,"","",null,null,null,null,null,null,12,null,"J",null,null,null,"Jeune joueur débutant (Bonus1,5pt)"]
[null,null,null,null,null,"","",null,null,null,1,"LEJEUNE","T",13,null,"JF",null,null,null,"Jeune joueuse débutante (Bonus 2,5pt)"]
[null,null,null,null,null,"","",null,null,null,null,null,null,14,null,"F ou FET",null,null,null,"Femme française ou étrangère < 5pts (Bonus 1,5pt)"]
[null,null,null,null,null,"","","",null,null,5,"CHAMBAUDIE","F",15,null,"FV",null,null,null,"Femme française ou étrangère = 5pts (Bonus de 0,5pt)"]
[null,null,null,null,null,"","","",null,null,null,null,null,16,null,"Autres possibilités sans Bonus"]
[null,null,null,null,null,"","","",null,null,null,null,null,17,null,"FID",null,"Pour un joueur à un groupement sportif"]
[null,null,null,null,null,"","",null,null,null,null,null,null,18,null,"ET",null,"Pour un joueur étranger "]
[null,null,null,null,null,"","","",null,null,null,null,null,19,null,"VAL",null,"Masculin français (=5 pts) sans bonus"]
[null,null,null,null,null,"","",null,null,null,null,null,null,20,null,"R",null,"Tous joueurs révisables en classification (sauf valide)"]
[null,null,null,null,null,"","",null,null,null,null,null,null,28,null,null,null,"Pour tous joueurs sans symbole sur la carte de classification"]
[null,null,null,null,null,"","",null,null,null,null,null,null,null,null,"Spécificités Nat 2 et 3 (plus de 55 ans)"]
[null,null,null,null,null,"","",null,null,null,null,null,null,null,null,"S",null,null,null,"Français < 5pts (Bonus de 0,5pt)"]
[null,null,null,null,null,null,null,null,null,null,null,null,null,null,null,"SFID",null,null,null,"Joueurs (FIDET) ou étanger < 5pts (Bonus de 0,5pt)"]
[{"$f":"IF(F32<1,\"\",\"Joueurs ou joueuses étrangers\")","v":""},null,null,null,null,null,null,null,null,null,null,null,null,null,null,"SET"]
[{"$f":"IF(F32=0,\"\",IF(F32>5,\"Trop de joueurs étangers-max 5)\",\"OK\"))","v":""},null,null,null,null,null,null,null,null,null,null,null,null,null,null,"SF",null,null,null,"Femme française  < 5pts (Bonus de 2pts): 1,5pts+0,5pt"]
[null,null,null,null,null,null,null,null,null,null,null,null,null,null,null,"SFET",null,null,null,"Femme étrangère  < 5pts (Bonus de 2pts): 1,5pts+0,5pt"]
[{"$f":"IF(G32<1,\"\",\"Joueurs ou joueuses valides de l'équipe\")","v":""},null,null,null,null,null,null,null,null,null,null,null,null,null,null,"JS",null,null,null,"Jeune français <5pts (Bonus 2pts)"]
[{"$f":"IF(G32=0,\"\",IF(G32>2,\"Trop de valides inscrit sur la feuille-max 1)\",\"OK\"))","v":""},null,null,null,null,null,null,null,null,null,null,null,null,null,null,"JFS",null,null,null,"Jeune française <5pts (Bonus 3pts)"]
[null,null,null,null,null,{"$f":"SUM(F6:F29)","v":0},{"$f":"SUM(G6:G31)","v":0}]

{"sheet":"NIORT","index":69,"n_rows":32,"n_cols":29,"rows_kept":32,"cut":false,"hidden":false,"merged":[[14,15,14,16],[9,23,10,24],[11,15,11,31],[12,15,12,31],[19,15,19,16],[16,15,16,16],[17,15,17,31],[5,15,6,31],[7,28,8,31],[9,25,9,27],[9,28,9,31],[10,25,10,27],[10,28,10,31],[1,0,2,0],[1,1,2,3],[1,9,1,13],[1,15,4,18],[1,19,1,24],[2,9,2,13],[2,19,3,24],[0,15,0,31],[1,25,1,31],[2,25,3,31],[18,15,18,16],[7,15,8,16],[7,17,8,18],[7,19,8,20],[7,21,8,22],[7,23,8,24],[7,25,8,27],[15,15,15,16],[9,15,10,16],[9,17,10,18],[9,19,10,20],[9,21,10,22],[13,15,13,16],[21,15,21,16],[23,15,23,31],[25,19,26,31],[20,15,20,16],[30,0,30,4],[30,15,30,16],[24,15,24,16],[28,15,28,16],[29,0,29,4],[29,15,29,16],[25,15,25,16],[26,0,26,4],[26,15,26,16],[27,0,27,4],[27,15,27,16]]}
["ASBN  NIORT",null,null,null,null,null,null,null,null,null,null,null,null,null,null,"Saison 2024-2025                                                                      Points en jeu"]
[null,"Joueur(es) participant à la rencontre",null,null,null,null,null,null,null,"Saisir votre liste complète en MAJUSCULES ",null,null,null,null,null,"Nationale 3",null,null,null,"Sans carte spécifique",null,null,null,null,null,"Si cartes de couleurs"]
[null,null,null,null,null,null,null,null,null,"Joueurs(es) qualifié(es) saison 2024 -2025",null,null,null,null,null,null,null,null,null,"15,5 pts",null,null,null,null,null,"maxi 19 pts"]
[]
["Statuts","Classif.","          Noms      /    Prénoms",null,"Numéros","ET","VALIDE",null,null,"Statuts","Classif.","          Noms      /    Prénoms",null,"Numéros",null,null,null,null,null,"Si >16pts au début du match (+10 pts adversaire)"]
[null,null,null,null,null,{"$f":"IF(A6=\"ET\",1,\"\")","v":""},{"$f":"IF(B6=5,1,\"\")","v":""},null,null,null,5,"COLLIN SUREAU","E",4,null,"Avec une date de validité"]
[null,null,null,null,null,{"$f":"IF(A7=\"ET\",1,\"\")","v":""},{"$f":"IF(B7=5,1,\"\")","v":""},null,null,null,2,"GIBERT","C",5]
[null,null,null,null,null,{"$f":"IF(A8=\"ET\",1,\"\")","v":""},{"$f":"IF(B8=5,1,\"\")","v":""},null,null,"JF",4.5,"THIBAUBEAULT","L",6,null,"Carte Verte",null,"Carte Jaune",null,"Carte Rose",null,"Carte      Bleue",null,"Carte      Orange",null,"Joueurs(es) valides (5pts)",null,null,"Non Sélectionnables en EDF (hors FIDET)"]
[null,null,null,null,null,"","",null,null,"J",4.5,"GOUAULT","K",7]
[null,null,null,null,null,"","",null,null,null,null,null,null,8,null,"+  1,5",null,"+  2,5",null,"+  1,5",null,"+  0,5",null,"+  0,5",null,"2 sur la feuille ",null,null,"5 sur la feuille"]
[null,null,null,null,null,"","",null,null,null,null,null,null,9,null,null,null,null,null,null,null,null,null,null,null,"2 sur le terrain ",null,null,"4 sur le terrain "]
[null,null,null,null,null,"","",null,null,null,null,null,null,10,null,"Pour le calcul des points"]
[null,null,null,null,null,"","",null,null,null,null,null,null,11,null,"Inscrire dans la colonne de gauche le \"Statut\" des joueurs ou joueuses "]
[null,null,null,null,null,"","",null,null,null,null,null,null,12,null,"J",null,null,null,"Jeune joueur débutant (Bonus1,5pt)"]
[null,null,null,null,null,"","",null,null,null,null,null,null,13,null,"JF",null,null,null,"Jeune joueuse débutante (Bonus 2,5pt)"]
[null,null,null,null,null,"","",null,null,null,null,null,null,14,null,"F ou FET",null,null,null,"Femme française ou étrangère < 5pts (Bonus 1,5pt)"]
[null,null,null,null,null,"","","",null,null,4.5,"GERMAIN","L",15,null,"FV",null,null,null,"Femme française ou étrangère = 5pts (Bonus de 0,5pt)"]
[null,null,null,null,null,"","","",null,null,null,null,null,16,null,"Autres possibilités sans Bonus"]
[null,null,null,null,null,"","","",null,null,3.5,"PREVOST","L",30,null,"FID",null,"Pour un joueur à un groupement sportif"]
[null,null,null,null,null,"","",null,null,null,null,null,null,31,null,"ET",null,"Pour un joueur étranger "]
[null,null,null,null,null,"","","",null,null,5,"DANTAN","S",79,null,"VAL",null,"Masculin français (=5 pts) sans bonus"]
[null,null,null,null,null,"","",null,null,null,null,null,null,null,null,"R",null,"Tous joueurs révisables en classification (sauf valide)"]
[null,null,null,null,null,"","",null,null,null,null,null,null,null,null,null,null,"Pour tous joueurs sans symbole sur la carte de classification"]
[null,null,null,null,null,"","",null,null,null,null,null,null,null,null,"Spécificités Nat 2 et 3 (plus de 55 ans)"]
[null,null,null,null,null,"","",null,null,null,null,null,null,null,null,"S",null,null,null,"Français < 5pts (Bonus de 0,5pt)"]
[null,null,null,null,null,null,null,null,null,null,null,null,null,null,null,"SFID",null,null,null,"Joueurs (FIDET) ou étanger < 5pts (Bonus de 0,5pt)"]
[{"$f":"IF(F32<1,\"\",\"Joueurs ou joueuses étrangers\")","v":""},null,null,null,null,null,null,null,null,null,null,null,null,null,null,"SET"]
[{"$f":"IF(F32=0,\"\",IF(F32>5,\"Trop de joueurs étangers-max 5)\",\"OK\"))","v":""},null,null,null,null,null,null,null,null,null,null,null,null,null,null,"SF",null,null,null,"Femme française  < 5pts (Bonus de 2pts): 1,5pts+0,5pt"]
[null,null,null,null,null,null,null,null,null,null,null,null,null,null,null,"SFET",null,null,null,"Femme étrangère  < 5pts (Bonus de 2pts): 1,5pts+0,5pt"]
[{"$f":"IF(G32<1,\"\",\"Joueurs ou joueuses valides de l'équipe\")","v":""},null,null,null,null,null,null,null,null,null,null,null,null,null,null,"JS",null,null,null,"Jeune français <5pts (Bonus 2pts)"]
[{"$f":"IF(G32=0,\"\",IF(G32>2,\"Trop de valides inscrit sur la feuille-max 1)\",\"OK\"))","v":""},null,null,null,null,null,null,null,null,null,null,null,null,null,null,"JFS",null,null,null,"Jeune française <5pts (Bonus 3pts)"]
[null,null,null,null,null,{"$f":"SUM(F6:F29)","v":0},{"$f":"SUM(G6:G31)","v":0}]

{"sheet":"QUIMPER","index":70,"n_rows":32,"n_cols":29,"rows_kept":32,"cut":false,"hidden":false,"merged":[[1,0,2,0],[1,1,2,3],[1,9,1,13],[1,15,4,18],[1,19,1,24],[2,9,2,13],[2,19,3,24],[9,21,10,22],[13,15,13,16],[14,15,14,16],[0,15,0,31],[1,25,1,31],[2,25,3,31],[11,15,11,31],[12,15,12,31],[9,15,10,16],[9,17,10,18],[9,19,10,20],[30,0,30,4],[30,15,30,16],[24,15,24,16],[28,15,28,16],[29,0,29,4],[29,15,29,16],[25,15,25,16],[26,0,26,4],[26,15,26,16],[27,0,27,4],[27,15,27,16],[16,15,16,16],[17,15,17,31],[15,15,15,16],[5,15,6,31],[7,28,8,31],[9,25,9,27],[9,28,9,31],[10,25,10,27],[10,28,10,31],[7,15,8,16],[7,17,8,18],[7,19,8,20],[7,21,8,22],[7,23,8,24],[7,25,8,27],[9,23,10,24],[18,15,18,16],[21,15,21,16],[23,15,23,31],[25,19,26,31],[19,15,19,16],[20,15,20,16]]}
["UC QUIMPER",null,null,null,null,null,null,null,null,null,null,null,null,null,null,"Saison 2024-2025                                                                      Points en jeu"]
[null,"Joueur(es) participant à la rencontre",null,null,null,null,null,null,null,"Saisir votre liste complète en MAJUSCULES ",null,null,null,null,null,"Nationale 3",null,null,null,"Sans carte spécifique",null,null,null,null,null,"Si cartes de couleurs"]
[null,null,null,null,null,null,null,null,null,"Joueurs(es) qualifié(es) saison 2024 -2025",null,null,null,null,null,null,null,null,null,"15,5 pts",null,null,null,null,null,"maxi 19 pts"]
[]
["Statuts","Classif.","          Noms      /    Prénoms",null,"Numéros","ET","VALIDE",null,null,"Statuts","Classif.","          Noms      /    Prénoms",null,"Numéros",null,null,null,null,null,"Si >16pts au début du match (+10 pts adversaire)"]
[null,null,null,null,null,{"$f":"IF(A6=\"ET\",1,\"\")","v":""},{"$f":"IF(B6=5,1,\"\")","v":""},null,null,null,null,null,null,4,null,"Avec une date de validité"]
[null,null,null,null,null,{"$f":"IF(A7=\"ET\",1,\"\")","v":""},{"$f":"IF(B7=5,1,\"\")","v":""},null,null,null,null,null,null,5]
[null,null,null,null,null,{"$f":"IF(A8=\"ET\",1,\"\")","v":""},{"$f":"IF(B8=5,1,\"\")","v":""},null,null,null,2.5,"BOETE","A",6,null,"Carte Verte",null,"Carte Jaune",null,"Carte Rose",null,"Carte      Bleue",null,"Carte      Orange",null,"Joueurs(es) valides (5pts)",null,null,"Non Sélectionnables en EDF (hors FIDET)"]
[null,null,null,null,null,"","",null,null,null,null,null,null,7]
[null,null,null,null,null,"","",null,null,null,1,"GUILLARD","M",8,null,"+  1,5",null,"+  2,5",null,"+  1,5",null,"+  0,5",null,"+  0,5",null,"2 sur la feuille ",null,null,"5 sur la feuille"]
[null,null,null,null,null,"","",null,null,null,5,"MARTIN ","G",9,null,null,null,null,null,null,null,null,null,null,null,"2 sur le terrain ",null,null,"4 sur le terrain "]
[null,null,null,null,null,"","",null,null,null,null,null,null,10,null,"Pour le calcul des points"]
[null,null,null,null,null,"","",null,null,null,null,null,null,11,null,"Inscrire dans la colonne de gauche le \"Statut\" des joueurs ou joueuses "]
[null,null,null,null,null,"","",null,null,"S",1.5,"MARTIN ","H",12,null,"J",null,null,null,"Jeune joueur débutant (Bonus1,5pt)"]
[null,null,null,null,null,"","",null,null,"F",4.5,"CLAVAUD","N",13,null,"JF",null,null,null,"Jeune joueuse débutante (Bonus 2,5pt)"]
[null,null,null,null,null,"","",null,null,null,null,null,null,14,null,"F ou FET",null,null,null,"Femme française ou étrangère < 5pts (Bonus 1,5pt)"]
[null,null,null,null,null,"","","",null,null,null,null,null,15,null,"FV",null,null,null,"Femme française ou étrangère = 5pts (Bonus de 0,5pt)"]
[null,null,null,null,null,"","","",null,null,null,null,null,16,null,"Autres possibilités sans Bonus"]
[null,null,null,null,null,"","","",null,"F",4.5,"LEDEON","F",20,null,"FID",null,"Pour un joueur à un groupement sportif"]
[null,null,null,null,null,"","",null,null,null,1,"L'HER ","JY",21,null,"ET",null,"Pour un joueur étranger "]
[null,null,null,null,null,"","","",null,null,1,"BARGUILLE","R",23,null,"VAL",null,"Masculin français (=5 pts) sans bonus"]
[null,null,null,null,null,"","",null,null,null,null,null,null,null,null,"R",null,"Tous joueurs révisables en classification (sauf valide)"]
[null,null,null,null,null,"","",null,null,null,null,null,null,null,null,null,null,"Pour tous joueurs sans symbole sur la carte de classification"]
[null,null,null,null,null,"","",null,null,null,null,null,null,null,null,"Spécificités Nat 2 et 3 (plus de 55 ans)"]
[null,null,null,null,null,"","",null,null,null,null,null,null,null,null,"S",null,null,null,"Français < 5pts (Bonus de 0,5pt)"]
[null,null,null,null,null,null,null,null,null,null,null,null,null,null,null,"SFID",null,null,null,"Joueurs (FIDET) ou étanger < 5pts (Bonus de 0,5pt)"]
[{"$f":"IF(F32<1,\"\",\"Joueurs ou joueuses étrangers\")","v":""},null,null,null,null,null,null,null,null,null,null,null,null,null,null,"SET"]
[{"$f":"IF(F32=0,\"\",IF(F32>5,\"Trop de joueurs étangers-max 5)\",\"OK\"))","v":""},null,null,null,null,null,null,null,null,null,null,null,null,null,null,"SF",null,null,null,"Femme française  < 5pts (Bonus de 2pts): 1,5pts+0,5pt"]
[null,null,null,null,null,null,null,null,null,null,null,null,null,null,null,"SFET",null,null,null,"Femme étrangère  < 5pts (Bonus de 2pts): 1,5pts+0,5pt"]
[{"$f":"IF(G32<1,\"\",\"Joueurs ou joueuses valides de l'équipe\")","v":""},null,null,null,null,null,null,null,null,null,null,null,null,null,null,"JS",null,null,null,"Jeune français <5pts (Bonus 2pts)"]
[{"$f":"IF(G32=0,\"\",IF(G32>2,\"Trop de valides inscrit sur la feuille-max 1)\",\"OK\"))","v":""},null,null,null,null,null,null,null,null,null,null,null,null,null,null,"JFS",null,null,null,"Jeune française <5pts (Bonus 3pts)"]
[null,null,null,null,null,{"$f":"SUM(F6:F29)","v":0},{"$f":"SUM(G6:G31)","v":0}]

{"sheet":"SAINT POL DE LEON","index":71,"n_rows":32,"n_cols":29,"rows_kept":32,"cut":false,"hidden":false,"merged":[[14,15,14,16],[9,23,10,24],[11,15,11,31],[12,15,12,31],[19,15,19,16],[16,15,16,16],[17,15,17,31],[5,15,6,31],[7,28,8,31],[9,25,9,27],[9,28,9,31],[10,25,10,27],[10,28,10,31],[1,0,2,0],[1,1,2,3],[1,9,1,13],[1,15,4,18],[1,19,1,24],[2,9,2,13],[2,19,3,24],[0,15,0,31],[1,25,1,31],[2,25,3,31],[18,15,18,16],[7,15,8,16],[7,17,8,18],[7,19,8,20],[7,21,8,22],[7,23,8,24],[7,25,8,27],[15,15,15,16],[9,15,10,16],[9,17,10,18],[9,19,10,20],[9,21,10,22],[13,15,13,16],[21,15,21,16],[23,15,23,31],[25,19,26,31],[20,15,20,16],[30,0,30,4],[30,15,30,16],[24,15,24,16],[28,15,28,16],[29,0,29,4],[29,15,29,16],[25,15,25,16],[26,0,26,4],[26,15,26,16],[27,0,27,4],[27,15,27,16]]}
["SAINT POL DE LEON",null,null,null,null,null,null,null,null,null,null,null,null,null,null,"Saison 2024-2025                                                                      Points en jeu"]
[null,"Joueur(es) participant à la rencontre",null,null,null,null,null,null,null,"Saisir votre liste complète en MAJUSCULES ",null,null,null,null,null,"Nationale 3",null,null,null,"Sans carte spécifique",null,null,null,null,null,"Si cartes de couleurs"]
[null,null,null,null,null,null,null,null,null,"Joueurs(es) qualifié(es) saison 2024 -2025",null,null,null,null,null,null,null,null,null,"15,5 pts",null,null,null,null,null,"maxi 19 pts"]
[]
["Statuts","Classif.","          Noms      /    Prénoms",null,"Numéros","ET","VALIDE",null,null,"Statuts","Classif.","          Noms      /    Prénoms",null,"Numéros",null,null,null,null,null,"Si >16pts au début du match (+10 pts adversaire)"]
[null,null,null,null,null,{"$f":"IF(A6=\"ET\",1,\"\")","v":""},{"$f":"IF(B6=5,1,\"\")","v":""},null,null,null,null,null,null,4,null,"Avec une date de validité"]
[null,null,null,null,null,{"$f":"IF(A7=\"ET\",1,\"\")","v":""},{"$f":"IF(B7=5,1,\"\")","v":""},null,null,null,1,"GUENEUGUES","L",5]
[null,null,null,null,null,{"$f":"IF(A8=\"ET\",1,\"\")","v":""},{"$f":"IF(B8=5,1,\"\")","v":""},null,null,null,null,null,null,6,null,"Carte Verte",null,"Carte Jaune",null,"Carte Rose",null,"Carte      Bleue",null,"Carte      Orange",null,"Joueurs(es) valides (5pts)",null,null,"Non Sélectionnables en EDF (hors FIDET)"]
[null,null,null,null,null,"","",null,null,null,null,null,null,7]
[null,null,null,null,null,"","",null,null,"F",4.5,"ARMAND","S",8,null,"+  1,5",null,"+  2,5",null,"+  1,5",null,"+  0,5",null,"+  0,5",null,"2 sur la feuille ",null,null,"5 sur la feuille"]
[null,null,null,null,null,"","",null,null,"ET",4.5,"TRONTI","E",9,null,null,null,null,null,null,null,null,null,null,null,"2 sur le terrain ",null,null,"4 sur le terrain "]
[null,null,null,null,null,"","",null,null,"S",1.5,"ABYVEN","JL",10,null,"Pour le calcul des points"]
[null,null,null,null,null,"","",null,null,null,null,null,null,11,null,"Inscrire dans la colonne de gauche le \"Statut\" des joueurs ou joueuses "]
[null,null,null,null,null,"","",null,null,null,3.5,"CRENN","L",12,null,"J",null,null,null,"Jeune joueur débutant (Bonus1,5pt)"]
[null,null,null,null,null,"","",null,null,"JF",5,"CURADO TRONTI","L",13,null,"JF",null,null,null,"Jeune joueuse débutante (Bonus 2,5pt)"]
[null,null,null,null,null,"","",null,null,null,null,null,null,14,null,"F ou FET",null,null,null,"Femme française ou étrangère < 5pts (Bonus 1,5pt)"]
[null,null,null,null,null,"","","",null,null,5,"CRENN","N",15,null,"FV",null,null,null,"Femme française ou étrangère = 5pts (Bonus de 0,5pt)"]
[null,null,null,null,null,"","","",null,null,null,null,null,20,null,"Autres possibilités sans Bonus"]
[null,null,null,null,null,"","","",null,null,null,null,null,21,null,"FID",null,"Pour un joueur à un groupement sportif"]
[null,null,null,null,null,"","",null,null,null,null,null,null,23,null,"ET",null,"Pour un joueur étranger "]
[null,null,null,null,null,"","","",null,null,null,null,null,25,null,"VAL",null,"Masculin français (=5 pts) sans bonus"]
[null,null,null,null,null,"","",null,null,null,null,null,null,77,null,"R",null,"Tous joueurs révisables en classification (sauf valide)"]
[null,null,null,null,null,"","",null,null,null,null,null,null,28,null,null,null,"Pour tous joueurs sans symbole sur la carte de classification"]
[null,null,null,null,null,"","",null,null,null,null,null,null,null,null,"Spécificités Nat 2 et 3 (plus de 55 ans)"]
[null,null,null,null,null,"","",null,null,null,null,null,null,null,null,"S",null,null,null,"Français < 5pts (Bonus de 0,5pt)"]
[null,null,null,null,null,null,null,null,null,null,null,null,null,null,null,"SFID",null,null,null,"Joueurs (FIDET) ou étanger < 5pts (Bonus de 0,5pt)"]
[{"$f":"IF(F32<1,\"\",\"Joueurs ou joueuses étrangers\")","v":""},null,null,null,null,null,null,null,null,null,null,null,null,null,null,"SET"]
[{"$f":"IF(F32=0,\"\",IF(F32>5,\"Trop de joueurs étangers-max 5)\",\"OK\"))","v":""},null,null,null,null,null,null,null,null,null,null,null,null,null,null,"SF",null,null,null,"Femme française  < 5pts (Bonus de 2pts): 1,5pts+0,5pt"]
[null,null,null,null,null,null,null,null,null,null,null,null,null,null,null,"SFET",null,null,null,"Femme étrangère  < 5pts (Bonus de 2pts): 1,5pts+0,5pt"]
[{"$f":"IF(G32<1,\"\",\"Joueurs ou joueuses valides de l'équipe\")","v":""},null,null,null,null,null,null,null,null,null,null,null,null,null,null,"JS",null,null,null,"Jeune français <5pts (Bonus 2pts)"]
[{"$f":"IF(G32=0,\"\",IF(G32>2,\"Trop de valides inscrit sur la feuille-max 1)\",\"OK\"))","v":""},null,null,null,null,null,null,null,null,null,null,null,null,null,null,"JFS",null,null,null,"Jeune française <5pts (Bonus 3pts)"]
[null,null,null,null,null,{"$f":"SUM(F6:F29)","v":0},{"$f":"SUM(G6:G31)","v":0}]

{"sheet":"PAYS BASQUE EUSKADI","index":72,"n_rows":32,"n_cols":29,"rows_kept":32,"cut":false,"hidden":false,"merged":[[14,15,14,16],[9,23,10,24],[11,15,11,31],[12,15,12,31],[19,15,19,16],[16,15,16,16],[17,15,17,31],[5,15,6,31],[7,28,8,31],[9,25,9,27],[9,28,9,31],[10,25,10,27],[10,28,10,31],[1,0,2,0],[1,1,2,3],[1,9,1,13],[1,15,4,18],[1,19,1,24],[2,9,2,13],[2,19,3,24],[0,15,0,31],[1,25,1,31],[2,25,3,31],[18,15,18,16],[7,15,8,16],[7,17,8,18],[7,19,8,20],[7,21,8,22],[7,23,8,24],[7,25,8,27],[15,15,15,16],[9,15,10,16],[9,17,10,18],[9,19,10,20],[9,21,10,22],[13,15,13,16],[21,15,21,16],[23,15,23,31],[25,19,26,31],[20,15,20,16],[30,0,30,4],[30,15,30,16],[24,15,24,16],[28,15,28,16],[29,0,29,4],[29,15,29,16],[25,15,25,16],[26,0,26,4],[26,15,26,16],[27,0,27,4],[27,15,27,16]]}
["HPAYS BASQUE EUSKADI",null,null,null,null,null,null,null,null,null,null,null,null,null,null,"Saison 2024-2025                                                                      Points en jeu"]
[null,"Joueur(es) participant à la rencontre",null,null,null,null,null,null,null,"Saisir votre liste complète en MAJUSCULES ",null,null,null,null,null,"Nationale 3",null,null,null,"Sans carte spécifique",null,null,null,null,null,"Si cartes de couleurs"]
[null,null,null,null,null,null,null,null,null,"Joueurs(es) qualifié(es) saison 2024 -2025",null,null,null,null,null,null,null,null,null,"15,5 pts",null,null,null,null,null,"maxi 19 pts"]
[]
["Statuts","Classif.","          Noms      /    Prénoms",null,"Numéros","ET","VALIDE",null,null,"Statuts","Classif.","          Noms      /    Prénoms",null,"Numéros",null,null,null,null,null,"Si >16pts au début du match (+10 pts adversaire)"]
[null,null,null,null,null,{"$f":"IF(A6=\"ET\",1,\"\")","v":""},{"$f":"IF(B6=5,1,\"\")","v":""},null,null,null,null,null,null,4,null,"Avec une date de validité"]
[null,null,null,null,null,{"$f":"IF(A7=\"ET\",1,\"\")","v":""},{"$f":"IF(B7=5,1,\"\")","v":""},null,null,null,5,"MENETRIER","PH",5]
[null,null,null,null,null,{"$f":"IF(A8=\"ET\",1,\"\")","v":""},{"$f":"IF(B8=5,1,\"\")","v":""},null,null,null,null,null,null,6,null,"Carte Verte",null,"Carte Jaune",null,"Carte Rose",null,"Carte      Bleue",null,"Carte      Orange",null,"Joueurs(es) valides (5pts)",null,null,"Non Sélectionnables en EDF (hors FIDET)"]
[null,null,null,null,null,"","",null,null,"ET",1,"STEWART","J",7]
[null,null,null,null,null,"","",null,null,"S",4,"BACHOFFER","H",8,null,"+  1,5",null,"+  2,5",null,"+  1,5",null,"+  0,5",null,"+  0,5",null,"2 sur la feuille ",null,null,"5 sur la feuille"]
[null,null,null,null,null,"","",null,null,null,2,"RYBACK","Y",9,null,null,null,null,null,null,null,null,null,null,null,"2 sur le terrain ",null,null,"4 sur le terrain "]
[null,null,null,null,null,"","",null,null,"ET",1.5,"KSOURI","KS",10,null,"Pour le calcul des points"]
[null,null,null,null,null,"","",null,null,null,null,null,null,11,null,"Inscrire dans la colonne de gauche le \"Statut\" des joueurs ou joueuses "]
[null,null,null,null,null,"","",null,null,null,null,null,null,12,null,"J",null,null,null,"Jeune joueur débutant (Bonus1,5pt)"]
[null,null,null,null,null,"","",null,null,null,5,"APPLAINCOURT","T",13,null,"JF",null,null,null,"Jeune joueuse débutante (Bonus 2,5pt)"]
[null,null,null,null,null,"","",null,null,null,2,"COUSSAU","E",14,null,"F ou FET",null,null,null,"Femme française ou étrangère < 5pts (Bonus 1,5pt)"]
[null,null,null,null,null,"","","",null,"S",4,"BIRON","J",15,null,"FV",null,null,null,"Femme française ou étrangère = 5pts (Bonus de 0,5pt)"]
[null,null,null,null,null,"","","",null,null,null,null,null,16,null,"Autres possibilités sans Bonus"]
[null,null,null,null,null,"","","",null,null,null,null,null,17,null,"FID",null,"Pour un joueur à un groupement sportif"]
[null,null,null,null,null,"","",null,null,null,null,null,null,18,null,"ET",null,"Pour un joueur étranger "]
[null,null,null,null,null,"","","",null,null,null,null,null,20,null,"VAL",null,"Masculin français (=5 pts) sans bonus"]
[null,null,null,null,null,"","",null,null,null,null,null,null,21,null,"R",null,"Tous joueurs révisables en classification (sauf valide)"]
[null,null,null,null,null,"","",null,null,null,null,null,null,22,null,null,null,"Pour tous joueurs sans symbole sur la carte de classification"]
[null,null,null,null,null,"","",null,null,null,null,null,null,null,null,"Spécificités Nat 2 et 3 (plus de 55 ans)"]
[null,null,null,null,null,"","",null,null,null,null,null,null,null,null,"S",null,null,null,"Français < 5pts (Bonus de 0,5pt)"]
[null,null,null,null,null,null,null,null,null,null,null,null,null,null,null,"SFID",null,null,null,"Joueurs (FIDET) ou étanger < 5pts (Bonus de 0,5pt)"]
[{"$f":"IF(F32<1,\"\",\"Joueurs ou joueuses étrangers\")","v":""},null,null,null,null,null,null,null,null,null,null,null,null,null,null,"SET"]
[{"$f":"IF(F32=0,\"\",IF(F32>5,\"Trop de joueurs étangers-max 5)\",\"OK\"))","v":""},null,null,null,null,null,null,null,null,null,null,null,null,null,null,"SF",null,null,null,"Femme française  < 5pts (Bonus de 2pts): 1,5pts+0,5pt"]
[null,null,null,null,null,null,null,null,null,null,null,null,null,null,null,"SFET",null,null,null,"Femme étrangère  < 5pts (Bonus de 2pts): 1,5pts+0,5pt"]
[{"$f":"IF(G32<1,\"\",\"Joueurs ou joueuses valides de l'équipe\")","v":""},null,null,null,null,null,null,null,null,null,null,null,null,null,null,"JS",null,null,null,"Jeune français <5pts (Bonus 2pts)"]
[{"$f":"IF(G32=0,\"\",IF(G32>2,\"Trop de valides inscrit sur la feuille-max 1)\",\"OK\"))","v":""},null,null,null,null,null,null,null,null,null,null,null,null,null,null,"JFS",null,null,null,"Jeune française <5pts (Bonus 3pts)"]
[null,null,null,null,null,{"$f":"SUM(F6:F29)","v":0},{"$f":"SUM(G6:G31)","v":0}]

{"sheet":"ASMTH","index":73,"n_rows":32,"n_cols":29,"rows_kept":32,"cut":false,"hidden":false,"merged":[[14,15,14,16],[9,23,10,24],[11,15,11,31],[12,15,12,31],[19,15,19,16],[16,15,16,16],[17,15,17,31],[5,15,6,31],[7,28,8,31],[9,25,9,27],[9,28,9,31],[10,25,10,27],[10,28,10,31],[1,0,2,0],[1,1,2,3],[1,9,1,13],[1,15,4,18],[1,19,1,24],[2,9,2,13],[2,19,3,24],[0,15,0,31],[1,25,1,31],[2,25,3,31],[18,15,18,16],[7,15,8,16],[7,17,8,18],[7,19,8,20],[7,21,8,22],[7,23,8,24],[7,25,8,27],[15,15,15,16],[9,15,10,16],[9,17,10,18],[9,19,10,20],[9,21,10,22],[13,15,13,16],[21,15,21,16],[23,15,23,31],[25,19,26,31],[20,15,20,16],[30,0,30,4],[30,15,30,16],[24,15,24,16],[28,15,28,16],[29,0,29,4],[29,15,29,16],[25,15,25,16],[26,0,26,4],[26,15,26,16],[27,0,27,4],[27,15,27,16]]}
["ASMTH",null,null,null,null,null,null,null,null,null,null,null,null,null,null,"Saison 2024-2025                                                                      Points en jeu"]
[null,"Joueur(es) participant à la rencontre",null,null,null,null,null,null,null,"Saisir votre liste complète en MAJUSCULES ",null,null,null,null,null,"Nationale 3",null,null,null,"Sans carte spécifique",null,null,null,null,null,"Si cartes de couleurs"]
[null,null,null,null,null,null,null,null,null,"Joueurs(es) qualifié(es) saison 2024 -2025",null,null,null,null,null,null,null,null,null,"15,5 pts",null,null,null,null,null,"maxi 19 pts"]
[]
["Statuts","Classif.","          Noms      /    Prénoms",null,"Numéros","ET","VALIDE",null,null,"Statuts","Classif.","          Noms      /    Prénoms",null,"Numéros",null,null,null,null,null,"Si >16pts au début du match (+10 pts adversaire)"]
[null,null,null,null,null,{"$f":"IF(A6=\"ET\",1,\"\")","v":""},{"$f":"IF(B6=5,1,\"\")","v":""},null,null,null,null,null,null,4,null,"Avec une date de validité"]
[null,null,null,null,null,{"$f":"IF(A7=\"ET\",1,\"\")","v":""},{"$f":"IF(B7=5,1,\"\")","v":""},null,null,null,1.5,"CROUIGNEAU","G",5]
[null,null,null,null,null,{"$f":"IF(A8=\"ET\",1,\"\")","v":""},{"$f":"IF(B8=5,1,\"\")","v":""},null,null,null,null,null,null,6,null,"Carte Verte",null,"Carte Jaune",null,"Carte Rose",null,"Carte      Bleue",null,"Carte      Orange",null,"Joueurs(es) valides (5pts)",null,null,"Non Sélectionnables en EDF (hors FIDET)"]
[null,null,null,null,null,"","",null,null,"F",4,"LALOY","A",7]
[null,null,null,null,null,"","",null,null,null,null,null,null,8,null,"+  1,5",null,"+  2,5",null,"+  1,5",null,"+  0,5",null,"+  0,5",null,"2 sur la feuille ",null,null,"5 sur la feuille"]
[null,null,null,null,null,"","",null,null,null,null,null,null,9,null,null,null,null,null,null,null,null,null,null,null,"2 sur le terrain ",null,null,"4 sur le terrain "]
[null,null,null,null,null,"","",null,null,"ET",1,"BRUNET","A",10,null,"Pour le calcul des points"]
[null,null,null,null,null,"","",null,null,null,2.5,"DO  BRITO",2.5,11,null,"Inscrire dans la colonne de gauche le \"Statut\" des joueurs ou joueuses "]
[null,null,null,null,null,"","",null,null,null,1.5,"CANAL","A",12,null,"J",null,null,null,"Jeune joueur débutant (Bonus1,5pt)"]
[null,null,null,null,null,"","",null,null,"ET",4,"MOHAMED DALDUN","Y",13,null,"JF",null,null,null,"Jeune joueuse débutante (Bonus 2,5pt)"]
[null,null,null,null,null,"","",null,null,null,3.5,"TASSOT","Y",14,null,"F ou FET",null,null,null,"Femme française ou étrangère < 5pts (Bonus 1,5pt)"]
[null,null,null,null,null,"","","",null,null,null,null,null,15,null,"FV",null,null,null,"Femme française ou étrangère = 5pts (Bonus de 0,5pt)"]
[null,null,null,null,null,"","","",null,null,null,null,null,16,null,"Autres possibilités sans Bonus"]
[null,null,null,null,null,"","","",null,null,null,null,null,17,null,"FID",null,"Pour un joueur à un groupement sportif"]
[null,null,null,null,null,"","",null,null,null,null,null,null,18,null,"ET",null,"Pour un joueur étranger "]
[null,null,null,null,null,"","","",null,null,null,null,null,20,null,"VAL",null,"Masculin français (=5 pts) sans bonus"]
[null,null,null,null,null,"","",null,null,null,null,null,null,21,null,"R",null,"Tous joueurs révisables en classification (sauf valide)"]
[null,null,null,null,null,"","",null,null,null,null,null,null,22,null,null,null,"Pour tous joueurs sans symbole sur la carte de classification"]
[null,null,null,null,null,"","",null,null,null,null,null,null,null,null,"Spécificités Nat 2 et 3 (plus de 55 ans)"]
[null,null,null,null,null,"","",null,null,null,null,null,null,null,null,"S",null,null,null,"Français < 5pts (Bonus de 0,5pt)"]
[null,null,null,null,null,null,null,null,null,null,null,null,null,null,null,"SFID",null,null,null,"Joueurs (FIDET) ou étanger < 5pts (Bonus de 0,5pt)"]
[{"$f":"IF(F32<1,\"\",\"Joueurs ou joueuses étrangers\")","v":""},null,null,null,null,null,null,null,null,null,null,null,null,null,null,"SET"]
[{"$f":"IF(F32=0,\"\",IF(F32>5,\"Trop de joueurs étangers-max 5)\",\"OK\"))","v":""},null,null,null,null,null,null,null,null,null,null,null,null,null,null,"SF",null,null,null,"Femme française  < 5pts (Bonus de 2pts): 1,5pts+0,5pt"]
[null,null,null,null,null,null,null,null,null,null,null,null,null,null,null,"SFET",null,null,null,"Femme étrangère  < 5pts (Bonus de 2pts): 1,5pts+0,5pt"]
[{"$f":"IF(G32<1,\"\",\"Joueurs ou joueuses valides de l'équipe\")","v":""},null,null,null,null,null,null,null,null,null,null,null,null,null,null,"JS",null,null,null,"Jeune français <5pts (Bonus 2pts)"]
[{"$f":"IF(G32=0,\"\",IF(G32>2,\"Trop de valides inscrit sur la feuille-max 1)\",\"OK\"))","v":""},null,null,null,null,null,null,null,null,null,null,null,null,null,null,"JFS",null,null,null,"Jeune française <5pts (Bonus 3pts)"]
[null,null,null,null,null,{"$f":"SUM(F6:F29)","v":0},{"$f":"SUM(G6:G31)","v":0}]

{"sheet":"ENT BORDEAUX BLANQUEFORT 2","index":74,"n_rows":32,"n_cols":29,"rows_kept":32,"cut":false,"hidden":false,"merged":[[14,15,14,16],[9,23,10,24],[11,15,11,31],[12,15,12,31],[19,15,19,16],[16,15,16,16],[17,15,17,31],[5,15,6,31],[7,28,8,31],[9,25,9,27],[9,28,9,31],[10,25,10,27],[10,28,10,31],[1,0,2,0],[1,1,2,3],[1,9,1,13],[1,15,4,18],[1,19,1,24],[2,9,2,13],[2,19,3,24],[0,15,0,31],[1,25,1,31],[2,25,3,31],[18,15,18,16],[7,15,8,16],[7,17,8,18],[7,19,8,20],[7,21,8,22],[7,23,8,24],[7,25,8,27],[15,15,15,16],[9,15,10,16],[9,17,10,18],[9,19,10,20],[9,21,10,22],[13,15,13,16],[21,15,21,16],[23,15,23,31],[25,19,26,31],[20,15,20,16],[30,0,30,4],[30,15,30,16],[24,15,24,16],[28,15,28,16],[29,0,29,4],[29,15,29,16],[25,15,25,16],[26,0,26,4],[26,15,26,16],[27,0,27,4],[27,15,27,16]]}
["ESMH BORDEAUX BLANQUEFORT 2",null,null,null,null,null,null,null,null,null,null,null,null,null,null,"Saison 2024-2025                                                                      Points en jeu"]
[null,"Joueur(es) participant à la rencontre",null,null,null,null,null,null,null,"Saisir votre liste complète en MAJUSCULES ",null,null,null,null,null,"Nationale 3",null,null,null,"Sans carte spécifique",null,null,null,null,null,"Si cartes de couleurs"]
[null,null,null,null,null,null,null,null,null,"Joueurs(es) qualifié(es) saison 2024 -2025",null,null,null,null,null,null,null,null,null,"15,5 pts",null,null,null,null,null,"maxi 19 pts"]
[]
["Statuts","Classif.","          Noms      /    Prénoms",null,"Numéros","ET","VALIDE",null,null,"Statuts","Classif.","          Noms      /    Prénoms",null,"Numéros",null,null,null,null,null,"Si >16pts au début du match (+10 pts adversaire)"]
[null,null,null,null,null,{"$f":"IF(A6=\"ET\",1,\"\")","v":""},{"$f":"IF(B6=5,1,\"\")","v":""},null,null,null,2.5,"COUREAU","T",3,null,"Avec une date de validité"]
[null,null,null,null,null,{"$f":"IF(A7=\"ET\",1,\"\")","v":""},{"$f":"IF(B7=5,1,\"\")","v":""},null,null,null,null,null,null,4]
[null,null,null,null,null,{"$f":"IF(A8=\"ET\",1,\"\")","v":""},{"$f":"IF(B8=5,1,\"\")","v":""},null,null,null,4,"NIETO","D",5,null,"Carte Verte",null,"Carte Jaune",null,"Carte Rose",null,"Carte      Bleue",null,"Carte      Orange",null,"Joueurs(es) valides (5pts)",null,null,"Non Sélectionnables en EDF (hors FIDET)"]
[null,null,null,null,null,"","",null,null,null,null,null,null,6]
[null,null,null,null,null,"","",null,null,null,null,null,null,7,null,"+  1,5",null,"+  2,5",null,"+  1,5",null,"+  0,5",null,"+  0,5",null,"2 sur la feuille ",null,null,"5 sur la feuille"]
[null,null,null,null,null,"","",null,null,null,2,"BANNES","P",8,null,null,null,null,null,null,null,null,null,null,null,"2 sur le terrain ",null,null,"4 sur le terrain "]
[null,null,null,null,null,"","",null,null,null,1.5,"BERNARD","C",9,null,"Pour le calcul des points"]
[null,null,null,null,null,"","",null,null,null,null,null,null,10,null,"Inscrire dans la colonne de gauche le \"Statut\" des joueurs ou joueuses "]
[null,null,null,null,null,"","",null,null,"ET",3.5,"BERREGRAGUE","S",11,null,"J",null,null,null,"Jeune joueur débutant (Bonus1,5pt)"]
[null,null,null,null,null,"","",null,null,null,1,"ZORDAN","P",13,null,"JF",null,null,null,"Jeune joueuse débutante (Bonus 2,5pt)"]
[null,null,null,null,null,"","",null,null,null,4,"MEYNARD","R",16,null,"F ou FET",null,null,null,"Femme française ou étrangère < 5pts (Bonus 1,5pt)"]
[null,null,null,null,null,"","","",null,null,1,"TEIXERA","J",18,null,"FV",null,null,null,"Femme française ou étrangère = 5pts (Bonus de 0,5pt)"]
[null,null,null,null,null,"","","",null,null,4.5,"SIMEON","E",20,null,"Autres possibilités sans Bonus"]
[null,null,null,null,null,"","","",null,null,4,"LAFOND","DC",27,null,"FID",null,"Pour un joueur à un groupement sportif"]
[null,null,null,null,null,"","",null,null,null,null,null,null,30,null,"ET",null,"Pour un joueur étranger "]
[null,null,null,null,null,"","","",null,"J",1.5,"VAYSSET","JN",31,null,"VAL",null,"Masculin français (=5 pts) sans bonus"]
[null,null,null,null,null,"","",null,null,"J",1,"LEUR","A",77,null,"R",null,"Tous joueurs révisables en classification (sauf valide)"]
[null,null,null,null,null,"","",null,null,null,null,null,null,null,null,null,null,"Pour tous joueurs sans symbole sur la carte de classification"]
[null,null,null,null,null,"","",null,null,null,null,null,null,null,null,"Spécificités Nat 2 et 3 (plus de 55 ans)"]
[null,null,null,null,null,"","",null,null,null,3.5,"BENTRAT","R",null,null,"S",null,null,null,"Français < 5pts (Bonus de 0,5pt)"]
[null,null,null,null,null,null,null,null,null,null,null,null,null,null,null,"SFID",null,null,null,"Joueurs (FIDET) ou étanger < 5pts (Bonus de 0,5pt)"]
[{"$f":"IF(F32<1,\"\",\"Joueurs ou joueuses étrangers\")","v":""},null,null,null,null,null,null,null,null,null,null,null,null,null,null,"SET"]
[{"$f":"IF(F32=0,\"\",IF(F32>5,\"Trop de joueurs étangers-max 5)\",\"OK\"))","v":""},null,null,null,null,null,null,null,null,null,null,null,null,null,null,"SF",null,null,null,"Femme française  < 5pts (Bonus de 2pts): 1,5pts+0,5pt"]
[null,null,null,null,null,null,null,null,null,null,null,null,null,null,null,"SFET",null,null,null,"Femme étrangère  < 5pts (Bonus de 2pts): 1,5pts+0,5pt"]
[{"$f":"IF(G32<1,\"\",\"Joueurs ou joueuses valides de l'équipe\")","v":""},null,null,null,null,null,null,null,null,null,null,null,null,null,null,"JS",null,null,null,"Jeune français <5pts (Bonus 2pts)"]
[{"$f":"IF(G32=0,\"\",IF(G32>2,\"Trop de valides inscrit sur la feuille-max 1)\",\"OK\"))","v":""},null,null,null,null,null,null,null,null,null,null,null,null,null,null,"JFS",null,null,null,"Jeune française <5pts (Bonus 3pts)"]
[null,null,null,null,null,{"$f":"SUM(F6:F29)","v":0},{"$f":"SUM(G6:G31)","v":0}]

{"sheet":"ENT CAUSSADE PAVIE 2","index":75,"n_rows":32,"n_cols":29,"rows_kept":32,"cut":false,"hidden":false,"merged":[[14,15,14,16],[9,23,10,24],[11,15,11,31],[12,15,12,31],[19,15,19,16],[16,15,16,16],[17,15,17,31],[5,15,6,31],[7,28,8,31],[9,25,9,27],[9,28,9,31],[10,25,10,27],[10,28,10,31],[1,0,2,0],[1,1,2,3],[1,9,1,13],[1,15,4,18],[1,19,1,24],[2,9,2,13],[2,19,3,24],[0,15,0,31],[1,25,1,31],[2,25,3,31],[18,15,18,16],[7,15,8,16],[7,17,8,18],[7,19,8,20],[7,21,8,22],[7,23,8,24],[7,25,8,27],[15,15,15,16],[9,15,10,16],[9,17,10,18],[9,19,10,20],[9,21,10,22],[13,15,13,16],[21,15,21,16],[23,15,23,31],[25,19,26,31],[20,15,20,16],[30,0,30,4],[30,15,30,16],[24,15,24,16],[28,15,28,16],[29,0,29,4],[29,15,29,16],[25,15,25,16],[26,0,26,4],[26,15,26,16],[27,0,27,4],[27,15,27,16]]}
["ENT CAUSSADE PAVIE 2",null,null,null,null,null,null,null,null,null,null,null,null,null,null,"Saison 2024-2025                                                                      Points en jeu"]
[null,"Joueur(es) participant à la rencontre",null,null,null,null,null,null,null,"Saisir votre liste complète en MAJUSCULES ",null,null,null,null,null,"Nationale 3",null,null,null,"Sans carte spécifique",null,null,null,null,null,"Si cartes de couleurs"]
[null,null,null,null,null,null,null,null,null,"Joueurs(es) qualifié(es) saison 2024 -2025",null,null,null,null,null,null,null,null,null,"15,5 pts",null,null,null,null,null,"maxi 19 pts"]
[]
["Statuts","Classif.","          Noms      /    Prénoms",null,"Numéros","ET","VALIDE",null,null,"Statuts","Classif.","          Noms      /    Prénoms",null,"Numéros",null,null,null,null,null,"Si >16pts au début du match (+10 pts adversaire)"]
[null,null,null,null,null,{"$f":"IF(A6=\"ET\",1,\"\")","v":""},{"$f":"IF(B6=5,1,\"\")","v":""},null,null,null,null,null,null,4,null,"Avec une date de validité"]
[null,null,null,null,null,{"$f":"IF(A7=\"ET\",1,\"\")","v":""},{"$f":"IF(B7=5,1,\"\")","v":""},null,null,"J",5,"BENYAHYA","M",5]
[null,null,null,null,null,{"$f":"IF(A8=\"ET\",1,\"\")","v":""},{"$f":"IF(B8=5,1,\"\")","v":""},null,null,null,1.5,"BONNET","J",6,null,"Carte Verte",null,"Carte Jaune",null,"Carte Rose",null,"Carte      Bleue",null,"Carte      Orange",null,"Joueurs(es) valides (5pts)",null,null,"Non Sélectionnables en EDF (hors FIDET)"]
[null,null,null,null,null,"","",null,null,null,2,"BERDIE","J",7]
[null,null,null,null,null,"","",null,null,null,4.5,"DAGNAN","A",8,null,"+  1,5",null,"+  2,5",null,"+  1,5",null,"+  0,5",null,"+  0,5",null,"2 sur la feuille ",null,null,"5 sur la feuille"]
[null,null,null,null,null,"","",null,null,null,2.5,"AURENSAN","F",9,null,null,null,null,null,null,null,null,null,null,null,"2 sur le terrain ",null,null,"4 sur le terrain "]
[null,null,null,null,null,"","",null,null,null,1,"NADALIN","N",10,null,"Pour le calcul des points"]
[null,null,null,null,null,"","",null,null,"J",2,"CHEDEVILLE","E",11,null,"Inscrire dans la colonne de gauche le \"Statut\" des joueurs ou joueuses "]
[null,null,null,null,null,"","",null,null,null,2,"DOUY","J",12,null,"J",null,null,null,"Jeune joueur débutant (Bonus1,5pt)"]
[null,null,null,null,null,"","",null,null,null,null,null,null,13,null,"JF",null,null,null,"Jeune joueuse débutante (Bonus 2,5pt)"]
[null,null,null,null,null,"","",null,null,null,4.5,"DELUC","P",14,null,"F ou FET",null,null,null,"Femme française ou étrangère < 5pts (Bonus 1,5pt)"]
[null,null,null,null,null,"","","",null,null,null,null,null,15,null,"FV",null,null,null,"Femme française ou étrangère = 5pts (Bonus de 0,5pt)"]
[null,null,null,null,null,"","","",null,null,null,null,null,16,null,"Autres possibilités sans Bonus"]
[null,null,null,null,null,"","","",null,null,null,null,null,99,null,"FID",null,"Pour un joueur à un groupement sportif"]
[null,null,null,null,null,"","",null,null,null,null,null,null,18,null,"ET",null,"Pour un joueur étranger "]
[null,null,null,null,null,"","","",null,null,null,null,null,20,null,"VAL",null,"Masculin français (=5 pts) sans bonus"]
[null,null,null,null,null,"","",null,null,null,null,null,null,21,null,"R",null,"Tous joueurs révisables en classification (sauf valide)"]
[null,null,null,null,null,"","",null,null,null,null,null,null,22,null,null,null,"Pour tous joueurs sans symbole sur la carte de classification"]
[null,null,null,null,null,"","",null,null,null,null,null,null,null,null,"Spécificités Nat 2 et 3 (plus de 55 ans)"]
[null,null,null,null,null,"","",null,null,null,null,null,null,null,null,"S",null,null,null,"Français < 5pts (Bonus de 0,5pt)"]
[null,null,null,null,null,null,null,null,null,null,null,null,null,null,null,"SFID",null,null,null,"Joueurs (FIDET) ou étanger < 5pts (Bonus de 0,5pt)"]
[{"$f":"IF(F32<1,\"\",\"Joueurs ou joueuses étrangers\")","v":""},null,null,null,null,null,null,null,null,null,null,null,null,null,null,"SET"]
[{"$f":"IF(F32=0,\"\",IF(F32>5,\"Trop de joueurs étangers-max 5)\",\"OK\"))","v":""},null,null,null,null,null,null,null,null,null,null,null,null,null,null,"SF",null,null,null,"Femme française  < 5pts (Bonus de 2pts): 1,5pts+0,5pt"]
[null,null,null,null,null,null,null,null,null,null,null,null,null,null,null,"SFET",null,null,null,"Femme étrangère  < 5pts (Bonus de 2pts): 1,5pts+0,5pt"]
[{"$f":"IF(G32<1,\"\",\"Joueurs ou joueuses valides de l'équipe\")","v":""},null,null,null,null,null,null,null,null,null,null,null,null,null,null,"JS",null,null,null,"Jeune français <5pts (Bonus 2pts)"]
[{"$f":"IF(G32=0,\"\",IF(G32>2,\"Trop de valides inscrit sur la feuille-max 1)\",\"OK\"))","v":""},null,null,null,null,null,null,null,null,null,null,null,null,null,null,"JFS",null,null,null,"Jeune française <5pts (Bonus 3pts)"]
[null,null,null,null,null,{"$f":"SUM(F6:F29)","v":0},{"$f":"SUM(G6:G31)","v":0}]

{"sheet":"LA ROCHELLE","index":76,"n_rows":32,"n_cols":29,"rows_kept":32,"cut":false,"hidden":false,"merged":[[14,15,14,16],[9,23,10,24],[11,15,11,31],[12,15,12,31],[19,15,19,16],[16,15,16,16],[17,15,17,31],[5,15,6,31],[7,28,8,31],[9,25,9,27],[9,28,9,31],[10,25,10,27],[10,28,10,31],[1,0,2,0],[1,1,2,3],[1,9,1,13],[1,15,4,18],[1,19,1,24],[2,9,2,13],[2,19,3,24],[0,15,0,31],[1,25,1,31],[2,25,3,31],[18,15,18,16],[7,15,8,16],[7,17,8,18],[7,19,8,20],[7,21,8,22],[7,23,8,24],[7,25,8,27],[15,15,15,16],[9,15,10,16],[9,17,10,18],[9,19,10,20],[9,21,10,22],[13,15,13,16],[21,15,21,16],[23,15,23,31],[25,19,26,31],[20,15,20,16],[30,0,30,4],[30,15,30,16],[24,15,24,16],[28,15,28,16],[29,0,29,4],[29,15,29,16],[25,15,25,16],[26,0,26,4],[26,15,26,16],[27,0,27,4],[27,15,27,16]]}
["AS STADE ROCHELLAIS RUPELLA",null,null,null,null,null,null,null,null,null,null,null,null,null,null,"Saison 2024-2025                                                                      Points en jeu"]
[null,"Joueur(es) participant à la rencontre",null,null,null,null,null,null,null,"Saisir votre liste complète en MAJUSCULES ",null,null,null,null,null,"Nationale 3",null,null,null,"Sans carte spécifique",null,null,null,null,null,"Si cartes de couleurs"]
[null,null,null,null,null,null,null,null,null,"Joueurs(es) qualifié(es) saison 2024 -2025",null,null,null,null,null,null,null,null,null,"15,5 pts",null,null,null,null,null,"maxi 19 pts"]
[]
["Statuts","Classif.","          Noms      /    Prénoms",null,"Numéros","ET","VALIDE",null,null,"Statuts","Classif.","          Noms      /    Prénoms",null,"Numéros",null,null,null,null,null,"Si >16pts au début du match (+10 pts adversaire)"]
[null,null,null,null,null,{"$f":"IF(A6=\"ET\",1,\"\")","v":""},{"$f":"IF(B6=5,1,\"\")","v":""},null,null,null,2.5,"PETROWISTE","J",1,null,"Avec une date de validité"]
[null,null,null,null,null,{"$f":"IF(A7=\"ET\",1,\"\")","v":""},{"$f":"IF(B7=5,1,\"\")","v":""},null,null,null,3,"PLANCHOT","D",5]
[null,null,null,null,null,{"$f":"IF(A8=\"ET\",1,\"\")","v":""},{"$f":"IF(B8=5,1,\"\")","v":""},null,null,null,null,null,null,6,null,"Carte Verte",null,"Carte Jaune",null,"Carte Rose",null,"Carte      Bleue",null,"Carte      Orange",null,"Joueurs(es) valides (5pts)",null,null,"Non Sélectionnables en EDF (hors FIDET)"]
[null,null,null,null,null,"","",null,null,null,1,"RONOARD","JP",7]
[null,null,null,null,null,"","",null,null,"F",4.5,"DAIGRE","A",8,null,"+  1,5",null,"+  2,5",null,"+  1,5",null,"+  0,5",null,"+  0,5",null,"2 sur la feuille ",null,null,"5 sur la feuille"]
[null,null,null,null,null,"","",null,null,"F",2,"REVAUD","HB",9,null,null,null,null,null,null,null,null,null,null,null,"2 sur le terrain ",null,null,"4 sur le terrain "]
[null,null,null,null,null,"","",null,null,null,4,"SEINE","M",10,null,"Pour le calcul des points"]
[null,null,null,null,null,"","",null,null,null,null,null,null,11,null,"Inscrire dans la colonne de gauche le \"Statut\" des joueurs ou joueuses "]
[null,null,null,null,null,"","",null,null,null,5,"TAVEAU","M",12,null,"J",null,null,null,"Jeune joueur débutant (Bonus1,5pt)"]
[null,null,null,null,null,"","",null,null,null,2,"BARATON","T",13,null,"JF",null,null,null,"Jeune joueuse débutante (Bonus 2,5pt)"]
[null,null,null,null,null,"","",null,null,null,5,"FASSOT","L",14,null,"F ou FET",null,null,null,"Femme française ou étrangère < 5pts (Bonus 1,5pt)"]
[null,null,null,null,null,"","","",null,"J",1,"PAPIN","M",15,null,"FV",null,null,null,"Femme française ou étrangère = 5pts (Bonus de 0,5pt)"]
[null,null,null,null,null,"","","",null,"J",4,"LOULIER","M",21,null,"Autres possibilités sans Bonus"]
[null,null,null,null,null,"","","",null,null,null,null,null,null,null,"FID",null,"Pour un joueur à un groupement sportif"]
[null,null,null,null,null,"","",null,null,null,null,null,null,null,null,"ET",null,"Pour un joueur étranger "]
[null,null,null,null,null,"","","",null,null,null,null,null,null,null,"VAL",null,"Masculin français (=5 pts) sans bonus"]
[null,null,null,null,null,"","",null,null,null,null,null,null,null,null,"R",null,"Tous joueurs révisables en classification (sauf valide)"]
[null,null,null,null,null,"","",null,null,null,null,null,null,null,null,null,null,"Pour tous joueurs sans symbole sur la carte de classification"]
[null,null,null,null,null,"","",null,null,null,null,null,null,null,null,"Spécificités Nat 2 et 3 (plus de 55 ans)"]
[null,null,null,null,null,"","",null,null,null,null,null,null,null,null,"S",null,null,null,"Français < 5pts (Bonus de 0,5pt)"]
[null,null,null,null,null,null,null,null,null,null,null,null,null,null,null,"SFID",null,null,null,"Joueurs (FIDET) ou étanger < 5pts (Bonus de 0,5pt)"]
[{"$f":"IF(F32<1,\"\",\"Joueurs ou joueuses étrangers\")","v":""},null,null,null,null,null,null,null,null,null,null,null,null,null,null,"SET"]
[{"$f":"IF(F32=0,\"\",IF(F32>5,\"Trop de joueurs étangers-max 5)\",\"OK\"))","v":""},null,null,null,null,null,null,null,null,null,null,null,null,null,null,"SF",null,null,null,"Femme française  < 5pts (Bonus de 2pts): 1,5pts+0,5pt"]
[null,null,null,null,null,null,null,null,null,null,null,null,null,null,null,"SFET",null,null,null,"Femme étrangère  < 5pts (Bonus de 2pts): 1,5pts+0,5pt"]
[{"$f":"IF(G32<1,\"\",\"Joueurs ou joueuses valides de l'équipe\")","v":""},null,null,null,null,null,null,null,null,null,null,null,null,null,null,"JS",null,null,null,"Jeune français <5pts (Bonus 2pts)"]
[{"$f":"IF(G32=0,\"\",IF(G32>2,\"Trop de valides inscrit sur la feuille-max 1)\",\"OK\"))","v":""},null,null,null,null,null,null,null,null,null,null,null,null,null,null,"JFS",null,null,null,"Jeune française <5pts (Bonus 3pts)"]
[null,null,null,null,null,{"$f":"SUM(F6:F29)","v":0},{"$f":"SUM(G6:G31)","v":0}]

{"sheet":"MONTPELLIER","index":77,"n_rows":32,"n_cols":29,"rows_kept":32,"cut":false,"hidden":false,"merged":[[14,15,14,16],[9,23,10,24],[11,15,11,31],[12,15,12,31],[19,15,19,16],[16,15,16,16],[17,15,17,31],[5,15,6,31],[7,28,8,31],[9,25,9,27],[9,28,9,31],[10,25,10,27],[10,28,10,31],[1,0,2,0],[1,1,2,3],[1,9,1,13],[1,15,4,18],[1,19,1,24],[2,9,2,13],[2,19,3,24],[0,15,0,31],[1,25,1,31],[2,25,3,31],[18,15,18,16],[7,15,8,16],[7,17,8,18],[7,19,8,20],[7,21,8,22],[7,23,8,24],[7,25,8,27],[15,15,15,16],[9,15,10,16],[9,17,10,18],[9,19,10,20],[9,21,10,22],[13,15,13,16],[21,15,21,16],[23,15,23,31],[25,19,26,31],[20,15,20,16],[30,0,30,4],[30,15,30,16],[24,15,24,16],[28,15,28,16],[29,0,29,4],[29,15,29,16],[25,15,25,16],[26,0,26,4],[26,15,26,16],[27,0,27,4],[27,15,27,16]]}
["HBA  MONTPELLIER",null,null,null,null,null,null,null,null,null,null,null,null,null,null,"Saison 2024-2025                                                                      Points en jeu"]
[null,"Joueur(es) participant à la rencontre",null,null,null,null,null,null,null,"Saisir votre liste complète en MAJUSCULES ",null,null,null,null,null,"Nationale 3",null,null,null,"Sans carte spécifique",null,null,null,null,null,"Si cartes de couleurs"]
[null,null,null,null,null,null,null,null,null,"Joueurs(es) qualifié(es) saison 2024 -2025",null,null,null,null,null,null,null,null,null,"15,5 pts",null,null,null,null,null,"maxi 19 pts"]
[]
["Statuts","Classif.","          Noms      /    Prénoms",null,"Numéros","ET","VALIDE",null,null,"Statuts","Classif.","          Noms      /    Prénoms",null,"Numéros",null,null,null,null,null,"Si >16pts au début du match (+10 pts adversaire)"]
[null,null,null,null,null,{"$f":"IF(A6=\"ET\",1,\"\")","v":""},{"$f":"IF(B6=5,1,\"\")","v":""},null,null,null,null,null,null,5,null,"Avec une date de validité"]
[null,null,null,null,null,{"$f":"IF(A7=\"ET\",1,\"\")","v":""},{"$f":"IF(B7=5,1,\"\")","v":""},null,null,null,null,null,null,6]
[null,null,null,null,null,{"$f":"IF(A8=\"ET\",1,\"\")","v":""},{"$f":"IF(B8=5,1,\"\")","v":""},null,null,null,3,"DUSCH","A",7,null,"Carte Verte",null,"Carte Jaune",null,"Carte Rose",null,"Carte      Bleue",null,"Carte      Orange",null,"Joueurs(es) valides (5pts)",null,null,"Non Sélectionnables en EDF (hors FIDET)"]
[null,null,null,null,null,"","",null,null,"ET",1.5,"TAKNIASHVILI","G",8]
[null,null,null,null,null,"","",null,null,null,null,null,null,9,null,"+  1,5",null,"+  2,5",null,"+  1,5",null,"+  0,5",null,"+  0,5",null,"2 sur la feuille ",null,null,"5 sur la feuille"]
[null,null,null,null,null,"","",null,null,null,null,null,null,10,null,null,null,null,null,null,null,null,null,null,null,"2 sur le terrain ",null,null,"4 sur le terrain "]
[null,null,null,null,null,"","",null,null,null,null,null,null,11,null,"Pour le calcul des points"]
[null,null,null,null,null,"","",null,null,null,null,null,null,12,null,"Inscrire dans la colonne de gauche le \"Statut\" des joueurs ou joueuses "]
[null,null,null,null,null,"","",null,null,null,null,null,null,15,null,"J",null,null,null,"Jeune joueur débutant (Bonus1,5pt)"]
[null,null,null,null,null,"","",null,null,null,null,null,null,16,null,"JF",null,null,null,"Jeune joueuse débutante (Bonus 2,5pt)"]
[null,null,null,null,null,"","",null,null,null,2.5,"DECROIX","M",17,null,"F ou FET",null,null,null,"Femme française ou étangère < 5pts (Bonus 1,5pt)"]
[null,null,null,null,null,"","","",null,null,null,null,null,18,null,"FV",null,null,null,"Femme française ou étrangère = 5pts (Bonus de 0,5pt)"]
[null,null,null,null,null,"","","",null,null,null,null,null,19,null,"Autres possibilités sans Bonus"]
[null,null,null,null,null,"","","",null,"S",4,"BACOUL","JC",24,null,"FID",null,"Pour un joueur à un groupement sportif"]
[null,null,null,null,null,"","",null,null,null,4.5,"SIERRA","D",28,null,"ET",null,"Pour un joueur étranger "]
[null,null,null,null,null,"","","",null,null,5,"ROBERGEAU","D",31,null,"VAL",null,"Masculin français (=5 pts) sans bonus"]
[null,null,null,null,null,"","",null,null,null,2,"GUIHEUX",null,77,null,"R",null,"Tous joueurs révisables en classification (sauf valide)"]
[null,null,null,null,null,"","",null,null,null,null,null,null,null,null,null,null,"Pour tous joueurs sans symbole sur la carte de classification"]
[null,null,null,null,null,"","",null,null,null,null,null,null,null,null,"Spécificités Nat 2 et 3 (plus de 55 ans)"]
[null,null,null,null,null,"","",null,null,null,null,null,null,null,null,"S",null,null,null,"Français < 5pts (Bonus de 0,5pt)"]
[null,null,null,null,null,null,null,null,null,null,null,null,null,null,null,"SFID",null,null,null,"Joueurs (FIDET) ou étanger < 5pts (Bonus de 0,5pt)"]
[{"$f":"IF(F32<1,\"\",\"Joueurs ou joueuses étrangers\")","v":""},null,null,null,null,null,null,null,null,null,null,null,null,null,null,"SET"]
[{"$f":"IF(F32=0,\"\",IF(F32>5,\"Trop de joueurs étangers-max 5)\",\"OK\"))","v":""},null,null,null,null,null,null,null,null,null,null,null,null,null,null,"SF",null,null,null,"Femme française  < 5pts (Bonus de 2pts): 1,5pts+0,5pt"]
[null,null,null,null,null,null,null,null,null,null,null,null,null,null,null,"SFET",null,null,null,"Femme étrangère  < 5pts (Bonus de 2pts): 1,5pts+0,5pt"]
[{"$f":"IF(G32<1,\"\",\"Joueurs ou joueuses valides de l'équipe\")","v":""},null,null,null,null,null,null,null,null,null,null,null,null,null,null,"JS",null,null,null,"Jeune français <5pts (Bonus 2pts)"]
[{"$f":"IF(G32=0,\"\",IF(G32>2,\"Trop de valides inscrit sur la feuille-max 1)\",\"OK\"))","v":""},null,null,null,null,null,null,null,null,null,null,null,null,null,null,"JFS",null,null,null,"Jeune française <5pts (Bonus 3pts)"]
[null,null,null,null,null,{"$f":"SUM(F6:F29)","v":0},{"$f":"SUM(G6:G31)","v":0}]

{"sheet":"TOULOUSE 2","index":78,"n_rows":32,"n_cols":29,"rows_kept":32,"cut":false,"hidden":false,"merged":[[14,15,14,16],[9,23,10,24],[11,15,11,31],[12,15,12,31],[19,15,19,16],[16,15,16,16],[17,15,17,31],[5,15,6,31],[7,28,8,31],[9,25,9,27],[9,28,9,31],[10,25,10,27],[10,28,10,31],[1,0,2,0],[1,1,2,3],[1,9,1,13],[1,15,4,18],[1,19,1,24],[2,9,2,13],[2,19,3,24],[0,15,0,31],[1,25,1,31],[2,25,3,31],[18,15,18,16],[7,15,8,16],[7,17,8,18],[7,19,8,20],[7,21,8,22],[7,23,8,24],[7,25,8,27],[15,15,15,16],[9,15,10,16],[9,17,10,18],[9,19,10,20],[9,21,10,22],[13,15,13,16],[21,15,21,16],[23,15,23,31],[25,19,26,31],[20,15,20,16],[30,0,30,4],[30,15,30,16],[24,15,24,16],[28,15,28,16],[29,0,29,4],[29,15,29,16],[25,15,25,16],[26,0,26,4],[26,15,26,16],[27,0,27,4],[27,15,27,16]]}
["TIC TOULOUSE 2",null,null,null,null,null,null,null,null,null,null,null,null,null,null,"Saison 2024-2025                                                                      Points en jeu"]
[null,"Joueur(es) participant à la rencontre",null,null,null,null,null,null,null,"Saisir votre liste complète en MAJUSCULES ",null,null,null,null,null,"Nationale 3",null,null,null,"Sans carte spécifique",null,null,null,null,null,"Si cartes de couleurs"]
[null,null,null,null,null,null,null,null,null,"Joueurs(es) qualifié(es) saison 2024 -2025",null,null,null,null,null,null,null,null,null,"15,5 pts",null,null,null,null,null,"maxi 19 pts"]
[]
["Statuts","Classif.","          Noms      /    Prénoms",null,"Numéros","ET","VALIDE",null,null,"Statuts","Classif.","          Noms      /    Prénoms",null,"Numéros",null,null,null,null,null,"Si >16pts au début du match (+10 pts adversaire)"]
[null,null,null,null,null,{"$f":"IF(A6=\"ET\",1,\"\")","v":""},{"$f":"IF(B6=5,1,\"\")","v":""},null,null,null,2,"LOISEAU","F",4,null,"Avec une date de validité"]
[null,null,null,null,null,{"$f":"IF(A7=\"ET\",1,\"\")","v":""},{"$f":"IF(B7=5,1,\"\")","v":""},null,null,"F",2.5,"MENARD","E",5]
[null,null,null,null,null,{"$f":"IF(A8=\"ET\",1,\"\")","v":""},{"$f":"IF(B8=5,1,\"\")","v":""},null,null,"J",2.5,"PORTES","L",6,null,"Carte Verte",null,"Carte Jaune",null,"Carte Rose",null,"Carte      Bleue",null,"Carte      Orange",null,"Joueurs(es) valides (5pts)",null,null,"Non Sélectionnables en EDF (hors FIDET)"]
[null,null,null,null,null,"","",null,null,"J",4.5,"FAURES","J",7]
[null,null,null,null,null,"","",null,null,null,2,"COURTEIL","J",8,null,"+  1,5",null,"+  2,5",null,"+  1,5",null,"+  0,5",null,"+  0,5",null,"2 sur la feuille ",null,null,"5 sur la feuille"]
[null,null,null,null,null,"","",null,null,null,1,"LE ROUX","G",9,null,null,null,null,null,null,null,null,null,null,null,"2 sur le terrain ",null,null,"4 sur le terrain "]
[null,null,null,null,null,"","",null,null,null,3,"GALY","N",10,null,"Pour le calcul des points"]
[null,null,null,null,null,"","",null,null,null,2,"BENGOUA","A",11,null,"Inscrire dans la colonne de gauche le \"Statut\" des joueurs ou joueuses "]
[null,null,null,null,null,"","",null,null,null,5,"VARELIETTE","B",12,null,"J",null,null,null,"Jeune joueur débutant (Bonus1,5pt)"]
[null,null,null,null,null,"","",null,null,null,null,null,null,13,null,"JF",null,null,null,"Jeune joueuse débutante (Bonus 2,5pt)"]
[null,null,null,null,null,"","",null,null,null,1,"AGUINET","D",14,null,"F ou FET",null,null,null,"Pour une femme Française ou étrangère <5pts (Bonus 1,5pt)"]
[null,null,null,null,null,"","","",null,null,null,null,null,15,null,"FV",null,null,null,"Femme française ou étrangère = 5pts (Bonus de 0,5pt)"]
[null,null,null,null,null,"","","",null,null,1,"GIL","J",19,null,"Autres possibilités sans Bonus"]
[null,null,null,null,null,"","","",null,null,null,null,null,20,null,"FID",null,"Pour un joueur à un groupement sportif"]
[null,null,null,null,null,"","",null,null,"F",5,"LOZE","A",30,null,"ET",null,"Pour un joueur étranger "]
[null,null,null,null,null,"","","",null,null,null,null,null,null,null,"VAL",null,"Masculin français (=5 pts) sans bonus"]
[null,null,null,null,null,"","",null,null,null,null,null,null,null,null,"R",null,"Tous joueurs révisables en classification (sauf valide)"]
[null,null,null,null,null,"","",null,null,null,null,null,null,null,null,null,null,"Pour tous joueurs sans symbole sur la carte de classification"]
[null,null,null,null,null,"","",null,null,null,null,null,null,null,null,"Spécificités Nat 2 et 3 (plus de 55 ans)"]
[null,null,null,null,null,"","",null,null,null,null,null,null,null,null,"S",null,null,null,"Français < 5pts (Bonus de 0,5pt)"]
[null,null,null,null,null,null,null,null,null,null,null,null,null,null,null,"SFID",null,null,null,"Joueurs (FIDET) ou étanger < 5pts (Bonus de 0,5pt)"]
[{"$f":"IF(F32<1,\"\",\"Joueurs ou joueuses étrangers\")","v":""},null,null,null,null,null,null,null,null,null,null,null,null,null,null,"SET"]
[{"$f":"IF(F32=0,\"\",IF(F32>5,\"Trop de joueurs étangers-max 5)\",\"OK\"))","v":""},null,null,null,null,null,null,null,null,null,null,null,null,null,null,"SF",null,null,null,"Femme française  < 5pts (Bonus de 2pts): 1,5pts+0,5pt"]
[null,null,null,null,null,null,null,null,null,null,null,null,null,null,null,"SFET",null,null,null,"Femme étrangère  < 5pts (Bonus de 2pts): 1,5pts+0,5pt"]
[{"$f":"IF(G32<1,\"\",\"Joueurs ou joueuses valides de l'équipe\")","v":""},null,null,null,null,null,null,null,null,null,null,null,null,null,null,"JS",null,null,null,"Jeune français <5pts (Bonus 2pts)"]
[{"$f":"IF(G32=0,\"\",IF(G32>2,\"Trop de valides inscrit sur la feuille-max 1)\",\"OK\"))","v":""},null,null,null,null,null,null,null,null,null,null,null,null,null,null,"JFS",null,null,null,"Jeune française <5pts (Bonus 3pts)"]
[null,null,null,null,null,{"$f":"SUM(F6:F29)","v":0},{"$f":"SUM(G6:G31)","v":0}]

{"sheet":"LE CANNET 2","index":79,"n_rows":32,"n_cols":29,"rows_kept":32,"cut":false,"hidden":false,"merged":[[14,15,14,16],[9,23,10,24],[11,15,11,31],[12,15,12,31],[19,15,19,16],[16,15,16,16],[17,15,17,31],[5,15,6,31],[7,28,8,31],[9,25,9,27],[9,28,9,31],[10,25,10,27],[10,28,10,31],[1,0,2,0],[1,1,2,3],[1,9,1,13],[1,15,4,18],[1,19,1,24],[2,9,2,13],[2,19,3,24],[0,15,0,31],[1,25,1,31],[2,25,3,31],[18,15,18,16],[7,15,8,16],[7,17,8,18],[7,19,8,20],[7,21,8,22],[7,23,8,24],[7,25,8,27],[15,15,15,16],[9,15,10,16],[9,17,10,18],[9,19,10,20],[9,21,10,22],[13,15,13,16],[21,15,21,16],[23,15,23,31],[25,19,26,31],[20,15,20,16],[30,0,30,4],[30,15,30,16],[24,15,24,16],[28,15,28,16],[29,0,29,4],[29,15,29,16],[25,15,25,16],[26,0,26,4],[26,15,26,16],[27,0,27,4],[27,15,27,16]]}
["HORNETS LE CANNET 2",null,null,null,null,null,null,null,null,null,null,null,null,null,null,"Saison 2024-2025                                                                      Points en jeu"]
[null,"Joueur(es) participant à la rencontre",null,null,null,null,null,null,null,"Saisir votre liste complète en MAJUSCULES ",null,null,null,null,null,"Nationale 3",null,null,null,"Sans carte spécifique",null,null,null,null,null,"Si cartes de couleurs"]
[null,null,null,null,null,null,null,null,null,"Joueurs(es) qualifié(es) saison 2024 -2025",null,null,null,null,null,null,null,null,null,"15,5 pts",null,null,null,null,null,"maxi 19 pts"]
[]
["Statuts","Classif.","          Noms      /    Prénoms",null,"Numéros","ET","VALIDE",null,null,"Statuts","Classif.","          Noms      /    Prénoms",null,"Numéros",null,null,null,null,null,"Si >16pts au début du match (+10 pts adversaire)"]
[null,null,null,null,null,{"$f":"IF(A6=\"ET\",1,\"\")","v":""},{"$f":"IF(B6=5,1,\"\")","v":""},null,null,null,null,null,null,4,null,"Avec une date de validité"]
[null,null,null,null,null,{"$f":"IF(A7=\"ET\",1,\"\")","v":""},{"$f":"IF(B7=5,1,\"\")","v":""},null,null,null,1.5,"MARLIER","A",5]
[null,null,null,null,null,{"$f":"IF(A8=\"ET\",1,\"\")","v":""},{"$f":"IF(B8=5,1,\"\")","v":""},null,null,null,null,null,null,6,null,"Carte Verte",null,"Carte Jaune",null,"Carte Rose",null,"Carte      Bleue",null,"Carte      Orange",null,"Joueurs(es) valides (5pts)",null,null,"Non Sélectionnables en EDF (hors FIDET)"]
[null,null,null,null,null,"","",null,null,null,5,"RODIER","D",7]
[null,null,null,null,null,"","",null,null,"ET",4,"AISSOU","R",8,null,"+  1,5",null,"+  2,5",null,"+  1,5",null,"+  0,5",null,"+  0,5",null,"2 sur la feuille ",null,null,"5 sur la feuille"]
[null,null,null,null,null,"","",null,null,null,1,"HAEFFNER","L",9,null,null,null,null,null,null,null,null,null,null,null,"2 sur le terrain ",null,null,"4 sur le terrain "]
[null,null,null,null,null,"","",null,null,null,2.5,"MEKHAZNI","K",10,null,"Pour le calcul des points"]
[null,null,null,null,null,"","",null,null,null,null,null,null,11,null,"Inscrire dans la colonne de gauche le \"Statut\" des joueurs ou joueuses "]
[null,null,null,null,null,"","",null,null,null,1,"MEHIDI","K",12,null,"J",null,null,null,"Jeune joueur débutant (Bonus1,5pt)"]
[null,null,null,null,null,"","",null,null,null,5,"PAQUET","D",13,null,"JF",null,null,null,"Jeune joueuse débutante (Bonus 2,5pt)"]
[null,null,null,null,null,"","",null,null,null,1,"DELATTRE","T",14,null,"F ou FET",null,null,null,"Femme française ou étrangère < 5pts (Bonus 1,5pt)"]
[null,null,null,null,null,"","","",null,"J",4.5,"RODIER","B",15,null,"FV",null,null,null,"Femme française ou étangère  = 5pts (Bonus de 0,5pt)"]
[null,null,null,null,null,"","","",null,null,null,null,null,16,null,"Autres possibilités sans Bonus"]
[null,null,null,null,null,"","","",null,null,null,null,null,99,null,"FID",null,"Pour un joueur à un groupement sportif"]
[null,null,null,null,null,"","",null,null,null,null,null,null,18,null,"ET",null,"Pour un joueur étranger "]
[null,null,null,null,null,"","","",null,null,null,null,null,20,null,"VAL",null,"Masculin français (=5 pts) sans bonus"]
[null,null,null,null,null,"","",null,null,null,null,null,null,21,null,"R",null,"Tous joueurs révisables en classification (sauf valide)"]
[null,null,null,null,null,"","",null,null,null,null,null,null,22,null,null,null,"Pour tous joueurs sans symbole sur la carte de classification"]
[null,null,null,null,null,"","",null,null,null,null,null,null,null,null,"Spécificités Nat 2 et 3 (plus de 55 ans)"]
[null,null,null,null,null,"","",null,null,null,null,null,null,null,null,"S",null,null,null,"Français < 5pts (Bonus de 0,5pt)"]
[null,null,null,null,null,null,null,null,null,null,null,null,null,null,null,"SFID",null,null,null,"Joueurs (FIDET) ou étanger < 5pts (Bonus de 0,5pt)"]
[{"$f":"IF(F32<1,\"\",\"Joueurs ou joueuses étrangers\")","v":""},null,null,null,null,null,null,null,null,null,null,null,null,null,null,"SET"]
[{"$f":"IF(F32=0,\"\",IF(F32>5,\"Trop de joueurs étangers-max 5)\",\"OK\"))","v":""},null,null,null,null,null,null,null,null,null,null,null,null,null,null,"SF",null,null,null,"Femme française  < 5pts (Bonus de 2pts): 1,5pts+0,5pt"]
[null,null,null,null,null,null,null,null,null,null,null,null,null,null,null,"SFET",null,null,null,"Femme étrangère  < 5pts (Bonus de 2pts): 1,5pts+0,5pt"]
[{"$f":"IF(G32<1,\"\",\"Joueurs ou joueuses valides de l'équipe\")","v":""},null,null,null,null,null,null,null,null,null,null,null,null,null,null,"JS",null,null,null,"Jeune français <5pts (Bonus 2pts)"]
[{"$f":"IF(G32=0,\"\",IF(G32>2,\"Trop de valides inscrit sur la feuille-max 1)\",\"OK\"))","v":""},null,null,null,null,null,null,null,null,null,null,null,null,null,null,"JFS",null,null,null,"Jeune française <5pts (Bonus 3pts)"]
[null,null,null,null,null,{"$f":"SUM(F6:F29)","v":0},{"$f":"SUM(G6:G31)","v":0}]

{"sheet":"HYERES 2","index":80,"n_rows":32,"n_cols":29,"rows_kept":32,"cut":false,"hidden":false,"merged":[[14,15,14,16],[9,23,10,24],[11,15,11,31],[12,15,12,31],[19,15,19,16],[16,15,16,16],[17,15,17,31],[5,15,6,31],[7,28,8,31],[9,25,9,27],[9,28,9,31],[10,25,10,27],[10,28,10,31],[1,0,2,0],[1,1,2,3],[1,9,1,13],[1,15,4,18],[1,19,1,24],[2,9,2,13],[2,19,3,24],[0,15,0,31],[1,25,1,31],[2,25,3,31],[18,15,18,16],[7,15,8,16],[7,17,8,18],[7,19,8,20],[7,21,8,22],[7,23,8,24],[7,25,8,27],[15,15,15,16],[9,15,10,16],[9,17,10,18],[9,19,10,20],[9,21,10,22],[13,15,13,16],[21,15,21,16],[23,15,23,31],[25,19,26,31],[20,15,20,16],[30,0,30,4],[30,15,30,16],[24,15,24,16],[28,15,28,16],[29,0,29,4],[29,15,29,16],[25,15,25,16],[26,0,26,4],[26,15,26,16],[27,0,27,4],[27,15,27,16]]}
["HYERES BF 2",null,null,null,null,null,null,null,null,null,null,null,null,null,null,"Saison 2024-2025                                                                      Points en jeu"]
[null,"Joueur(es) participant à la rencontre",null,null,null,null,null,null,null,"Saisir votre liste complète en MAJUSCULES ",null,null,null,null,null,"Nationale 3",null,null,null,"Sans carte spécifique",null,null,null,null,null,"Si cartes de couleurs"]
[null,null,null,null,null,null,null,null,null,"Joueurs(es) qualifié(es) saison 2024 -2025",null,null,null,null,null,null,null,null,null,"15,5 pts",null,null,null,null,null,"maxi 19 pts"]
[]
["Statuts","Classif.","          Noms      /    Prénoms",null,"Numéros","ET","VALIDE",null,null,"Statuts","Classif.","          Noms      /    Prénoms",null,"Numéros",null,null,null,null,null,"Si >16pts au début du match (+10 pts adversaire)"]
[null,null,null,null,null,{"$f":"IF(A6=\"ET\",1,\"\")","v":""},{"$f":"IF(B6=5,1,\"\")","v":""},null,null,null,null,null,null,4,null,"Avec une date de validité"]
[null,null,null,null,null,{"$f":"IF(A7=\"ET\",1,\"\")","v":""},{"$f":"IF(B7=5,1,\"\")","v":""},null,null,null,5,"LABISE","M",5]
[null,null,null,null,null,{"$f":"IF(A8=\"ET\",1,\"\")","v":""},{"$f":"IF(B8=5,1,\"\")","v":""},null,null,null,null,null,null,6,null,"Carte Verte",null,"Carte Jaune",null,"Carte Rose",null,"Carte      Bleue",null,"Carte      Orange",null,"Joueurs(es) valides (5pts)",null,null,"Non Sélectionnables en EDF (hors FIDET)"]
[null,null,null,null,null,"","",null,null,"J",2.5,"FERRANTE","J",7]
[null,null,null,null,null,"","",null,null,null,5,"BARROIS","T",8,null,"+  1,5",null,"+  2,5",null,"+  1,5",null,"+  0,5",null,"+  0,5",null,"2 sur la feuille ",null,null,"5 sur la feuille"]
[null,null,null,null,null,"","",null,null,"S",3,"MARIE","P",9,null,null,null,null,null,null,null,null,null,null,null,"2 sur le terrain ",null,null,"4 sur le terrain "]
[null,null,null,null,null,"","",null,null,null,2.5,"NUTTIN","P",10,null,"Pour le calcul des points"]
[null,null,null,null,null,"","",null,null,null,1,"ADIASSE","G",11,null,"Inscrire dans la colonne de gauche le \"Statut\" des joueurs ou joueuses "]
[null,null,null,null,null,"","",null,null,null,3,"LERAY","D",12,null,"J",null,null,null,"Jeune joueur débutant (Bonus1,5pt)"]
[null,null,null,null,null,"","",null,null,null,5,"LANTERI","S",13,null,"JF",null,null,null,"Jeune joueuse débutante (Bonus 2,5pt)"]
[null,null,null,null,null,"","",null,null,"S",4,"JAYET","C",14,null,"F ou FET",null,null,null,"Femme française ou étrangère < 5pts (Bonus 1,5pt)"]
[null,null,null,null,null,"","","",null,null,1,"SOULIE","P",15,null,"FV",null,null,null,"Femme française ou étangère  = 5pts (Bonus de 0,5pt)"]
[null,null,null,null,null,"","","",null,null,5,"ELOI","G",16,null,"Autres possibilités sans Bonus"]
[null,null,null,null,null,"","","",null,null,null,null,null,99,null,"FID",null,"Pour un joueur à un groupement sportif"]
[null,null,null,null,null,"","",null,null,null,null,null,null,18,null,"ET",null,"Pour un joueur étranger "]
[null,null,null,null,null,"","","",null,null,null,null,null,20,null,"VAL",null,"Masculin français (=5 pts) sans bonus"]
[null,null,null,null,null,"","",null,null,null,null,null,null,21,null,"R",null,"Tous joueurs révisables en classification (sauf valide)"]
[null,null,null,null,null,"","",null,null,null,null,null,null,22,null,null,null,"Pour tous joueurs sans symbole sur la carte de classification"]
[null,null,null,null,null,"","",null,null,null,null,null,null,null,null,"Spécificités Nat 2 et 3 (plus de 55 ans)"]
[null,null,null,null,null,"","",null,null,null,null,null,null,null,null,"S",null,null,null,"Français < 5pts (Bonus de 0,5pt)"]
[null,null,null,null,null,null,null,null,null,null,null,null,null,null,null,"SFID",null,null,null,"Joueurs (FIDET) ou étanger < 5pts (Bonus de 0,5pt)"]
[{"$f":"IF(F32<1,\"\",\"Joueurs ou joueuses étrangers\")","v":""},null,null,null,null,null,null,null,null,null,null,null,null,null,null,"SET"]
[{"$f":"IF(F32=0,\"\",IF(F32>5,\"Trop de joueurs étangers-max 5)\",\"OK\"))","v":""},null,null,null,null,null,null,null,null,null,null,null,null,null,null,"SF",null,null,null,"Femme française  < 5pts (Bonus de 2pts): 1,5pts+0,5pt"]
[null,null,null,null,null,null,null,null,null,null,null,null,null,null,null,"SFET",null,null,null,"Femme étrangère  < 5pts (Bonus de 2pts): 1,5pts+0,5pt"]
[{"$f":"IF(G32<1,\"\",\"Joueurs ou joueuses valides de l'équipe\")","v":""},null,null,null,null,null,null,null,null,null,null,null,null,null,null,"JS",null,null,null,"Jeune français <5pts (Bonus 2pts)"]
[{"$f":"IF(G32=0,\"\",IF(G32>2,\"Trop de valides inscrit sur la feuille-max 1)\",\"OK\"))","v":""},null,null,null,null,null,null,null,null,null,null,null,null,null,null,"JFS",null,null,null,"Jeune française <5pts (Bonus 3pts)"]
[null,null,null,null,null,{"$f":"SUM(F6:F29)","v":0},{"$f":"SUM(G6:G31)","v":0}]

{"sheet":"MARSEILLE 2","index":81,"n_rows":32,"n_cols":29,"rows_kept":32,"cut":false,"hidden":false,"merged":[[14,15,14,16],[9,23,10,24],[11,15,11,31],[12,15,12,31],[19,15,19,16],[16,15,16,16],[17,15,17,31],[5,15,6,31],[7,28,8,31],[9,25,9,27],[9,28,9,31],[10,25,10,27],[10,28,10,31],[1,0,2,0],[1,1,2,3],[1,9,1,13],[1,15,4,18],[1,19,1,24],[2,9,2,13],[2,19,3,24],[0,15,0,31],[1,25,1,31],[2,25,3,31],[18,15,18,16],[7,15,8,16],[7,17,8,18],[7,19,8,20],[7,21,8,22],[7,23,8,24],[7,25,8,27],[15,15,15,16],[9,15,10,16],[9,17,10,18],[9,19,10,20],[9,21,10,22],[13,15,13,16],[21,15,21,16],[23,15,23,31],[25,19,26,31],[20,15,20,16],[30,0,30,4],[30,15,30,16],[24,15,24,16],[28,15,28,16],[29,0,29,4],[29,15,29,16],[25,15,25,16],[26,0,26,4],[26,15,26,16],[27,0,27,4],[27,15,27,16]]}
["HSB MARSEILLE 2",null,null,null,null,null,null,null,null,null,null,null,null,null,null,"Saison 2024-2025                                                                      Points en jeu"]
[null,"Joueur(es) participant à la rencontre",null,null,null,null,null,null,null,"Saisir votre liste complète en MAJUSCULES ",null,null,null,null,null,"Nationale 3",null,null,null,"Sans carte spécifique",null,null,null,null,null,"Si cartes de couleurs"]
[null,null,null,null,null,null,null,null,null,"Joueurs(es) qualifié(es) saison 2024 -2025",null,null,null,null,null,null,null,null,null,"15,5 pts",null,null,null,null,null,"maxi 19 pts"]
[]
["Statuts","Classif.","          Noms      /    Prénoms",null,"Numéros","ET","VALIDE",null,null,"Statuts","Classif.","          Noms      /    Prénoms",null,"Numéros",null,null,null,null,null,"Si >16pts au début du match (+10 pts adversaire)"]
[null,null,null,null,null,{"$f":"IF(A6=\"ET\",1,\"\")","v":""},{"$f":"IF(B6=5,1,\"\")","v":""},null,null,"ET",5,"EDINE","H",4,null,"Avec une date de validité"]
[null,null,null,null,null,{"$f":"IF(A7=\"ET\",1,\"\")","v":""},{"$f":"IF(B7=5,1,\"\")","v":""},null,null,"ET",3.5,"KARAMBA","K",5]
[null,null,null,null,null,{"$f":"IF(A8=\"ET\",1,\"\")","v":""},{"$f":"IF(B8=5,1,\"\")","v":""},null,null,"JF",2,"GAY","M",6,null,"Carte Verte",null,"Carte Jaune",null,"Carte Rose",null,"Carte      Bleue",null,"Carte      Orange",null,"Joueurs(es) valides (5pts)",null,null,"Non Sélectionnables en EDF (hors FIDET)"]
[null,null,null,null,null,"","",null,null,null,4,"BOUSTILA","O",7]
[null,null,null,null,null,"","",null,null,null,null,null,null,8,null,"+  1,5",null,"+  2,5",null,"+  1,5",null,"+  0,5",null,"+  0,5",null,"2 sur la feuille ",null,null,"5 sur la feuille"]
[null,null,null,null,null,"","",null,null,"ET",1,"BENMERRAAH","A",9,null,null,null,null,null,null,null,null,null,null,null,"2 sur le terrain ",null,null,"4 sur le terrain "]
[null,null,null,null,null,"","",null,null,"F",2,"RUBLER","AS",10,null,"Pour le calcul des points"]
[null,null,null,null,null,"","",null,null,null,3,"TALAALATCHE","M",11,null,"Inscrire dans la colonne de gauche le \"Statut\" des joueurs ou joueuses "]
[null,null,null,null,null,"","",null,null,null,3,"AMAH","K",12,null,"J",null,null,null,"Jeune joueur débutant (Bonus1,5pt)"]
[null,null,null,null,null,"","",null,null,null,2,"FRANCOIS","R",13,null,"JF",null,null,null,"Jeune joueuse débutante (Bonus 2,5pt)"]
[null,null,null,null,null,"","",null,null,null,4.5,"TALBOT","J",14,null,"F ou FET",null,null,null,"Femme française ou étrangère < 5pts (Bonus 1,5pt)"]
[null,null,null,null,null,"","","",null,null,2,"AOUTKILI","W",15,null,"FV",null,null,null,"Femme française ou étangère  = 5pts (Bonus de 0,5pt)"]
[null,null,null,null,null,"","","",null,null,null,null,null,16,null,"Autres possibilités sans Bonus"]
[null,null,null,null,null,"","","",null,null,null,null,null,null,null,"FID",null,"Pour un joueur à un groupement sportif"]
[null,null,null,null,null,"","",null,null,null,null,null,null,null,null,"ET",null,"Pour un joueur étranger "]
[null,null,null,null,null,"","","",null,null,null,null,null,null,null,"VAL",null,"Masculin français (=5 pts) sans bonus"]
[null,null,null,null,null,"","",null,null,null,null,null,null,null,null,"R",null,"Tous joueurs révisables en classification (sauf valide)"]
[null,null,null,null,null,"","",null,null,null,null,null,null,null,null,null,null,"Pour tous joueurs sans symbole sur la carte de classification"]
[null,null,null,null,null,"","",null,null,null,null,null,null,null,null,"Spécificités Nat 2 et 3 (plus de 55 ans)"]
[null,null,null,null,null,"","",null,null,null,null,null,null,null,null,"S",null,null,null,"Français < 5pts (Bonus de 0,5pt)"]
[null,null,null,null,null,null,null,null,null,null,null,null,null,null,null,"SFID",null,null,null,"Joueurs (FIDET) ou étanger < 5pts (Bonus de 0,5pt)"]
[{"$f":"IF(F32<1,\"\",\"Joueurs ou joueuses étrangers\")","v":""},null,null,null,null,null,null,null,null,null,null,null,null,null,null,"SET"]
[{"$f":"IF(F32=0,\"\",IF(F32>5,\"Trop de joueurs étangers-max 5)\",\"OK\"))","v":""},null,null,null,null,null,null,null,null,null,null,null,null,null,null,"SF",null,null,null,"Femme française  < 5pts (Bonus de 2pts): 1,5pts+0,5pt"]
[null,null,null,null,null,null,null,null,null,null,null,null,null,null,null,"SFET",null,null,null,"Femme étrangère  < 5pts (Bonus de 2pts): 1,5pts+0,5pt"]
[{"$f":"IF(G32<1,\"\",\"Joueurs ou joueuses valides de l'équipe\")","v":""},null,null,null,null,null,null,null,null,null,null,null,null,null,null,"JS",null,null,null,"Jeune français <5pts (Bonus 2pts)"]
[{"$f":"IF(G32=0,\"\",IF(G32>1,\"Trop de valides inscrit sur la feuille-max 1)\",\"OK\"))","v":""},null,null,null,null,null,null,null,null,null,null,null,null,null,null,"JFS",null,null,null,"Jeune française <5pts (Bonus 3pts)"]
[null,null,null,null,null,{"$f":"SUM(F6:F29)","v":0},{"$f":"SUM(G6:G31)","v":0}]

{"sheet":"ANGLET finale","index":82,"n_rows":32,"n_cols":29,"rows_kept":32,"cut":false,"hidden":false,"merged":[[30,15,30,17],[31,15,31,17],[27,0,27,4],[27,15,27,17],[28,0,28,4],[28,15,28,29],[29,0,29,4],[29,15,29,17],[22,15,22,17],[22,18,22,21],[23,15,23,29],[24,15,24,17],[25,15,25,17],[26,0,26,4],[26,15,26,17],[14,26,14,27],[14,28,14,29],[15,15,15,29],[16,15,18,17],[16,18,18,21],[19,15,21,17],[19,18,21,21],[11,25,14,25],[11,26,11,27],[11,28,11,29],[12,18,14,19],[12,20,12,21],[12,26,12,27],[12,28,12,29],[13,20,13,21],[13,26,13,27],[13,28,13,29],[11,15,14,17],[11,18,11,19],[11,20,11,21],[11,22,14,22],[11,23,14,23],[11,24,14,24],[14,20,14,21],[9,25,10,25],[9,26,9,27],[9,28,9,29],[10,20,10,21],[10,26,10,27],[10,28,10,29],[9,24,10,24],[9,15,10,17],[9,18,10,19],[9,20,9,21],[9,22,10,22],[9,23,10,23],[7,23,8,23],[5,24,6,24],[5,26,5,27],[5,28,6,29],[6,20,6,21],[6,26,6,27],[5,23,6,23],[7,24,8,24],[7,26,7,27],[7,28,7,29],[8,20,8,21],[8,26,8,27],[8,28,8,29],[5,15,6,17],[5,18,6,19],[5,20,5,21],[5,22,6,22],[7,15,8,17],[7,18,8,19],[7,20,7,21],[7,22,8,22],[0,15,0,29],[1,0,2,0],[1,1,2,3],[1,9,1,13],[1,22,3,22],[1,23,3,23],[1,24,3,24],[1,25,3,25],[1,26,3,27],[1,28,3,29],[2,9,2,13]]}
["ANGLET finale",null,null,null,null,null,null,null,null,null,null,null,null,null,null,"Saison 2023-2024"]
[null,"Joueur(es) participant à la rencontre",null,null,null,null,null,null,null,"Saisir votre liste complète en MAJUSCULES ",null,null,null,null,null,null,null,null,null,null,null,null,"Carte Verte","Carte Jaune","Carte Rose","Carte Bleue","5,0 Val",null,"Non Sélectionnables en EDF (hors Fidet)"]
[null,null,null,null,null,null,null,null,null,"Joueurs(es) qualifié(es) saison 2023 -2024",null,null,null,null,null,null,null,null,"Avec une date de validité"]
[]
["Statuts","Classif.","          Noms      /    Prénoms",null,"Numéros","ET","VALID","",null,"Statuts","Classif.","          Noms      /    Prénoms",null,"Numéros"]
[null,null,null,null,null,{"$f":"IF(A6=\"ET\",1,\"\")","v":""},{"$f":"IF(B6=5,1,\"\")","v":""},"",null,"N",2,"GOURGUES","D",4,null,"Elite Nationale Bastide Médical",null,null,14.5,null,"Maxi 17,5 pts",null,"+  1 ","+  2","+  1,5",null,"1 sur la feuille",null,"Pas de limite"]
[null,null,null,null,null,{"$f":"IF(A7=\"ET\",1,\"\")","v":""},{"$f":"IF(B7=5,1,\"\")","v":""},null,null,"N",5,"MENETRIER","P",5,null,null,null,null,null,null,"si cartes de couleurs",null,null,null,null,null,"et terrain"]
[null,null,null,null,null,{"$f":"IF(A8=\"ET\",1,\"\")","v":""},"","",null,null,null,null,null,6,null," Nationale 1",null,null,14.5,null,"Maxi 17,5 pts",null,"+  1 ,5","+  2,5","+  1,5",null,"1 sur la feuille",null,"4  Maxi / terrain     "]
[null,null,null,null,null,"","",null,null,"ET",1,"STEWART","J",7,null,null,null,null,null,null,"si cartes de couleurs",null,null,null,null,null,"et terrain",null," (5 sur la feuille)"]
[null,null,null,null,null,"","","",null,"S",4,"BACHOFFER","H",8,null," Nationale 2",null,null,15,null,"Maxi 19 pts",null,"+  1,5","+  2,5","+  1,5","+  0,5","2 sur la feuille",null,"4  Maxi / terrain     "]
[null,null,null,null,null,"","","",null,"N",2,"RYBACK","FX",9,null,null,null,null,null,null,"si cartes de couleurs",null,null,null,null,null,"2 sur le terrain",null," (5 sur la feuille)"]
[null,null,null,null,null,"","","",null,"N",1.5,"KSOURI","N",10,null," Nationale 3",null,null,15.5,null,null,null,"+  1,5","+  2,5","+  1,5","+  0,5"]
[null,null,null,null,null,"","","",null,"N",4,"LAVELLE","A",11,null,null,null,null,"Si 16pts début match-handicap de 10pts",null,"Maxi 19 pts",null,null,null,null,null,"2 sur la feuille",null,"4 Maxi / terrain"]
[null,null,null,null,null,"","","",null,null,null,null,null,12,null,null,null,null,null,null,"si cartes de couleurs",null,null,null,null,null,"2 sur le terrain",null," (5 sur la feuille)"]
[null,null,null,null,null,"","","",null,"N",5,"APPLAINCOURT","T",13]
[null,null,null,null,null,"","","",null,"N",2,"COUSSAU","E",14,null,"Inscrire dans la colonne de gauche les \"Statuts\" des joueurs de l'équipe"]
[null,null,null,null,null,"","","",null,"S",4,"BIRON","S",15,null,"J",null,null,"Pour les cartes Vertes",null,null,null,"Jeune joueur (U19 en Elite Nationale Bastide Médical)"]
[null,null,null,null,null,"","","",null,null,null,null,null,16,null,null,null,null,null,null,null,null,"Joueur débutant, sélectionnable en Equipe de France"]
[null,null,null,null,null,"","","",null,null,null,null,null,17,null,null,null,null,null,null,null,null,"seulement (attention à la date de validité juqu'à 22 ans révolu)"]
[null,null,null,null,null,"","",null,null,null,null,null,null,18,null,"JF",null,null,"Pour les cartes Jaunes",null,null,null,"Jeune joueuse (U19 en Elite Nationale Bastide Médical)"]
[null,null,null,null,null,"","","",null,null,null,null,null,19,null,null,null,null,null,null,null,null,"Joueuse débutante, sélectionnable en Equipe de France"]
[null,null,null,null,null,"","",null,null,null,null,null,null,20,null,null,null,null,null,null,null,null,"seulement (attention à la date de validité juqu' à 22 ans révolu)"]
[null,null,null,null,null,"","",null,null,null,null,null,null,null,null,"F ou FET",null,null,"Pour les cartes roses",null,null,null,"Pour les femmes ou femmes étrangères <5pts  (Bonus 1,5 pts)"]
[null,null,null,null,null,"","",null,null,null,null,null,null,null,null,"En Nationale 2 et 3 uniquement (joueuses et joueurs de plus de 55 ans)"]
[null,null,null,null,null,"","",null,null,null,null,null,null,null,null,"S",null,null,"Pour les hommes séniors",null,null,null," Français ou Etrangers (Bonus de 0,5pt)"]
[null,null,null,null,null,null,null,null,null,null,null,null,null,null,null,"FS",null,null,"   Pour les femmes seniors",null,null,null," (Bonus 2pts)      "]
[" Joueurs-joueuses valides de l'équipe (5 points)",null,null,null,null,null,null,null,null,null,null,null,null,null,null,"JS",null,null," Pour les jeunes hommes séniors",null,null,null," Débutants  (Bonus 2pts)  validité (<3pts 2ans)       ( > 3pts 1 an)"]
[{"$f":"IF($G$31=0,\"\",IF($G$31>2,\"Trop de valides sur le terrain\",\"OK\"))","v":""},null,null,null,null,null,null,null,null,null,null,null,null,null,null,"JFS",null,null," Pour les jeunes femmes séniors",null,null,null," Débutantes  (Bonus 3pts)  validité (<3pts 2ans)     ( > 3pts 1 an)"]
["Joueurs étrangers ",null,null,null,null,null,null,null,null,null,null,null,null,null,null,"Autres possibilités (sans Bonus)"]
[{"$f":"IF(F31=0,\"\",IF(F31>5,\"Trop de joueurs étrangers sur la feuille\",\"OK\"))","v":""},null,null,null,null,null,null,null,null,null,null,null,null,null,null,"ET",null,null,"Pour un joueur étranger"]
[null,null,null,null,null,{"$f":"SUM(F6:F25)","v":0},{"$f":"SUM(G6:G25)","v":0},null,null,null,null,null,null,null,null,"FID",null,null,"Pour un joueur fidèle"]
[null,null,null,null,null,null,null,null,null,null,null,null,null,null,null,"N",null,null,"Pour tous joueurs sans symbole sur la carte de classification"]

{"sheet":"BLANQUEFORT finale","index":83,"n_rows":33,"n_cols":29,"rows_kept":33,"cut":false,"hidden":false,"merged":[[32,15,32,17],[0,15,0,29],[1,0,2,0],[1,1,2,3],[1,9,1,13],[1,22,3,22],[1,23,3,23],[1,24,3,24],[1,25,3,25],[1,26,3,27],[1,28,3,29],[2,9,2,13],[5,15,6,17],[5,18,6,19],[5,20,5,21],[5,22,6,22],[7,15,8,17],[7,18,8,19],[7,20,7,21],[7,22,8,22],[7,23,8,23],[5,24,6,24],[5,26,5,27],[5,28,6,29],[6,20,6,21],[6,26,6,27],[5,23,6,23],[7,24,8,24],[7,26,7,27],[7,28,7,29],[8,20,8,21],[8,26,8,27],[8,28,8,29],[9,15,10,17],[9,18,10,19],[9,20,9,21],[9,22,10,22],[9,23,10,23],[9,25,10,25],[9,26,9,27],[9,28,9,29],[10,20,10,21],[10,26,10,27],[10,28,10,29],[9,24,10,24],[13,20,13,21],[13,26,13,27],[13,28,13,29],[11,15,14,17],[11,18,11,19],[11,20,11,21],[11,22,14,22],[11,23,14,23],[11,24,14,24],[14,20,14,21],[26,0,26,4],[26,15,26,17],[14,26,14,27],[14,28,14,29],[15,15,15,29],[16,15,18,17],[16,18,18,21],[19,15,21,17],[19,18,21,21],[11,25,14,25],[11,26,11,27],[11,28,11,29],[12,18,14,19],[12,20,12,21],[12,26,12,27],[12,28,12,29],[22,15,22,17],[22,18,22,21],[23,15,23,29],[24,15,24,17],[25,15,25,17],[30,15,30,17],[31,15,31,17],[27,0,27,4],[27,15,27,17],[28,0,28,4],[29,0,29,4],[28,15,28,17],[29,15,29,29]]}
["BLANQUEFORT Finale",null,null,null,null,null,null,null,null,null,null,null,null,null,null,"Saison 2024-2025"]
[null,"Joueur(es) participant à la rencontre",null,null,null,null,null,null,null,"Saisir votre liste complète en MAJUSCULES ",null,null,null,null,null,null,null,null,null,null,null,null,"Carte Verte","Carte Jaune","Carte Rose","Carte Bleue","5,0 Val",null,"Non Sélectionnables en EDF (hors Fidet)"]
[null,null,null,null,null,null,null,null,null,"Joueurs(es) qualifié(es) saison 2024 -2025",null,null,null,null,null,null,null,null,"Avec une date de validité"]
[]
["Statuts","Classif.","          Noms      /    Prénoms",null,"Numéros","ET","VALIDE",null,null,"Statuts","Classif.","          Noms      /    Prénoms",null,"Numéros"]
[null,null,null,null,null,{"$f":"IF(A6=\"ET\",1,\"\")","v":""},{"$f":"IF(B6=5,1,\"\")","v":""},null,null,"N",2.5,"LEPAPE","A",4,null,"Elite Nationale Bastide Médical",null,null,14.5,null,"Maxi 17,5 pts",null,"+  1 ","+  2","+  1,5",null,"1 sur la feuille",null,"Pas de limite"]
[null,null,null,null,null,{"$f":"IF(A7=\"ET\",1,\"\")","v":""},{"$f":"IF(B7=5,1,\"\")","v":""},null,null,"N",5,"DANIEL LACOMBE","A",5,null,null,null,null,null,null,"si cartes de couleurs",null,null,null,null,null,"et terrain"]
[null,null,null,null,null,{"$f":"IF(A8=\"ET\",1,\"\")","v":""},{"$f":"IF(B8=5,1,\"\")","v":""},null,null,"N",3.5,"BERREGRAGUE","S",6,null," Nationale 1",null,null,14.5,null,"Maxi 17,5 pts",null,"+  1 ,5","+  2,5","+  1,5",null,"1 sur la feuille",null,"4  Maxi / terrain     "]
[null,null,null,null,null,"","",null,null,"N",4.5,"MALLET","S",7,null,null,null,null,null,null,"si cartes de couleurs",null,null,null,null,null,"et terrain",null," (5 sur la feuille)"]
[null,null,null,null,null,"","",null,null,"N",1.5,"COUREAU","T",9,null," Nationale 2",null,null,15,null,"Maxi 19 pts",null,"+  1,5","+  2,5","+  1,5","+  0,5","2 sur la feuille",null,"4  Maxi / terrain     "]
[null,null,null,null,null,"","",null,null,"N",3.5,"BENTRAT","R",10,null,null,null,null,null,null,"si cartes de couleurs",null,null,null,null,null,"2 sur le terrain",null," (5 sur la feuille)"]
[null,null,null,null,null,"","",null,null,"N",4,"LAFOND","C",11,null," Nationale 3",null,null,15.5,null,null,null,"+  1,5","+  2,5","+  1,5","+  0,5"]
[null,null,null,null,null,"","",null,null,"J",1,"VAYSSET","H",12,null,null,null,null,"Si 16pts début match-handicap de 10pts",null,"Maxi 19 pts",null,null,null,null,null,"2 sur la feuille",null,"4 Maxi / terrain"]
[null,null,null,null,null,"","",null,null,"N",2,"BANNES","P",13,null,null,null,null,null,null,"si cartes de couleurs",null,null,null,null,null,"2 sur le terrain",null," (5 sur la feuille)"]
[null,null,null,null,null,"","",null,null,"N",1,"TEIXERA","J",14]
[null,null,null,null,null,"","",null,null,"N",1,"BODY","E",17,null,"Inscrire dans la colonne de gauche les \"Statuts\" des joueurs de l'équipe"]
[null,null,null,null,null,"","","",null,"N",1,"LE RU","A",19,null,"J",null,null,"Pour les cartes Vertes",null,null,null,"Jeune joueur (U19 en Elite Nationale Bastide Médical)"]
[null,null,null,null,null,"","","",null,null,null,null,null,null,null,null,null,null,null,null,null,null,"Joueur débutant, sélectionnable en Equipe de France"]
[null,null,null,null,null,"","","",null,null,null,null,null,null,null,null,null,null,null,null,null,null,"seulement (attention à la date de validité juqu'à 22 ans révolu)"]
[null,null,null,null,null,"","",null,null,null,null,null,null,null,null,"JF",null,null,"Pour les cartes Jaunes",null,null,null,"Jeune joueuse (U19 en Elite Nationale Bastide Médical)"]
[null,null,null,null,null,"","","",null,null,null,null,null,null,null,null,null,null,null,null,null,null,"Joueuse débutante, sélectionnable en Equipe de France"]
[null,null,null,null,null,"","",null,null,null,null,null,null,null,null,null,null,null,null,null,null,null,"seulement (attention à la date de validité juqu' à 22 ans révolu)"]
[null,null,null,null,null,"","",null,null,null,null,null,null,null,null,"F ou FET",null,null,"Pour les cartes roses",null,null,null,"Pour les femmes ou femmes étrangères <5pts  (Bonus 1,5 pts)"]
[null,null,null,null,null,"","",null,null,null,null,null,null,null,null,"En Nationale 2 et 3 uniquement (joueuses et joueurs de plus de 55 ans)"]
[null,null,null,null,null,"","",null,null,null,null,null,null,null,null,"S",null,null,"Homme sénior ",null,null,null," Français ou Etrangers (Bonus de 0,5pt)"]
[null,null,null,null,null,null,null,null,null,null,null,null,null,null,null,"FS",null,null,"Femme senior",null,null,null,"<5 Ppts  Bonus 2pts (1,5+0,5)      "]
[" Joueurs-joueuses valides de l'équipe (5 points)",null,null,null,null,null,null,null,null,null,null,null,null,null,null,"FSV",null,null,"Femme senior valide",null,null,null,"Exclusivement 5 pts  Bonus 0,5 pt"]
[{"$f":"IF(G31=0,\"\",IF(G31>2,\"Trop de valides sur le terrain\",\"OK\"))","v":""},null,null,null,null,null,null,null,null,null,null,null,null,null,null,"JS",null,null," Pour les jeunes hommes séniors",null,null,null," Débutants  (Bonus 2pts)  validité (<3pts 2ans)       ( > 3pts 1 an)"]
["Joueurs étrangers ",null,null,null,null,null,null,null,null,null,null,null,null,null,null,"JFS",null,null," Pour les jeunes femmes séniors",null,null,null," Débutantes  (Bonus 3pts)  validité (<3pts 2ans)     ( > 3pts 1 an)"]
[{"$f":"IF(F31=0,\"\",IF(F31>5,\"Trop de joueurs étrangers sur la feuille\",\"OK\"))","v":""},null,null,null,null,null,null,null,null,null,null,null,null,null,null,"Autres possibilités (sans Bonus)"]
[null,null,null,null,null,{"$f":"SUM(F6:F28)","v":0},{"$f":"SUM(G6:G30)","v":0},null,null,null,null,null,null,null,null,"ET",null,null,"Pour un joueur étranger"]
[null,null,null,null,null,null,null,null,null,null,null,null,null,null,null,"FID",null,null,"Pour un joueur fidèle"]
[null,null,null,null,null,null,null,null,null,null,null,null,null,null,null,"N",null,null,"Pour tous joueurs sans symbole sur la carte de classification"]

{"sheet":"CAMBRAI finale","index":84,"n_rows":33,"n_cols":29,"rows_kept":33,"cut":false,"hidden":false,"merged":[[32,15,32,17],[0,15,0,29],[1,0,2,0],[1,1,2,3],[1,9,1,13],[1,22,3,22],[1,23,3,23],[1,24,3,24],[1,25,3,25],[1,26,3,27],[1,28,3,29],[2,9,2,13],[5,15,6,17],[5,18,6,19],[5,20,5,21],[5,22,6,22],[7,15,8,17],[7,18,8,19],[7,20,7,21],[7,22,8,22],[7,23,8,23],[5,24,6,24],[5,26,5,27],[5,28,6,29],[6,20,6,21],[6,26,6,27],[5,23,6,23],[7,24,8,24],[7,26,7,27],[7,28,7,29],[8,20,8,21],[8,26,8,27],[8,28,8,29],[9,15,10,17],[9,18,10,19],[9,20,9,21],[9,22,10,22],[9,23,10,23],[9,25,10,25],[9,26,9,27],[9,28,9,29],[10,20,10,21],[10,26,10,27],[10,28,10,29],[9,24,10,24],[13,20,13,21],[13,26,13,27],[13,28,13,29],[11,15,14,17],[11,18,11,19],[11,20,11,21],[11,22,14,22],[11,23,14,23],[11,24,14,24],[14,20,14,21],[26,0,26,4],[26,15,26,17],[14,26,14,27],[14,28,14,29],[15,15,15,29],[16,15,18,17],[16,18,18,21],[19,15,21,17],[19,18,21,21],[11,25,14,25],[11,26,11,27],[11,28,11,29],[12,18,14,19],[12,20,12,21],[12,26,12,27],[12,28,12,29],[22,15,22,17],[22,18,22,21],[23,15,23,29],[24,15,24,17],[25,15,25,17],[30,15,30,17],[31,15,31,17],[27,0,27,4],[27,15,27,17],[28,0,28,4],[29,0,29,4],[28,15,28,17],[29,15,29,29]]}
["CAMBRAI Finale",null,null,null,null,null,null,null,null,null,null,null,null,null,null,"Saison 2024-2025"]
[null,"Joueur(es) participant à la rencontre",null,null,null,null,null,null,null,"Saisir votre liste complète en MAJUSCULES ",null,null,null,null,null,null,null,null,null,null,null,null,"Carte Verte","Carte Jaune","Carte Rose","Carte Bleue","5,0 Val",null,"Non Sélectionnables en EDF (hors Fidet)"]
[null,null,null,null,null,null,null,null,null,"Joueurs(es) qualifié(es) saison 2024 -2025",null,null,null,null,null,null,null,null,"Avec une date de validité"]
[]
["Statuts","Classif.","          Noms      /    Prénoms",null,"Numéros","ET","VALID","",null,"Statuts","Classif.","          Noms      /    Prénoms",null,"Numéros"]
["N",1,"KANIA","Y",4,{"$f":"IF(A6=\"ET\",1,\"\")","v":""},{"$f":"IF(B6=5,1,\"\")","v":""},"",null,"N",1,"KANIA","Y",4,null,"Elite Nationale Bastide Médical",null,null,14.5,null,"Maxi 17,5 pts",null,"+  1 ","+  2","+  1,5",null,"1 sur la feuille",null,"Pas de limite"]
["N",2,"HONORE","B",6,{"$f":"IF(A7=\"ET\",1,\"\")","v":""},{"$f":"IF(B7=5,1,\"\")","v":""},null,null,null,null,null,null,5,null,null,null,null,null,null,"si cartes de couleurs",null,null,null,null,null,"et terrain"]
["ET",1,"JAEGERS","K",8,{"$f":"IF(A8=\"ET\",1,\"\")","v":1},{"$f":"IF(B8=5,1,\"\")","v":""},"",null,"N",2,"HONORE","B",6,null," Nationale 1",null,null,14.5,null,"Maxi 17,5 pts",null,"+  1 ,5","+  2,5","+  1,5",null,"1 sur la feuille",null,"4  Maxi / terrain     "]
["N",1.5,"RESZEL","R",9,"","",null,null,null,null,null,null,7,null,null,null,null,null,null,"si cartes de couleurs",null,null,null,null,null,"et terrain",null," (5 sur la feuille)"]
["N",5,"CARPENTIER","T",10,"",1,"",null,"ET",1,"JAEGERS","K",8,null," Nationale 2",null,null,15,null,"Maxi 19 pts",null,"+  1,5","+  2,5","+  1,5","+  0,5","2 sur la feuille",null,"4  Maxi / terrain     "]
["ET",2.5,"ETAOUKIL","L",11,1,"","",null,"N",1.5,"RESZEL","R",9,null,null,null,null,null,null,"si cartes de couleurs",null,null,null,null,null,"2 sur le terrain",null," (5 sur la feuille)"]
["N",2.5,"NYBELEN","M",12,"","","",null,"N",5,"CARPENTIER","T",10,null," Nationale 3",null,null,15.5,null,null,null,"+  1,5","+  2,5","+  1,5","+  0,5"]
["ET",4,"BAYNE","Y",13,1,"","",null,"ET",2.5,"ETAOUKIL","L",11,null,null,null,null,"Si 16pts début match-handicap de 10pts",null,"Maxi 19 pts",null,null,null,null,null,"2 sur la feuille",null,"4 Maxi / terrain"]
["N",2.5,"HAMELIN","D",14,"","","",null,"N",2.5,"NYBELEN","M",12,null,null,null,null,null,null,"si cartes de couleurs",null,null,null,null,null,"2 sur le terrain",null," (5 sur la feuille)"]
["N",4.5,"DEREGNAUCOURT","S",23,"","","",null,"ET",4,"BAYNE","Y",13]
[null,null,null,null,null,"","","",null,"N",2.5,"HAMELIN","D",14,null,"Inscrire dans la colonne de gauche les \"Statuts\" des joueurs de l'équipe"]
[null,null,null,null,null,"","","",null,"N",5,"BOURGUEUF","T",15,null,"J",null,null,"Pour les cartes Vertes",null,null,null,"Jeune joueur (U19 en Elite Nationale Bastide Médical)"]
[null,null,null,null,null,"","","",null,null,null,null,null,16,null,null,null,null,null,null,null,null,"Joueur débutant, sélectionnable en Equipe de France"]
[null,null,null,null,null,"","","",null,null,null,null,null,17,null,null,null,null,null,null,null,null,"seulement (attention à la date de validité juqu'à 22 ans révolu)"]
[null,null,null,null,null,"","",null,null,null,null,null,null,18,null,"JF",null,null,"Pour les cartes Jaunes",null,null,null,"Jeune joueuse (U19 en Elite Nationale Bastide Médical)"]
[null,null,null,null,null,"","","",null,null,null,null,null,19,null,null,null,null,null,null,null,null,"Joueuse débutante, sélectionnable en Equipe de France"]
[null,null,null,null,null,"","",null,null,null,null,null,null,20,null,null,null,null,null,null,null,null,"seulement (attention à la date de validité juqu' à 22 ans révolu)"]
[null,null,null,null,null,"","",null,null,"N",4.5,"DEREGNAUCOURT","S",23,null,"F ou FET",null,null,"Pour les cartes roses",null,null,null,"Pour les femmes ou femmes étrangères <5pts  (Bonus 1,5 pts)"]
[null,null,null,null,null,"","",null,null,null,null,null,null,null,null,"En Nationale 2 et 3 uniquement (joueuses et joueurs de plus de 55 ans)"]
[null,null,null,null,null,"","",null,null,null,null,null,null,null,null,"S",null,null,"Homme sénior ",null,null,null," Français ou Etrangers (Bonus de 0,5pt)"]
[null,null,null,null,null,"","",null,null,null,null,null,null,null,null,"FS",null,null,"Femme senior",null,null,null,"<5 Ppts  Bonus 2pts (1,5+0,5)      "]
[" Joueurs-joueuses valides de l'équipe (5 points)",null,null,null,null,"","",null,null,null,null,null,null,null,null,"FSV",null,null,"Femme senior valide",null,null,null,"Exclusivement 5 pts  Bonus 0,5 pt"]
[{"$f":"IF(G31=0,\"\",IF(G31>2,\"Trop de valides sur le terrain\",\"OK\"))","v":"OK"},null,null,null,null,"","",null,null,null,null,null,null,null,null,"JS",null,null," Pour les jeunes hommes séniors",null,null,null," Débutants  (Bonus 2pts)  validité (<3pts 2ans)       ( > 3pts 1 an)"]
["Joueurs étrangers ",null,null,null,null,"","",null,null,null,null,null,null,null,null,"JFS",null,null," Pour les jeunes femmes séniors",null,null,null," Débutantes  (Bonus 3pts)  validité (<3pts 2ans)     ( > 3pts 1 an)"]
[{"$f":"IF(F31=0,\"\",IF(F31>5,\"Trop de joueurs étrangers sur la feuille\",\"OK\"))","v":"OK"},null,null,null,null,"","",null,null,null,null,null,null,null,null,"Autres possibilités (sans Bonus)"]
[null,null,null,null,null,{"$f":"SUM(F6:F28)","v":3},{"$f":"SUM(G6:G28)","v":1},null,null,null,null,null,null,null,null,"ET",null,null,"Pour un joueur étranger"]
[null,null,null,null,null,null,null,null,null,null,null,null,null,null,null,"FID",null,null,"Pour un joueur fidèle"]
[null,null,null,null,null,null,null,null,null,null,null,null,null,null,null,"N",null,null,"Pour tous joueurs sans symbole sur la carte de classification"]

{"sheet":"LE PUY 2 finale","index":85,"n_rows":33,"n_cols":29,"rows_kept":33,"cut":false,"hidden":false,"merged":[[32,15,32,17],[0,15,0,29],[1,0,2,0],[1,1,2,3],[1,9,1,13],[1,22,3,22],[1,23,3,23],[1,24,3,24],[1,25,3,25],[1,26,3,27],[1,28,3,29],[2,9,2,13],[5,15,6,17],[5,18,6,19],[5,20,5,21],[5,22,6,22],[7,15,8,17],[7,18,8,19],[7,20,7,21],[7,22,8,22],[7,23,8,23],[5,24,6,24],[5,26,5,27],[5,28,6,29],[6,20,6,21],[6,26,6,27],[5,23,6,23],[7,24,8,24],[7,26,7,27],[7,28,7,29],[8,20,8,21],[8,26,8,27],[8,28,8,29],[9,15,10,17],[9,18,10,19],[9,20,9,21],[9,22,10,22],[9,23,10,23],[9,25,10,25],[9,26,9,27],[9,28,9,29],[10,20,10,21],[10,26,10,27],[10,28,10,29],[9,24,10,24],[13,20,13,21],[13,26,13,27],[13,28,13,29],[11,15,14,17],[11,18,11,19],[11,20,11,21],[11,22,14,22],[11,23,14,23],[11,24,14,24],[14,20,14,21],[26,0,26,4],[26,15,26,17],[14,26,14,27],[14,28,14,29],[15,15,15,29],[16,15,18,17],[16,18,18,21],[19,15,21,17],[19,18,21,21],[11,25,14,25],[11,26,11,27],[11,28,11,29],[12,18,14,19],[12,20,12,21],[12,26,12,27],[12,28,12,29],[22,15,22,17],[22,18,22,21],[23,15,23,29],[24,15,24,17],[25,15,25,17],[30,15,30,17],[31,15,31,17],[27,0,27,4],[27,15,27,17],[28,0,28,4],[29,0,29,4],[28,15,28,17],[29,15,29,29]]}
["LE PUY 2 Finale",null,null,null,null,null,null,null,null,null,null,null,null,null,null,"Saison 2024-2025"]
[null,"Joueur(es) participant à la rencontre",null,null,null,null,null,null,null,"Saisir votre liste complète en MAJUSCULES ",null,null,null,null,null,null,null,null,null,null,null,null,"Carte Verte","Carte Jaune","Carte Rose","Carte Bleue","5,0 Val",null,"Non Sélectionnables en EDF (hors Fidet)"]
[null,null,null,null,null,null,null,null,null,"Joueurs(es) qualifié(es) saison 2024 -2025",null,null,null,null,null,null,null,null,"Avec une date de validité"]
[]
["Statuts","Classif.","          Noms      /    Prénoms",null,"Numéros","ET","VALID","",null,"Statuts","Classif.","          Noms      /    Prénoms",null,"Numéros"]
[null,null,null,null,null,{"$f":"IF(A6=\"ET\",1,\"\")","v":""},{"$f":"IF(B6=5,1,\"\")","v":""},"",null,"N",4.5,"GASTON","F",4,null,"Elite Nationale Bastide Médical",null,null,14.5,null,"Maxi 17,5 pts",null,"+  1 ","+  2","+  1,5",null,"1 sur la feuille",null,"Pas de limite"]
[null,null,null,null,null,"",{"$f":"IF(B7=5,1,\"\")","v":""},null,null,"N",1.5,"CHAMARD","D",5,null,null,null,null,null,null,"si cartes de couleurs",null,null,null,null,null,"et terrain"]
[null,null,null,null,null,"","","",null,"N",1.5,"MARTINEZ","JC",6,null," Nationale 1",null,null,14.5,null,"Maxi 17,5 pts",null,"+  1 ,5","+  2,5","+  1,5",null,"1 sur la feuille",null,"4  Maxi / terrain     "]
[null,null,null,null,null,"","",null,null,null,null,null,null,7,null,null,null,null,null,null,"si cartes de couleurs",null,null,null,null,null,"et terrain",null," (5 sur la feuille)"]
[null,null,null,null,null,"","","",null,null,null,null,null,8,null," Nationale 2",null,null,15,null,"Maxi 19 pts",null,"+  1,5","+  2,5","+  1,5","+  0,5","2 sur la feuille",null,"4  Maxi / terrain     "]
[null,null,null,null,null,"","","",null,"N",4,"SAVARY","JC",9,null,null,null,null,null,null,"si cartes de couleurs",null,null,null,null,null,"2 sur le terrain",null," (5 sur la feuille)"]
[null,null,null,null,null,"","","",null,"ET",4.5,"CONTRERAS","L",10,null," Nationale 3",null,null,15.5,null,null,null,"+  1,5","+  2,5","+  1,5","+  0,5"]
[null,null,null,null,null,"","","",null,"N",4,"CHANCELADE","F",11,null,null,null,null,"Si 16pts début match-handicap de 10pts",null,"Maxi 19 pts",null,null,null,null,null,"2 sur la feuille",null,"4 Maxi / terrain"]
[null,null,null,null,null,"","","",null,"F",2,"DORGET","S",12,null,null,null,null,null,null,"si cartes de couleurs",null,null,null,null,null,"2 sur le terrain",null," (5 sur la feuille)"]
[null,null,null,null,null,"","","",null,"N",5,"DORGET","C",13]
[null,null,null,null,null,"","","",null,"J",2,"PERSET","Y",14,null,"Inscrire dans la colonne de gauche les \"Statuts\" des joueurs de l'équipe"]
[null,null,null,null,null,"","","",null,"N",3,"MARIANI","A",15,null,"J",null,null,"Pour les cartes Vertes",null,null,null,"Jeune joueur (U19 en Elite Nationale Bastide Médical)"]
[null,null,null,null,null,"","","",null,"J",1.5,"COATE","G",2,null,null,null,null,null,null,null,null,"Joueur débutant, sélectionnable en Equipe de France"]
[null,null,null,null,null,"","","",null,null,null,null,null,17,null,null,null,null,null,null,null,null,"seulement (attention à la date de validité juqu'à 22 ans révolu)"]
[null,null,null,null,null,"","",null,null,null,null,null,null,18,null,"JF",null,null,"Pour les cartes Jaunes",null,null,null,"Jeune joueuse (U19 en Elite Nationale Bastide Médical)"]
[null,null,null,null,null,"","","",null,null,null,null,null,19,null,null,null,null,null,null,null,null,"Joueuse débutante, sélectionnable en Equipe de France"]
[null,null,null,null,null,"","",null,null,null,null,null,null,20,null,null,null,null,null,null,null,null,"seulement (attention à la date de validité juqu' à 22 ans révolu)"]
[null,null,null,null,null,"","",null,null,null,null,null,null,null,null,"F ou FET",null,null,"Pour les cartes roses",null,null,null,"Pour les femmes ou femmes étrangères <5pts  (Bonus 1,5 pts)"]
[null,null,null,null,null,"","",null,null,null,null,null,null,null,null,"En Nationale 2 et 3 uniquement (joueuses et joueurs de plus de 55 ans)"]
[null,null,null,null,null,"","",null,null,null,null,null,null,null,null,"S",null,null,"Homme sénior ",null,null,null," Français ou Etrangers (Bonus de 0,5pt)"]
[null,null,null,null,null,null,null,null,null,null,null,null,null,null,null,"FS",null,null,"Femme senior",null,null,null,"<5 Ppts  Bonus 2pts (1,5+0,5)      "]
[" Joueurs-joueuses valides de l'équipe (5 points)",null,null,null,null,null,null,null,null,null,null,null,null,null,null,"FSV",null,null,"Femme senior valide",null,null,null,"Exclusivement 5 pts  Bonus 0,5 pt"]
[{"$f":"IF($G$31=0,\"\",IF($G$31>2,\"Trop de valides sur le terrain\",\"OK\"))","v":""},null,null,null,null,null,null,null,null,null,null,null,null,null,null,"JS",null,null," Pour les jeunes hommes séniors",null,null,null," Débutants  (Bonus 2pts)  validité (<3pts 2ans)       ( > 3pts 1 an)"]
["Joueurs étrangers ",null,null,null,null,null,null,null,null,null,null,null,null,null,null,"JFS",null,null," Pour les jeunes femmes séniors",null,null,null," Débutantes  (Bonus 3pts)  validité (<3pts 2ans)     ( > 3pts 1 an)"]
[{"$f":"IF($F$31=0,\"\",IF($F$31>5,\"Trop de joueurs étrangers sur la feuille\",\"OK\"))","v":""},null,null,null,null,null,null,null,null,null,null,null,null,null,null,"Autres possibilités (sans Bonus)"]
[null,null,null,null,null,{"$f":"SUM(F6:F25)","v":0},{"$f":"SUM(G6:G25)","v":0},null,null,null,null,null,null,null,null,"ET",null,null,"Pour un joueur étranger"]
[null,null,null,null,null,null,null,null,null,null,null,null,null,null,null,"FID",null,null,"Pour un joueur fidèle"]
[null,null,null,null,null,null,null,null,null,null,null,null,null,null,null,"N",null,null,"Pour tous joueurs sans symbole sur la carte de classification"]

{"sheet":"LYON finale","index":86,"n_rows":33,"n_cols":29,"rows_kept":33,"cut":false,"hidden":false,"merged":[[32,15,32,17],[0,15,0,29],[1,0,2,0],[1,1,2,3],[1,9,1,13],[1,22,3,22],[1,23,3,23],[1,24,3,24],[1,25,3,25],[1,26,3,27],[1,28,3,29],[2,9,2,13],[5,15,6,17],[5,18,6,19],[5,20,5,21],[5,22,6,22],[7,15,8,17],[7,18,8,19],[7,20,7,21],[7,22,8,22],[7,23,8,23],[5,24,6,24],[5,26,5,27],[5,28,6,29],[6,20,6,21],[6,26,6,27],[5,23,6,23],[7,24,8,24],[7,26,7,27],[7,28,7,29],[8,20,8,21],[8,26,8,27],[8,28,8,29],[9,15,10,17],[9,18,10,19],[9,20,9,21],[9,22,10,22],[9,23,10,23],[9,25,10,25],[9,26,9,27],[9,28,9,29],[10,20,10,21],[10,26,10,27],[10,28,10,29],[9,24,10,24],[13,20,13,21],[13,26,13,27],[13,28,13,29],[11,15,14,17],[11,18,11,19],[11,20,11,21],[11,22,14,22],[11,23,14,23],[11,24,14,24],[14,20,14,21],[26,0,26,4],[26,15,26,17],[14,26,14,27],[14,28,14,29],[15,15,15,29],[16,15,18,17],[16,18,18,21],[19,15,21,17],[19,18,21,21],[11,25,14,25],[11,26,11,27],[11,28,11,29],[12,18,14,19],[12,20,12,21],[12,26,12,27],[12,28,12,29],[22,15,22,17],[22,18,22,21],[23,15,23,29],[24,15,24,17],[25,15,25,17],[30,15,30,17],[31,15,31,17],[27,0,27,4],[27,15,27,17],[28,0,28,4],[29,0,29,4],[28,15,28,17],[29,15,29,29]]}
["LYON Finale",null,null,null,null,null,null,null,null,null,null,null,null,null,null,"Saison 2024-2025"]
[null,"Joueur(es) participant à la rencontre",null,null,null,null,null,null,null,"Saisir votre liste complète en MAJUSCULES ",null,null,null,null,null,null,null,null,null,null,null,null,"Carte Verte","Carte Jaune","Carte Rose","Carte Bleue","5,0 Val",null,"Non Sélectionnables en EDF (hors Fidet)"]
[null,null,null,null,null,null,null,null,null,"Joueurs(es) qualifié(es) saison 2024 -2025",null,null,null,null,null,null,null,null,"Avec une date de validité"]
[]
["Statuts","Classif.","          Noms      /    Prénoms",null,"Numéros","ET","VALID","",null,"Statuts","Classif.","          Noms      /    Prénoms",null,"Numéros"]
[null,null,null,null,null,{"$f":"IF(A6=\"ET\",1,\"\")","v":""},{"$f":"IF(B6=5,1,\"\")","v":""},"",null,"N",1,"MOHAMED KHALIL","K",3,null,"Elite Nationale Bastide Médical",null,null,14.5,null,"Maxi 17,5 pts",null,"+  1 ","+  2","+  1,5",null,"1 sur la feuille",null,"Pas de limite"]
[null,null,null,null,null,{"$f":"IF(A7=\"ET\",1,\"\")","v":""},{"$f":"IF(B7=5,1,\"\")","v":""},null,null,"N",1.5,"BISCAINO","Y",4,null,null,null,null,null,null,"si cartes de couleurs",null,null,null,null,null,"et terrain"]
[null,null,null,null,null,{"$f":"IF(A8=\"ET\",1,\"\")","v":""},{"$f":"IF(B8=5,1,\"\")","v":""},"",null,"FID",3,"BADARA","S",5,null," Nationale 1",null,null,14.5,null,"Maxi 17,5 pts",null,"+  1 ,5","+  2,5","+  1,5",null,"1 sur la feuille",null,"4  Maxi / terrain     "]
[null,null,null,null,null,"","",null,null,"ET",4,"GAYE","M",6,null,null,null,null,null,null,"si cartes de couleurs",null,null,null,null,null,"et terrain",null," (5 sur la feuille)"]
[null,null,null,null,null,"","","",null,"F",2.5,"FALL","O",7,null," Nationale 2",null,null,15,null,"Maxi 19 pts",null,"+  1,5","+  2,5","+  1,5","+  0,5","2 sur la feuille",null,"4  Maxi / terrain     "]
[null,null,null,null,null,"","","",null,"ET",3,"BANGOURA","O",8,null,null,null,null,null,null,"si cartes de couleurs",null,null,null,null,null,"2 sur le terrain",null," (5 sur la feuille)"]
[null,null,null,null,null,"","","",null,"N",2,"DJALALI","A",9,null," Nationale 3",null,null,15.5,null,null,null,"+  1,5","+  2,5","+  1,5","+  0,5"]
[null,null,null,null,null,"","","",null,"N",2,"BENSALEM","K",10,null,null,null,null,"Si 16pts début match-handicap de 10pts",null,"Maxi 19 pts",null,null,null,null,null,"2 sur la feuille",null,"4 Maxi / terrain"]
[null,null,null,null,null,"","","",null,"F",1.5,"DRAME","F",11,null,null,null,null,null,null,"si cartes de couleurs",null,null,null,null,null,"2 sur le terrain",null," (5 sur la feuille)"]
[null,null,null,null,null,"","","",null,null,null,null,null,12]
[null,null,null,null,null,"","","",null,"N",5,"JOUVENCEAU","A",13,null,"Inscrire dans la colonne de gauche les \"Statuts\" des joueurs de l'équipe"]
[null,null,null,null,null,"","","",null,null,null,null,null,14,null,"J",null,null,"Pour les cartes Vertes",null,null,null,"Jeune joueur (U19 en Elite Nationale Bastide Médical)"]
[null,null,null,null,null,"","","",null,"N",2.5,"JOUVENCEAU","L",15,null,null,null,null,null,null,null,null,"Joueur débutant, sélectionnable en Equipe de France"]
[null,null,null,null,null,"","","",null,null,null,null,null,20,null,null,null,null,null,null,null,null,"seulement (attention à la date de validité juqu'à 22 ans révolu)"]
[null,null,null,null,null,"","",null,null,"N",2.5,"DRAME","A",69,null,"JF",null,null,"Pour les cartes Jaunes",null,null,null,"Jeune joueuse (U19 en Elite Nationale Bastide Médical)"]
[null,null,null,null,null,"","","",null,null,null,null,null,null,null,null,null,null,null,null,null,null,"Joueuse débutante, sélectionnable en Equipe de France"]
[null,null,null,null,null,"","",null,null,null,null,null,null,null,null,null,null,null,null,null,null,null,"seulement (attention à la date de validité juqu' à 22 ans révolu)"]
[null,null,null,null,null,"","",null,null,null,null,null,null,null,null,"F ou FET",null,null,"Pour les cartes roses",null,null,null,"Pour les femmes ou femmes étrangères <5pts  (Bonus 1,5 pts)"]
[null,null,null,null,null,"","",null,null,null,null,null,null,null,null,"En Nationale 2 et 3 uniquement (joueuses et joueurs de plus de 55 ans)"]
[null,null,null,null,null,"","",null,null,null,null,null,null,null,null,"S",null,null,"Homme sénior ",null,null,null," Français ou Etrangers (Bonus de 0,5pt)"]
[null,null,null,null,null,"","",null,null,null,null,null,null,null,null,"FS",null,null,"Femme senior",null,null,null,"<5 Ppts  Bonus 2pts (1,5+0,5)      "]
[" Joueurs-joueuses valides de l'équipe (5 points)",null,null,null,null,"","",null,null,null,null,null,null,null,null,"FSV",null,null,"Femme senior valide",null,null,null,"Exclusivement 5 pts  Bonus 0,5 pt"]
[{"$f":"IF(G31=0,\"\",IF(G31>2,\"Trop de valides sur le terrain\",\"OK\"))","v":""},null,null,null,null,"","",null,null,null,null,null,null,null,null,"JS",null,null," Pour les jeunes hommes séniors",null,null,null," Débutants  (Bonus 2pts)  validité (<3pts 2ans)       ( > 3pts 1 an)"]
["Joueurs étrangers ",null,null,null,null,"","",null,null,null,null,null,null,null,null,"JFS",null,null," Pour les jeunes femmes séniors",null,null,null," Débutantes  (Bonus 3pts)  validité (<3pts 2ans)     ( > 3pts 1 an)"]
[{"$f":"IF(F31=0,\"\",IF(F31>5,\"Trop de joueurs étrangers sur la feuille\",\"OK\"))","v":""},null,null,null,null,"","",null,null,null,null,null,null,null,null,"Autres possibilités (sans Bonus)"]
[null,null,null,null,null,{"$f":"SUM(F6:F28)","v":0},{"$f":"SUM(G6:G28)","v":0},null,null,null,null,null,null,null,null,"ET",null,null,"Pour un joueur étranger"]
[null,null,null,null,null,null,null,null,null,null,null,null,null,null,null,"FID",null,null,"Pour un joueur fidèle"]
[null,null,null,null,null,null,null,null,null,null,null,null,null,null,null,"N",null,null,"Pour tous joueurs sans symbole sur la carte de classification"]

{"sheet":"ORLEANS finale","index":87,"n_rows":32,"n_cols":29,"rows_kept":32,"cut":false,"hidden":false,"merged":[[30,15,30,17],[31,15,31,17],[27,0,27,4],[27,15,27,17],[28,0,28,4],[28,15,28,29],[29,0,29,4],[29,15,29,17],[22,15,22,17],[22,18,22,21],[23,15,23,29],[24,15,24,17],[25,15,25,17],[26,0,26,4],[26,15,26,17],[14,26,14,27],[14,28,14,29],[15,15,15,29],[16,15,18,17],[16,18,18,21],[19,15,21,17],[19,18,21,21],[11,25,14,25],[11,26,11,27],[11,28,11,29],[12,18,14,19],[12,20,12,21],[12,26,12,27],[12,28,12,29],[13,20,13,21],[13,26,13,27],[13,28,13,29],[11,15,14,17],[11,18,11,19],[11,20,11,21],[11,22,14,22],[11,23,14,23],[11,24,14,24],[14,20,14,21],[9,25,10,25],[9,26,9,27],[9,28,9,29],[10,20,10,21],[10,26,10,27],[10,28,10,29],[9,24,10,24],[9,15,10,17],[9,18,10,19],[9,20,9,21],[9,22,10,22],[9,23,10,23],[7,23,8,23],[5,24,6,24],[5,26,5,27],[5,28,6,29],[6,20,6,21],[6,26,6,27],[5,23,6,23],[7,24,8,24],[7,26,7,27],[7,28,7,29],[8,20,8,21],[8,26,8,27],[8,28,8,29],[5,15,6,17],[5,18,6,19],[5,20,5,21],[5,22,6,22],[7,15,8,17],[7,18,8,19],[7,20,7,21],[7,22,8,22],[0,15,0,29],[1,0,2,0],[1,1,2,3],[1,9,1,13],[1,22,3,22],[1,23,3,23],[1,24,3,24],[1,25,3,25],[1,26,3,27],[1,28,3,29],[2,9,2,13]]}
["ORLEANS finale",null,null,null,null,null,null,null,null,null,null,null,null,null,null,"Saison 2023-2024"]
[null,"Joueur(es) participant à la rencontre",null,null,null,null,null,null,null,"Saisir votre liste complète en MAJUSCULES ",null,null,null,null,null,null,null,null,null,null,null,null,"Carte Verte","Carte Jaune","Carte Rose","Carte Bleue","5,0 Val",null,"Non Sélectionnables en EDF (hors Fidet)"]
[null,null,null,null,null,null,null,null,null,"Joueurs(es) qualifié(es) saison 2023 -2024",null,null,null,null,null,null,null,null,"Avec une date de validité"]
[]
["Statuts","Classif.","          Noms      /    Prénoms",null,"Numéros","ET","VALIDE",null,null,"Statuts","Classif.","          Noms      /    Prénoms",null,"Numéros"]
[null,null,null,null,null,{"$f":"IF(A6=\"ET\",1,\"\")","v":""},{"$f":"IF(B6=5,1,\"\")","v":""},null,null,"N",5,"ROCHON","B",4,null,"Elite Nationale Bastide Médical",null,null,14.5,null,"Maxi 17,5 pts",null,"+  1 ","+  2","+  1,5",null,"1 sur la feuille",null,"Pas de limite"]
[null,null,null,null,null,{"$f":"IF(A7=\"ET\",1,\"\")","v":""},{"$f":"IF(B7=5,1,\"\")","v":""},null,null,null,null,null,null,5,null,null,null,null,null,null,"si cartes de couleurs",null,null,null,null,null,"et terrain"]
[null,null,null,null,null,{"$f":"IF(A8=\"ET\",1,\"\")","v":""},{"$f":"IF(B8=5,1,\"\")","v":""},null,null,"ET",1.5,"NSEGBE","LC",6,null," Nationale 1",null,null,14.5,null,"Maxi 17,5 pts",null,"+  1 ,5","+  2,5","+  1,5",null,"1 sur la feuille",null,"4  Maxi / terrain     "]
[null,null,null,null,null,"","",null,null,"N",2,"HAYAN","M",7,null,null,null,null,null,null,"si cartes de couleurs",null,null,null,null,null,"et terrain",null," (5 sur la feuille)"]
[null,null,null,null,null,"","",null,null,"N",1.5,"ENG","V",8,null," Nationale 2",null,null,15,null,"Maxi 19 pts",null,"+  1,5","+  2,5","+  1,5","+  0,5","2 sur la feuille",null,"4  Maxi / terrain     "]
[null,null,null,null,null,"","",null,null,"N",2,"RAJOHNSON","T",9,null,null,null,null,null,null,"si cartes de couleurs",null,null,null,null,null,"2 sur le terrain",null," (5 sur la feuille)"]
[null,null,null,null,null,"","",null,null,"N",5,"RIDOR","J",10,null," Nationale 3",null,null,15.5,null,null,null,"+  1,5","+  2,5","+  1,5","+  0,5"]
[null,null,null,null,null,"","",null,null,"J",4,"FAVART","L",11,null,null,null,null,"Si 16pts début match-handicap de 10pts",null,"Maxi 19 pts",null,null,null,null,null,"2 sur la feuille",null,"4 Maxi / terrain"]
[null,null,null,null,null,"","",null,null,null,null,null,null,12,null,null,null,null,null,null,"si cartes de couleurs",null,null,null,null,null,"2 sur le terrain",null," (5 sur la feuille)"]
[null,null,null,null,null,"","",null,null,"N",4.5,"MURIENTE","E",13]
[null,null,null,null,null,"","",null,null,"N",4,"MASRANE","S",14,null,"Inscrire dans la colonne de gauche les \"Statuts\" des joueurs de l'équipe"]
[null,null,null,null,null,"","","",null,"N",2,"LEBRETON","F",15,null,"J",null,null,"Pour les cartes Vertes",null,null,null,"Jeune joueur (U19 en Elite Nationale Bastide Médical)"]
[null,null,null,null,null,"","","",null,null,null,null,null,16,null,null,null,null,null,null,null,null,"Joueur débutant, sélectionnable en Equipe de France"]
[null,null,null,null,null,"","","",null,null,null,null,null,17,null,null,null,null,null,null,null,null,"seulement (attention à la date de validité juqu'à 22 ans révolu)"]
[null,null,null,null,null,"","",null,null,null,null,null,null,18,null,"JF",null,null,"Pour les cartes Jaunes",null,null,null,"Jeune joueuse (U19 en Elite Nationale Bastide Médical)"]
[null,null,null,null,null,"","","",null,null,null,null,null,19,null,null,null,null,null,null,null,null,"Joueuse débutante, sélectionnable en Equipe de France"]
[null,null,null,null,null,"","",null,null,null,null,null,null,20,null,null,null,null,null,null,null,null,"seulement (attention à la date de validité juqu' à 22 ans révolu)"]
[null,null,null,null,null,"","",null,null,null,null,null,null,null,null,"F ou FET",null,null,"Pour les cartes roses",null,null,null,"Pour les femmes ou femmes étrangères <5pts  (Bonus 1,5 pts)"]
[null,null,null,null,null,"","",null,null,null,null,null,null,null,null,"En Nationale 2 et 3 uniquement (joueuses et joueurs de plus de 55 ans)"]
[null,null,null,null,null,"","",null,null,null,null,null,null,null,null,"S",null,null,"Pour les hommes séniors",null,null,null," Français ou Etrangers (Bonus de 0,5pt)"]
[null,null,null,null,null,null,null,null,null,null,null,null,null,null,null,"FS",null,null,"   Pour les femmes seniors",null,null,null," (Bonus 2pts)      "]
[" Joueurs-joueuses valides de l'équipe (5 points)",null,null,null,null,null,null,null,null,null,null,null,null,null,null,"JS",null,null," Pour les jeunes hommes séniors",null,null,null," Débutants  (Bonus 2pts)  validité (<3pts 2ans)       ( > 3pts 1 an)"]
[{"$f":"IF(G31=0,\"\",IF(G31>2,\"Trop de valides sur le terrain\",\"OK\"))","v":""},null,null,null,null,null,null,null,null,null,null,null,null,null,null,"JFS",null,null," Pour les jeunes femmes séniors",null,null,null," Débutantes  (Bonus 3pts)  validité (<3pts 2ans)     ( > 3pts 1 an)"]
["Joueurs étrangers ",null,null,null,null,null,null,null,null,null,null,null,null,null,null,"Autres possibilités (sans Bonus)"]
[{"$f":"IF(F31=0,\"\",IF(F31>5,\"Trop de joueurs étrangers sur la feuille\",\"OK\"))","v":""},null,null,null,null,null,null,null,null,null,null,null,null,null,null,"ET",null,null,"Pour un joueur étranger"]
[null,null,null,null,null,{"$f":"SUM(F6:F28)","v":0},{"$f":"SUM(G6:G30)","v":0},null,null,null,null,null,null,null,null,"FID",null,null,"Pour un joueur fidèle"]
[null,null,null,null,null,null,null,null,null,null,null,null,null,null,null,"N",null,null,"Pour tous joueurs sans symbole sur la carte de classification"]

{"sheet":"STRASBOURG finale","index":88,"n_rows":32,"n_cols":29,"rows_kept":32,"cut":false,"hidden":false,"merged":[[30,15,30,17],[31,15,31,17],[27,0,27,4],[27,15,27,17],[28,0,28,4],[28,15,28,29],[29,0,29,4],[29,15,29,17],[22,15,22,17],[22,18,22,21],[23,15,23,29],[24,15,24,17],[25,15,25,17],[26,0,26,4],[26,15,26,17],[14,26,14,27],[14,28,14,29],[15,15,15,29],[16,15,18,17],[16,18,18,21],[19,15,21,17],[19,18,21,21],[11,25,14,25],[11,26,11,27],[11,28,11,29],[12,18,14,19],[12,20,12,21],[12,26,12,27],[12,28,12,29],[13,20,13,21],[13,26,13,27],[13,28,13,29],[11,15,14,17],[11,18,11,19],[11,20,11,21],[11,22,14,22],[11,23,14,23],[11,24,14,24],[14,20,14,21],[9,25,10,25],[9,26,9,27],[9,28,9,29],[10,20,10,21],[10,26,10,27],[10,28,10,29],[9,24,10,24],[9,15,10,17],[9,18,10,19],[9,20,9,21],[9,22,10,22],[9,23,10,23],[7,23,8,23],[5,24,6,24],[5,26,5,27],[5,28,6,29],[6,20,6,21],[6,26,6,27],[5,23,6,23],[7,24,8,24],[7,26,7,27],[7,28,7,29],[8,20,8,21],[8,26,8,27],[8,28,8,29],[5,15,6,17],[5,18,6,19],[5,20,5,21],[5,22,6,22],[7,15,8,17],[7,18,8,19],[7,20,7,21],[7,22,8,22],[0,15,0,29],[1,0,2,0],[1,1,2,3],[1,9,1,13],[1,22,3,22],[1,23,3,23],[1,24,3,24],[1,25,3,25],[1,26,3,27],[1,28,3,29],[2,9,2,13]]}
["STRASBOURG finale",null,null,null,null,null,null,null,null,null,null,null,null,null,null,"Saison 2023-2024"]
[null,"Joueur(es) participant à la rencontre",null,null,null,null,null,null,null,"Saisir votre liste complète en MAJUSCULES ",null,null,null,null,null,null,null,null,null,null,null,null,"Carte Verte","Carte Jaune","Carte Rose","Carte Bleue","5,0 Val",null,"Non Sélectionnables en EDF (hors Fidet)"]
[null,null,null,null,null,null,null,null,null,"Joueurs(es) qualifié(es) saison 2023 -2024",null,null,null,null,null,null,null,null,"Avec une date de validité"]
[]
["Statuts","Classif.","          Noms      /    Prénoms",null,"Numéros","ET","VALID","",null,"Statuts","Classif.","          Noms      /    Prénoms",null,"Numéros"]
["F",3,"SHITTU","H",3,{"$f":"IF(A6=\"ET\",1,\"\")","v":""},{"$f":"IF(B6=5,1,\"\")","v":""},"",null,"F",3,"SHITTU","H",3,null,"Elite Nationale Bastide Médical",null,null,14.5,null,"Maxi 17,5 pts",null,"+  1 ","+  2","+  1,5",null,"1 sur la feuille",null,"Pas de limite"]
["FID",3,"LUKUMAN","I",7,{"$f":"IF(A7=\"ET\",1,\"\")","v":""},{"$f":"IF(B7=5,1,\"\")","v":""},null,null,null,null,null,null,5,null,null,null,null,null,null,"si cartes de couleurs",null,null,null,null,null,"et terrain"]
["N",1,"VINCENTI","G",11,{"$f":"IF(A8=\"ET\",1,\"\")","v":""},"","",null,null,null,null,null,6,null," Nationale 1",null,null,14.5,null,"Maxi 17,5 pts",null,"+  1 ,5","+  2,5","+  1,5",null,"1 sur la feuille",null,"4  Maxi / terrain     "]
["N",1.5,"ERBS","JF",12,"","",null,null,"FID",3,"LUKUMAN","I",7,null,null,null,null,null,null,"si cartes de couleurs",null,null,null,null,null,"et terrain",null," (5 sur la feuille)"]
["ET",3,"DIENG","A",13,1,"","",null,null,null,null,null,8,null," Nationale 2",null,null,15,null,"Maxi 19 pts",null,"+  1,5","+  2,5","+  1,5","+  0,5","2 sur la feuille",null,"4  Maxi / terrain     "]
["FID",1.5,"KRIBECH","H",15,"","","",null,null,null,null,null,9,null,null,null,null,null,null,"si cartes de couleurs",null,null,null,null,null,"2 sur le terrain",null," (5 sur la feuille)"]
["J",4.5,"HOFFBECK","M",24,"","","",null,null,null,null,null,10,null," Nationale 3",null,null,15.5,null,null,null,"+  1,5","+  2,5","+  1,5","+  0,5"]
["FID",2,"AFITI","M",44,"","","",null,"N",1,"VINCENTI","G",11,null,null,null,null,"Si 16pts début match-handicap de 10pts",null,"Maxi 19 pts",null,null,null,null,null,"2 sur la feuille",null,"4 Maxi / terrain"]
["S",2.5,"BENETAS","F",67,"","","",null,"N",1.5,"ERBS","JF",12,null,null,null,null,null,null,"si cartes de couleurs",null,null,null,null,null,"2 sur le terrain",null," (5 sur la feuille)"]
["N",2.5,"DUCHENE","F",69,"","","",null,"ET",3,"DIENG","A",13]
[null,null,null,null,null,"","","",null,"FID",1.5,"KRIBECH","H",15,null,"Inscrire dans la colonne de gauche les \"Statuts\" des joueurs de l'équipe"]
[null,null,null,null,null,"","","",null,"J",4.5,"HOFFBECK","M",24,null,"J",null,null,"Pour les cartes Vertes",null,null,null,"Jeune joueur (U19 en Elite Nationale Bastide Médical)"]
[null,null,null,null,null,"","","",null,"ET",2,"AFITI","M",44,null,null,null,null,null,null,null,null,"Joueur débutant, sélectionnable en Equipe de France"]
[null,null,null,null,null,"","","",null,"S",2.5,"BENETAS","F",67,null,null,null,null,null,null,null,null,"seulement (attention à la date de validité juqu'à 22 ans révolu)"]
[null,null,null,null,null,"","",null,null,"N",2.5,"DUCHENE","F",69,null,"JF",null,null,"Pour les cartes Jaunes",null,null,null,"Jeune joueuse (U19 en Elite Nationale Bastide Médical)"]
[null,null,null,null,null,"","","",null,"FID",3,"SOLTYKHANOV","A",95,null,null,null,null,null,null,null,null,"Joueuse débutante, sélectionnable en Equipe de France"]
[null,null,null,null,null,"","",null,null,null,null,null,null,null,null,null,null,null,null,null,null,null,"seulement (attention à la date de validité juqu' à 22 ans révolu)"]
[null,null,null,null,null,"","",null,null,null,null,null,null,null,null,"F ou FET",null,null,"Pour les cartes roses",null,null,null,"Pour les femmes ou femmes étrangères <5pts  (Bonus 1,5 pts)"]
[null,null,null,null,null,"","",null,null,null,null,null,null,null,null,"En Nationale 2 et 3 uniquement (joueuses et joueurs de plus de 55 ans)"]
[null,null,null,null,null,"","",null,null,null,null,null,null,null,null,"S",null,null,"Pour les hommes séniors",null,null,null," Français ou Etrangers (Bonus de 0,5pt)"]
[null,null,null,null,null,null,null,null,null,null,null,null,null,null,null,"FS",null,null,"   Pour les femmes seniors",null,null,null," (Bonus 2pts)      "]
[" Joueurs-joueuses valides de l'équipe (5 points)",null,null,null,null,null,null,null,null,null,null,null,null,null,null,"JS",null,null," Pour les jeunes hommes séniors",null,null,null," Débutants  (Bonus 2pts)  validité (<3pts 2ans)       ( > 3pts 1 an)"]
[{"$f":"IF($G$31=0,\"\",IF($G$31>2,\"Trop de valides sur le terrain\",\"OK\"))","v":""},null,null,null,null,null,null,null,null,null,null,null,null,null,null,"JFS",null,null," Pour les jeunes femmes séniors",null,null,null," Débutantes  (Bonus 3pts)  validité (<3pts 2ans)     ( > 3pts 1 an)"]
["Joueurs étrangers ",null,null,null,null,null,null,null,null,null,null,null,null,null,null,"Autres possibilités (sans Bonus)"]
[{"$f":"IF($F$31=0,\"\",IF($F$31>5,\"Trop de joueurs étrangers sur la feuille\",\"OK\"))","v":"OK"},null,null,null,null,null,null,null,null,null,null,null,null,null,null,"ET",null,null,"Pour un joueur étranger"]
[null,null,null,null,null,{"$f":"SUM(F6:F25)","v":1},{"$f":"SUM(G6:G25)","v":0},null,null,null,null,null,null,null,null,"FID",null,null,"Pour un joueur fidèle"]
[null,null,null,null,null,null,null,null,null,null,null,null,null,null,null,"N",null,null,"Pour tous joueurs sans symbole sur la carte de classification"]

{"sheet":"GUILHERAND","index":89,"n_rows":32,"n_cols":29,"rows_kept":32,"cut":false,"hidden":false,"merged":[[31,15,31,17],[24,15,24,17],[25,15,25,17],[26,15,26,17],[28,15,28,29],[30,15,30,17],[27,15,27,17],[29,15,29,17],[22,18,22,21],[23,15,23,29],[16,15,18,17],[16,18,18,21],[22,15,22,17],[15,15,15,29],[19,15,21,17],[19,18,21,21],[11,15,14,17],[11,18,11,19],[11,22,14,22],[12,18,14,19],[12,20,12,21],[12,26,12,27],[13,20,13,21],[13,26,13,27],[11,23,14,23],[11,24,14,24],[11,25,14,25],[11,28,11,29],[12,28,12,29],[5,20,5,21],[5,26,5,27],[14,20,14,21],[14,26,14,27],[14,28,14,29],[11,20,11,21],[11,26,11,27],[9,22,10,22],[9,23,10,23],[9,24,10,24],[9,25,10,25],[10,20,10,21],[9,20,9,21],[9,28,9,29],[10,28,10,29],[5,22,6,22],[1,0,2,0],[1,1,2,3],[1,9,1,13],[29,0,29,4],[26,0,26,4],[27,0,27,4],[28,0,28,4],[2,9,2,13],[7,15,8,17],[7,18,8,19],[7,22,8,22],[13,28,13,29],[9,26,9,27],[10,26,10,27],[5,23,6,23],[5,24,6,24],[1,28,3,29],[7,23,8,23],[7,24,8,24],[1,25,3,25],[1,26,3,27],[5,28,6,29],[5,15,6,17],[9,15,10,17],[9,18,10,19],[0,15,0,29],[1,22,3,22],[1,23,3,23],[7,28,7,29],[8,28,8,29],[6,20,6,21],[6,26,6,27],[7,20,7,21],[7,26,7,27],[8,20,8,21],[8,26,8,27],[1,24,3,24],[5,18,6,19]]}
["GUILHERAND",null,null,null,null,null,null,null,null,null,null,null,null,null,null,"Saison 2023-2024"]
[null,"Joueur(es) participant à la rencontre",null,null,null,null,null,null,null,"Saisir votre liste complète en MAJUSCULES ",null,null,null,null,null,null,null,null,null,null,null,null,"Carte Verte","Carte Jaune","Carte Rose","Carte Bleue","5,0 Val",null,"Non Sélectionnables en EDF (hors Fidet)"]
[null,null,null,null,null,null,null,null,null,"Joueurs(es) qualifié(es) saison 2023 -2024",null,null,null,null,null,null,null,null,"Avec une date de validité"]
[]
["Statuts","Classif.","          Noms      /    Prénoms",null,"Numéros","ET","VALID","",null,"Statuts","Classif.","          Noms      /    Prénoms",null,"Numéros"]
[null,null,null,null,null,{"$f":"IF(A6=\"ET\",1,\"\")","v":""},{"$f":"IF(B6=5,1,\"\")","v":""},"",null,null,null,null,null,4,null,"Elite Nationale Bastide Médical",null,null,14.5,null,"Maxi 17,5 pts",null,"+  1 ","+  2","+  1,5",null,"1 sur la feuille",null,"Pas de limite"]
[null,null,null,null,null,{"$f":"IF(A7=\"ET\",1,\"\")","v":""},{"$f":"IF(B7=5,1,\"\")","v":""},null,null,"J",2.5,"BANC","D",5,null,null,null,null,null,null,"si cartes de couleurs",null,null,null,null,null,"et terrain"]
[null,null,null,null,null,{"$f":"IF(A8=\"ET\",1,\"\")","v":""},{"$f":"IF(B8=5,1,\"\")","v":""},"",null,"N",3,"DWORACZECK","M",6,null," Nationale 1",null,null,14.5,null,"Maxi 17,5 pts",null,"+  1 ,5","+  2,5","+  1,5",null,"1 sur la feuille",null,"4  Maxi / terrain     "]
[null,null,null,null,null,"","",null,null,"N",4.5,"NOHERIE","R",7,null,null,null,null,null,null,"si cartes de couleurs",null,null,null,null,null,"et terrain",null," (5 sur la feuille)"]
[null,null,null,null,null,"","","",null,"F",4.5,"BROCOT","N",8,null," Nationale 2",null,null,15,null,"Maxi 19 pts",null,"+  1,5","+  2,5","+  1,5","+  0,5","2 sur la feuille",null,"4  Maxi / terrain     "]
[null,null,null,null,null,"","","",null,null,null,null,null,9,null,null,null,null,null,null,"si cartes de couleurs",null,null,null,null,null,"2 sur le terrain",null," (5 sur la feuille)"]
[null,null,null,null,null,"","","",null,"S",3,"KAFI","S",10,null," Nationale 3",null,null,15.5,null,null,null,"+  1,5","+  2,5","+  1,5","+  0,5"]
[null,null,null,null,null,"","","",null,null,null,null,null,11,null,null,null,null,"Si 16pts début match-handicap de 10pts",null,"Maxi 19 pts",null,null,null,null,null,"2 sur la feuille",null,"4 Maxi / terrain"]
[null,null,null,null,null,"","","",null,null,null,null,null,12,null,null,null,null,null,null,"si cartes de couleurs",null,null,null,null,null,"2 sur le terrain",null," (5 sur la feuille)"]
[null,null,null,null,null,"","","",null,null,null,null,null,13]
[null,null,null,null,null,"","","",null,"N",4,"JAUZIN","C",14,null,"Inscrire dans la colonne de gauche les \"Statuts\" des joueurs de l'équipe"]
[null,null,null,null,null,"","","",null,"N",1,"LECROS","M",15,null,"J",null,null,"Pour les cartes Vertes",null,null,null,"Jeune joueur (U19 en Elite Nationale Bastide Médical)"]
[null,null,null,null,null,"","","",null,null,null,null,null,null,null,null,null,null,null,null,null,null,"Joueur débutant, sélectionnable en Equipe de France"]
[null,null,null,null,null,"","","",null,null,null,null,null,null,null,null,null,null,null,null,null,null,"seulement (attention à la date de validité juqu'à 22 ans révolu)"]
[null,null,null,null,null,"","",null,null,null,null,null,null,null,null,"JF",null,null,"Pour les cartes Jaunes",null,null,null,"Jeune joueuse (U19 en Elite Nationale Bastide Médical)"]
[null,null,null,null,null,"","","",null,null,null,null,null,null,null,null,null,null,null,null,null,null,"Joueuse débutante, sélectionnable en Equipe de France"]
[null,null,null,null,null,"","",null,null,null,null,null,null,null,null,null,null,null,null,null,null,null,"seulement (attention à la date de validité juqu' à 22 ans révolu)"]
[null,null,null,null,null,"","",null,null,null,null,null,null,null,null,"F ou FET",null,null,"Pour les cartes roses",null,null,null,"Pour les femmes ou femmes étrangères <5pts  (Bonus 1,5 pts)"]
[null,null,null,null,null,"","",null,null,null,null,null,null,null,null,"En Nationale 2 et 3 uniquement (joueuses et joueurs de plus de 55 ans)"]
[null,null,null,null,null,"","",null,null,null,null,null,null,null,null,"S",null,null,"Pour les hommes séniors",null,null,null," Français ou Etrangers (Bonus de 0,5pt)"]
[null,null,null,null,null,"","",null,null,null,null,null,null,null,null,"FS",null,null,"   Pour les femmes seniors",null,null,null," (Bonus 2pts)      "]
[" Joueurs-joueuses valides de l'équipe (5 points)",null,null,null,null,"","",null,null,null,null,null,null,null,null,"JS",null,null," Pour les jeunes hommes séniors",null,null,null," Débutants  (Bonus 2pts)  validité (<3pts 2ans)       ( > 3pts 1 an)"]
[{"$f":"IF($G$31=0,\"\",IF($G$31>2,\"Trop de valides sur le terrain\",\"OK\"))","v":""},null,null,null,null,"","",null,null,null,null,null,null,null,null,"JFS",null,null," Pour les jeunes femmes séniors",null,null,null," Débutantes  (Bonus 3pts)  validité (<3pts 2ans)     ( > 3pts 1 an)"]
["Joueurs étrangers ",null,null,null,null,"","",null,null,null,null,null,null,null,null,"Autres possibilités (sans Bonus)"]
[{"$f":"IF(F31=0,\"\",IF(F31>5,\"Trop de joueurs étrangers sur la feuille\",\"OK\"))","v":""},null,null,null,null,"","",null,null,null,null,null,null,null,null,"ET",null,null,"Pour un joueur étranger"]
[null,null,null,null,null,{"$f":"SUM(F6:F28)","v":0},{"$f":"SUM(G6:G28)","v":0},null,null,null,null,null,null,null,null,"FID",null,null,"Pour un joueur fidèle"]
[null,null,null,null,null,null,null,null,null,null,null,null,null,null,null,"N",null,null,"Pour tous joueurs sans symbole sur la carte de classification"]